cloudstack-dev mailing list archives

Site index · List index
Message view « Date » · « Thread »
Top « Date » · « Thread »
From jenk...@cloudstack.org
Subject Build failed in Jenkins: build-4.5 #224
Date Thu, 11 Dec 2014 19:59:01 GMT
See <http://jenkins.buildacloud.org/job/build-4.5/224/changes>

Changes:

[min.chen] CLOUDSTACK-8061: Extracting volume when it is in migrating state causes

------------------------------------------
[...truncated 6012 lines...]
[INFO] ------------------------------------------------------------------------
[INFO] 
[INFO] --- maven-clean-plugin:2.5:clean (default-clean) @ cloud-plugin-storage-image-sample
---
[INFO] Deleting <http://jenkins.buildacloud.org/job/build-4.5/ws/plugins/storage/image/sample/target>
(includes = [**/*], excludes = [])
[INFO] Deleting <http://jenkins.buildacloud.org/job/build-4.5/ws/plugins/storage/image/sample>
(includes = [target, dist], excludes = [])
[INFO] 
[INFO] --- maven-checkstyle-plugin:2.11:check (cloudstack-checkstyle) @ cloud-plugin-storage-image-sample
---
[INFO] 
[INFO] --- maven-surefire-plugin:2.12:test (default-test) @ cloud-plugin-hypervisor-xenserver
---
[INFO] Surefire report directory: <http://jenkins.buildacloud.org/job/build-4.5/ws/plugins/hypervisors/xenserver/target/surefire-reports>

-------------------------------------------------------
 T E S T S
-------------------------------------------------------
[INFO] Starting audit...
Audit done.

[INFO] 
[INFO] --- maven-remote-resources-plugin:1.3:process (default) @ cloud-plugin-storage-image-sample
---
[INFO] 
[INFO] --- maven-resources-plugin:2.5:testResources (default-testResources) @ cloud-plugin-storage-image-s3
---
[debug] execute contextualize
[INFO] Using 'UTF-8' encoding to copy filtered resources.
[INFO] skip non existing resourceDirectory <http://jenkins.buildacloud.org/job/build-4.5/ws/plugins/storage/image/s3/test/resources>
[INFO] Copying 3 resources
[INFO] 
[INFO] --- maven-compiler-plugin:2.5.1:testCompile (default-testCompile) @ cloud-plugin-storage-image-s3
---
[INFO] No sources to compile
[INFO] 
[INFO] --- maven-surefire-plugin:2.12:test (default-test) @ cloud-plugin-storage-image-s3
---
[INFO] Surefire report directory: <http://jenkins.buildacloud.org/job/build-4.5/ws/plugins/storage/image/s3/target/surefire-reports>

-------------------------------------------------------
 T E S T S
-------------------------------------------------------
[INFO] 
[INFO] --- maven-resources-plugin:2.5:testResources (default-testResources) @ cloud-plugin-storage-volume-solidfire
---
[debug] execute contextualize
[INFO] Using 'UTF-8' encoding to copy filtered resources.
[INFO] skip non existing resourceDirectory <http://jenkins.buildacloud.org/job/build-4.5/ws/plugins/storage/volume/solidfire/test/resources>
[INFO] Copying 3 resources
[INFO] 
[INFO] --- maven-compiler-plugin:2.5.1:testCompile (default-testCompile) @ cloud-plugin-storage-volume-solidfire
---
[INFO] Compiling 4 source files to <http://jenkins.buildacloud.org/job/build-4.5/ws/plugins/storage/volume/solidfire/target/test-classes>
[INFO] 
[INFO] --- maven-resources-plugin:2.5:testResources (default-testResources) @ cloud-plugin-storage-image-swift
---
[debug] execute contextualize
[INFO] Using 'UTF-8' encoding to copy filtered resources.
[INFO] skip non existing resourceDirectory <http://jenkins.buildacloud.org/job/build-4.5/ws/plugins/storage/image/swift/test/resources>
[INFO] Copying 3 resources
[INFO] 
[INFO] --- maven-compiler-plugin:2.5.1:testCompile (default-testCompile) @ cloud-plugin-storage-image-swift
---
[INFO] No sources to compile
[INFO] 
[INFO] --- maven-surefire-plugin:2.12:test (default-test) @ cloud-plugin-storage-image-swift
---
[INFO] Tests are skipped.
Running com.cloud.hypervisor.xenserver.resource.CitrixResourceBaseTest
[INFO] 
[INFO] --- license-maven-plugin:2.5:check (cloudstack-checklicence) @ cloud-plugin-storage-volume-cloudbyte
---
[INFO] Checking licenses...
[INFO] 
[INFO] --- maven-resources-plugin:2.5:testResources (default-testResources) @ cloud-plugin-storage-volume-cloudbyte
---
[debug] execute contextualize
[INFO] Using 'UTF-8' encoding to copy filtered resources.
[INFO] skip non existing resourceDirectory <http://jenkins.buildacloud.org/job/build-4.5/ws/plugins/storage/volume/cloudbyte/test/resources>
[INFO] Copying 3 resources
[INFO] 
[INFO] --- maven-compiler-plugin:2.5.1:testCompile (default-testCompile) @ cloud-plugin-storage-volume-cloudbyte
---
[INFO] No sources to compile
[INFO] 
[INFO] --- maven-surefire-plugin:2.12:test (default-test) @ cloud-plugin-storage-volume-cloudbyte
---
[INFO] Tests are skipped.
[INFO] 
[INFO] --- maven-resources-plugin:2.5:resources (default-resources) @ cloud-plugin-storage-image-sample
---
[debug] execute contextualize
[INFO] Using 'UTF-8' encoding to copy filtered resources.
[INFO] skip non existing resourceDirectory <http://jenkins.buildacloud.org/job/build-4.5/ws/plugins/storage/image/sample/resources>
[INFO] Copying 3 resources
[INFO] 
[INFO] --- maven-compiler-plugin:2.5.1:compile (default-compile) @ cloud-plugin-storage-image-sample
---
[INFO] Compiling 3 source files to <http://jenkins.buildacloud.org/job/build-4.5/ws/plugins/storage/image/sample/target/classes>

Results :

Tests run: 0, Failures: 0, Errors: 0, Skipped: 0

log4j:WARN No appenders could be found for logger (com.cloud.hypervisor.xenserver.resource.XenServerConnectionPool).
log4j:WARN Please initialize the log4j system properly.
log4j:WARN See http://logging.apache.org/log4j/1.2/faq.html#noconfig for more info.
[INFO] 
[INFO] --- maven-resources-plugin:2.5:testResources (default-testResources) @ cloud-plugin-storage-image-default
---
[debug] execute contextualize
[INFO] Using 'UTF-8' encoding to copy filtered resources.
[INFO] skip non existing resourceDirectory <http://jenkins.buildacloud.org/job/build-4.5/ws/plugins/storage/image/default/test/resources>
[INFO] Copying 3 resources
[INFO] 
[INFO] --- maven-compiler-plugin:2.5.1:testCompile (default-testCompile) @ cloud-plugin-storage-image-default
---
[INFO] No sources to compile
[INFO] 
[INFO] --- maven-surefire-plugin:2.12:test (default-test) @ cloud-plugin-storage-image-default
---
[INFO] Tests are skipped.
Tests run: 4, Failures: 0, Errors: 0, Skipped: 0, Time elapsed: 6.38 sec
Running com.cloud.ha.XenServerFencerTest
Tests run: 1, Failures: 0, Errors: 0, Skipped: 0, Time elapsed: 0.042 sec

Results :

Tests run: 5, Failures: 0, Errors: 0, Skipped: 0

[INFO]                                                                         
[INFO] ------------------------------------------------------------------------
[INFO] Building Apache CloudStack Plugin - Network Juniper Contrail 4.5.0-SNAPSHOT
[INFO] ------------------------------------------------------------------------
[WARNING] The POM for net.juniper.contrail:juniper-contrail-api:jar:1.0-SNAPSHOT is missing,
no dependency information available
[INFO] 
[INFO] --- maven-surefire-plugin:2.12:test (default-test) @ cloud-plugin-storage-volume-solidfire
---
[INFO] Tests are skipped.
[INFO] 
[INFO] --- maven-resources-plugin:2.5:testResources (default-testResources) @ cloud-plugin-storage-image-sample
---
[debug] execute contextualize
[INFO] Using 'UTF-8' encoding to copy filtered resources.
[INFO] skip non existing resourceDirectory <http://jenkins.buildacloud.org/job/build-4.5/ws/plugins/storage/image/sample/test/resources>
[INFO] Copying 3 resources
[INFO] 
[INFO] --- maven-compiler-plugin:2.5.1:testCompile (default-testCompile) @ cloud-plugin-storage-image-sample
---
[INFO] No sources to compile
[INFO] 
[INFO] --- maven-surefire-plugin:2.12:test (default-test) @ cloud-plugin-storage-image-sample
---
[INFO] Tests are skipped.
[INFO] ------------------------------------------------------------------------
[INFO] Reactor Summary:
[INFO] 
[INFO] Apache CloudStack Developer Tools - Checkstyle Configuration  SUCCESS [1.242s]
[INFO] Apache CloudStack ................................. SUCCESS [1.414s]
[INFO] Apache CloudStack Maven Conventions Parent ........ SUCCESS [3.168s]
[INFO] Apache CloudStack Framework - Managed Context ..... SUCCESS [6.916s]
[INFO] Apache CloudStack Utils ........................... SUCCESS [15.971s]
[INFO] Apache CloudStack Framework ....................... SUCCESS [0.431s]
[INFO] Apache CloudStack Framework - Event Notification .. SUCCESS [14.949s]
[INFO] Apache CloudStack Framework - Configuration ....... SUCCESS [4.393s]
[INFO] Apache CloudStack API ............................. SUCCESS [16.147s]
[INFO] Apache CloudStack Framework - REST ................ SUCCESS [10.214s]
[INFO] Apache CloudStack Framework - IPC ................. SUCCESS [7.278s]
[INFO] Apache CloudStack Cloud Engine .................... SUCCESS [0.426s]
[INFO] Apache CloudStack Cloud Engine API ................ SUCCESS [5.822s]
[INFO] Apache CloudStack Framework - Security ............ SUCCESS [3.579s]
[INFO] Apache CloudStack Core ............................ SUCCESS [16.800s]
[INFO] Apache CloudStack Agents .......................... SUCCESS [10.840s]
[INFO] Apache CloudStack Framework - Clustering .......... SUCCESS [6.643s]
[INFO] Apache CloudStack Framework - Event Notification .. SUCCESS [5.543s]
[INFO] Apache CloudStack Cloud Engine Schema Component ... SUCCESS [24.640s]
[INFO] Apache CloudStack Framework - Jobs ................ SUCCESS [7.923s]
[INFO] Apache CloudStack Cloud Engine Internal Components API  SUCCESS [3.716s]
[INFO] Apache CloudStack Server .......................... SUCCESS [52.015s]
[INFO] Apache CloudStack Usage Server .................... SUCCESS [14.434s]
[INFO] Apache CloudStack Cloud Engine Orchestration Component  SUCCESS [19.752s]
[INFO] Apache CloudStack Cloud Services .................. SUCCESS [0.415s]
[INFO] Apache CloudStack Secondary Storage ............... SUCCESS [6.611s]
[INFO] Apache CloudStack Secondary Storage Service ....... SUCCESS [19.818s]
[INFO] Apache CloudStack Engine Storage Component ........ SUCCESS [38.964s]
[INFO] Apache CloudStack Engine Storage Volume Component . SUCCESS [25.527s]
[INFO] Apache CloudStack Engine Storage Image Component .. SUCCESS [18.094s]
[INFO] Apache CloudStack Engine Storage Data Motion Component  SUCCESS [14.477s]
[INFO] Apache CloudStack Engine Storage Cache Component .. SUCCESS [15.388s]
[INFO] Apache CloudStack Engine Storage Snapshot Component  SUCCESS [40.574s]
[INFO] Apache CloudStack Cloud Engine API ................ SUCCESS [4.101s]
[INFO] Apache CloudStack Cloud Engine Service ............ SUCCESS [6.272s]
[INFO] Apache CloudStack Plugin POM ...................... SUCCESS [0.598s]
[INFO] Apache CloudStack Plugin - API Rate Limit ......... SUCCESS [32.298s]
[INFO] Apache CloudStack Plugin - Storage Volume default provider  SUCCESS [11.941s]
[INFO] Apache CloudStack Plugin - Storage Volume SolidFire Provider  SUCCESS [26.574s]
[INFO] Apache CloudStack Plugin - API SolidFire .......... SKIPPED
[INFO] Apache CloudStack Plugin - API Discovery .......... SUCCESS [21.151s]
[INFO] Apache CloudStack Plugin - ACL Static Role Based .. SUCCESS [8.632s]
[INFO] Apache CloudStack Plugin - Host Anti-Affinity Processor  SUCCESS [9.153s]
[INFO] Apache CloudStack Plugin - Explicit Dedication Processor  SUCCESS [9.338s]
[INFO] Apache CloudStack Plugin - User Concentrated Pod Deployment Planner  SUCCESS [9.479s]
[INFO] Apache CloudStack Plugin - User Dispersing Deployment Planner  SUCCESS [12.279s]
[INFO] Apache CloudStack Plugin - Implicit Dedication Planner  SUCCESS [42.240s]
[INFO] Apache CloudStack Plugin - Skip Heurestics Planner  SUCCESS [11.738s]
[INFO] Apache CloudStack Plugin - Host Allocator Random .. SUCCESS [13.539s]
[INFO] Apache CloudStack Plugin - Dedicated Resources .... SUCCESS [40.965s]
[INFO] Apache CloudStack Plugin - Hypervisor OracleVM .... SUCCESS [19.881s]
[INFO] Apache CloudStack Plugin - Open vSwitch ........... SUCCESS [21.609s]
[INFO] Apache CloudStack Plugin - Hypervisor XenServer ... SUCCESS [50.030s]
[INFO] Apache CloudStack Plugin - Hypervisor KVM ......... SUCCESS [50.389s]
[INFO] Apache CloudStack Plugin - RabbitMQ Event Bus ..... SUCCESS [14.822s]
[INFO] Apache CloudStack Plugin - In Memory Event Bus .... SUCCESS [26.531s]
[INFO] Apache CloudStack Plugin - Hypervisor Baremetal ... SUCCESS [24.903s]
[INFO] Apache CloudStack Plugin - Hypervisor UCS ......... SUCCESS [17.542s]
[INFO] Apache CloudStack Plugin - Hypervisor Hyper-V ..... SUCCESS [35.585s]
[INFO] Apache CloudStack Plugin - Network Elastic Load Balancer  SUCCESS [34.297s]
[INFO] Apache CloudStack Plugin - Network Internal Load Balancer  SUCCESS [58.122s]
[INFO] Apache CloudStack Framework - Spring Life Cycle ... SUCCESS [2.589s]
[INFO] Apache CloudStack Plugin - Network Juniper Contrail  FAILURE [0.163s]
[INFO] Apache CloudStack Plugin - Palo Alto .............. SUCCESS [46.488s]
[INFO] Apache CloudStack Plugin - Network Netscaler ...... SUCCESS [27.344s]
[INFO] Apache CloudStack Plugin - Network Nicira NVP ..... SUCCESS [53.274s]
[INFO] Apache CloudStack Plugin - BigSwitch Virtual Network Segment  SUCCESS [39.980s]
[INFO] Apache CloudStack Plugin - Network Brocade VCS .... SUCCESS [57.216s]
[INFO] Apache CloudStack Plugin - Midokura Midonet ....... SUCCESS [36.228s]
[INFO] Apache CloudStack Plugin - Stratosphere SSP ....... SUCCESS [41.661s]
[INFO] Apache CloudStack Plugin - Network Opendaylight ... SUCCESS [38.926s]
[INFO] Apache CloudStack Plugin - Storage Allocator Random  SUCCESS [12.082s]
[INFO] Apache CloudStack Plugin - User Authenticator LDAP  SUCCESS [23.256s]
[INFO] Apache CloudStack Plugin - User Authenticator MD5 . SUCCESS [26.887s]
[INFO] Apache CloudStack Plugin - User Authenticator Plain Text  SUCCESS [16.505s]
[INFO] Apache CloudStack Plugin - User Authenticator SAML2  SUCCESS [1:11.281s]
[INFO] Apache CloudStack Plugin - User Authenticator SHA256 Salted  SUCCESS [28.939s]
[INFO] Apache CloudStack Plugin - Dns Notifier Example ... SUCCESS [14.302s]
[INFO] Apache CloudStack Plugin - Storage Image S3 ....... SUCCESS [17.154s]
[INFO] Apache CloudStack Plugin - Storage Image Swift provider  SUCCESS [15.235s]
[INFO] Apache CloudStack Plugin - Storage Image default provider  SUCCESS [12.589s]
[INFO] Apache CloudStack Plugin - Storage Image sample provider  SUCCESS [11.624s]
[INFO] Apache CloudStack Plugin - Storage Volume Nexenta Provider  SUCCESS [22.542s]
[INFO] Apache CloudStack Plugin - Storage Volume CloudByte Provider  SUCCESS [19.668s]
[INFO] Apache CloudStack Plugin - Storage Volume sample provider  SUCCESS [11.639s]
[INFO] Apache CloudStack Plugin - SNMP Alerts ............ SUCCESS [28.262s]
[INFO] Apache CloudStack Plugin - Syslog Alerts .......... SUCCESS [24.078s]
[INFO] Apache CloudStack Plugin - Network VXLAN .......... SUCCESS [30.579s]
[INFO] Apache CloudStack Plugin - GloboDNS ............... SUCCESS [49.548s]
[INFO] Apache CloudStack Framework - Spring Module ....... SUCCESS [14.812s]
[INFO] Apache CloudStack Secondary Storage Controller .... SUCCESS [9.649s]
[INFO] Apache CloudStack Console Proxy - RDP Client ...... SUCCESS [18.693s]
[INFO] Apache CloudStack Console Proxy ................... SUCCESS [6.505s]
[INFO] Apache CloudStack Console Proxy - Server .......... SUCCESS [12.017s]
[INFO] Apache CloudStack System VM ....................... SUCCESS [5.075s]
[INFO] Apache CloudStack Client UI ....................... SKIPPED
[INFO] Apache CloudStack Framework - QuickCloud .......... SUCCESS [2.196s]
[INFO] Apache CloudStack AWS API Bridge .................. SKIPPED
[INFO] ------------------------------------------------------------------------
[INFO] BUILD FAILURE
[INFO] ------------------------------------------------------------------------
[INFO] Total time: 6:34.680s (Wall Clock)
[INFO] Finished at: Thu Dec 11 20:58:47 CET 2014
[INFO] Final Memory: 77M/380M
[INFO] ------------------------------------------------------------------------
[ERROR] Failed to execute goal on project cloud-plugin-network-contrail: Could not resolve
dependencies for project org.apache.cloudstack:cloud-plugin-network-contrail:jar:4.5.0-SNAPSHOT:
Failure to find net.juniper.contrail:juniper-contrail-api:jar:1.0-SNAPSHOT in http://juniper.github.io/contrail-maven/snapshots
was cached in the local repository, resolution will not be reattempted until the update interval
of juniper-contrail has elapsed or updates are forced -> [Help 1]
[ERROR] 
[ERROR] To see the full stack trace of the errors, re-run Maven with the -e switch.
[ERROR] Re-run Maven using the -X switch to enable full debug logging.
[ERROR] 
[ERROR] For more information about the errors and possible solutions, please read the following
articles:
[ERROR] [Help 1] http://cwiki.apache.org/confluence/display/MAVEN/DependencyResolutionException
[ERROR] 
[ERROR] After correcting the problems, you can resume the build with the command
[ERROR]   mvn <goals> -rf :cloud-plugin-network-contrail
Build step 'Invoke top-level Maven targets' marked build as failure
Recording test results

Mime
View raw message