cloudstack-dev mailing list archives

Site index · List index
Message view « Date » · « Thread »
Top « Date » · « Thread »
From jenk...@cloudstack.org
Subject Build failed in Jenkins: build-master-simulator #1400
Date Fri, 12 Dec 2014 09:13:50 GMT
See <http://jenkins.buildacloud.org/job/build-master-simulator/1400/changes>

Changes:

[w.zhou] CLOUDSTACK-8063: list secondary Ips information in VM response

------------------------------------------
[...truncated 17070 lines...]
2344/3102 KB   
2348/3102 KB   
2352/3102 KB   
2356/3102 KB   
2360/3102 KB   
2364/3102 KB   
2368/3102 KB   
2372/3102 KB   
2376/3102 KB   
2380/3102 KB   
2384/3102 KB   
2388/3102 KB   
2392/3102 KB   
2396/3102 KB   
2400/3102 KB   
2404/3102 KB   
2408/3102 KB   
2412/3102 KB   
2416/3102 KB   
2420/3102 KB   
2424/3102 KB   
2428/3102 KB   
2432/3102 KB   
2434/3102 KB   
2438/3102 KB   
2439/3102 KB   
2443/3102 KB   
2447/3102 KB   
2451/3102 KB   
2455/3102 KB   
2459/3102 KB   
2463/3102 KB   
2467/3102 KB   
2471/3102 KB   
2475/3102 KB   
2479/3102 KB   
2483/3102 KB   
2487/3102 KB   
2491/3102 KB   
2495/3102 KB   
2499/3102 KB   
2503/3102 KB   
2507/3102 KB   
2511/3102 KB   
2515/3102 KB   
2519/3102 KB   
2523/3102 KB   
2527/3102 KB   
2531/3102 KB   
2535/3102 KB   
2539/3102 KB   
2543/3102 KB   
2547/3102 KB   
2550/3102 KB   
2552/3102 KB   
2556/3102 KB   
2560/3102 KB   
2564/3102 KB   
2568/3102 KB   
2572/3102 KB   
2576/3102 KB   
2580/3102 KB   
2584/3102 KB   
2588/3102 KB   
2592/3102 KB   
2596/3102 KB   
2600/3102 KB   
2604/3102 KB   
2608/3102 KB   
2612/3102 KB   
2616/3102 KB   
2620/3102 KB   
2624/3102 KB   
2628/3102 KB   
2632/3102 KB   
2636/3102 KB   
2640/3102 KB   
2644/3102 KB   
2648/3102 KB   
2652/3102 KB   
2656/3102 KB   
2660/3102 KB   
2664/3102 KB   
2667/3102 KB   
2671/3102 KB   
2675/3102 KB   
2679/3102 KB   
2683/3102 KB   
2687/3102 KB   
2691/3102 KB   
2695/3102 KB   
2699/3102 KB   
2703/3102 KB   
2707/3102 KB   
2711/3102 KB   
2715/3102 KB   
2719/3102 KB   
2723/3102 KB   
2727/3102 KB   
2731/3102 KB   
2735/3102 KB   
2739/3102 KB   
2743/3102 KB   
2747/3102 KB   
2751/3102 KB   
2755/3102 KB   
2759/3102 KB   
2763/3102 KB   
2767/3102 KB   
2771/3102 KB   
2775/3102 KB   
2779/3102 KB   
2783/3102 KB   
2787/3102 KB   
2791/3102 KB   
2795/3102 KB   
2799/3102 KB   
2803/3102 KB   
2807/3102 KB   
2811/3102 KB   
2815/3102 KB   
2819/3102 KB   
2823/3102 KB   
2827/3102 KB   
2831/3102 KB   
2835/3102 KB   
2839/3102 KB   
2843/3102 KB   
2847/3102 KB   
2851/3102 KB   
2855/3102 KB   
2859/3102 KB   
2863/3102 KB   
2867/3102 KB   
2871/3102 KB   
2875/3102 KB   
2879/3102 KB   
2883/3102 KB   
2887/3102 KB   
2891/3102 KB   
2892/3102 KB   
2896/3102 KB   
2900/3102 KB   
2904/3102 KB   
2908/3102 KB   
2912/3102 KB   
2916/3102 KB   
2920/3102 KB   
2924/3102 KB   
2928/3102 KB   
2932/3102 KB   
2936/3102 KB   
2940/3102 KB   
2944/3102 KB   
2948/3102 KB   
2952/3102 KB   
2956/3102 KB   
2960/3102 KB   
2964/3102 KB   
2968/3102 KB   
2972/3102 KB   
2976/3102 KB   
2980/3102 KB   
2984/3102 KB   
2988/3102 KB   
2992/3102 KB   
2996/3102 KB   
3000/3102 KB   
3004/3102 KB   
3006/3102 KB   
3010/3102 KB   
3014/3102 KB   
3018/3102 KB   
3022/3102 KB   
3026/3102 KB   
3030/3102 KB   
3034/3102 KB   
3038/3102 KB   
3042/3102 KB   
3046/3102 KB   
3050/3102 KB   
3054/3102 KB   
3058/3102 KB   
3062/3102 KB   
3066/3102 KB   
3070/3102 KB   
3074/3102 KB   
3078/3102 KB   
3082/3102 KB   
3086/3102 KB   
3090/3102 KB   
3094/3102 KB   
3098/3102 KB   
3102/3102 KB   
               
Downloaded: http://repo.maven.apache.org/maven2/xalan/xalan/2.7.1/xalan-2.7.1.jar (3102 KB
at 5357.0 KB/sec)
[INFO] ------------------------------------------------------------------------
[INFO] Reactor Summary:
[INFO] 
[INFO] Apache CloudStack Developer Tools - Checkstyle Configuration  SUCCESS [4.666s]
[INFO] Apache CloudStack ................................. SUCCESS [3.845s]
[INFO] Apache CloudStack Maven Conventions Parent ........ SUCCESS [5.760s]
[INFO] Apache CloudStack Framework - Managed Context ..... SUCCESS [5.524s]
[INFO] Apache CloudStack Utils ........................... FAILURE [11.804s]
[INFO] Apache CloudStack Framework ....................... SKIPPED
[INFO] Apache CloudStack Framework - Event Notification .. SKIPPED
[INFO] Apache CloudStack Framework - Configuration ....... SKIPPED
[INFO] Apache CloudStack API ............................. SKIPPED
[INFO] Apache CloudStack Framework - REST ................ SKIPPED
[INFO] Apache CloudStack Framework - IPC ................. SKIPPED
[INFO] Apache CloudStack Cloud Engine .................... SKIPPED
[INFO] Apache CloudStack Cloud Engine API ................ SKIPPED
[INFO] Apache CloudStack Framework - Security ............ SKIPPED
[INFO] Apache CloudStack Core ............................ SKIPPED
[INFO] Apache CloudStack Agents .......................... SKIPPED
[INFO] Apache CloudStack Framework - Clustering .......... SKIPPED
[INFO] Apache CloudStack Framework - Event Notification .. SKIPPED
[INFO] Apache CloudStack Cloud Engine Schema Component ... SKIPPED
[INFO] Apache CloudStack Framework - Jobs ................ SKIPPED
[INFO] Apache CloudStack Cloud Engine Internal Components API  SKIPPED
[INFO] Apache CloudStack Server .......................... SKIPPED
[INFO] Apache CloudStack Cloud Services .................. SKIPPED
[INFO] Apache CloudStack Secondary Storage ............... SKIPPED
[INFO] Apache CloudStack Secondary Storage Service ....... SKIPPED
[INFO] Apache CloudStack Engine Storage Component ........ SKIPPED
[INFO] Apache CloudStack Engine Storage Volume Component . SKIPPED
[INFO] Apache CloudStack Engine Storage Image Component .. SKIPPED
[INFO] Apache CloudStack Engine Storage Snapshot Component  SKIPPED
[INFO] Apache CloudStack Plugin POM ...................... SKIPPED
[INFO] Apache CloudStack Plugin - Hypervisor Simulator ... SKIPPED
[INFO] ------------------------------------------------------------------------
[INFO] BUILD FAILURE
[INFO] ------------------------------------------------------------------------
[INFO] Total time: 34.843s
[INFO] Finished at: Fri Dec 12 10:13:40 CET 2014
[INFO] Final Memory: 47M/329M
[INFO] ------------------------------------------------------------------------
[ERROR] Failed to execute goal on project cloud-utils: Could not resolve dependencies for
project org.apache.cloudstack:cloud-utils:jar:4.6.0-SNAPSHOT: Could not find artifact aopalliance:aopalliance:jar:1.0
-> [Help 1]
[ERROR] 
[ERROR] To see the full stack trace of the errors, re-run Maven with the -e switch.
[ERROR] Re-run Maven using the -X switch to enable full debug logging.
[ERROR] 
[ERROR] For more information about the errors and possible solutions, please read the following
articles:
[ERROR] [Help 1] http://cwiki.apache.org/confluence/display/MAVEN/DependencyResolutionException
[ERROR] 
[ERROR] After correcting the problems, you can resume the build with the command
[ERROR]   mvn <goals> -rf :cloud-utils
Build step 'Invoke top-level Maven targets' marked build as failure
Recording test results

Mime
View raw message