cloudstack-dev mailing list archives

Site index · List index
Message view « Date » · « Thread »
Top « Date » · « Thread »
From jenk...@cloudstack.org
Subject Build failed in Jenkins: build-master-noredist #3908
Date Thu, 04 Dec 2014 08:22:09 GMT
See <http://jenkins.buildacloud.org/job/build-master-noredist/3908/changes>

Changes:

[sheng.yang] CLOUDSTACK-5241: Remove Rot13 usage

------------------------------------------
[...truncated 1188 lines...]
Downloaded: http://repo.maven.apache.org/maven2/org/apache/maven/reporting/maven-reporting-api/2.0.9/maven-reporting-api-2.0.9.jar
(10 KB at 186.8 KB/sec)
Downloading: http://repo.maven.apache.org/maven2/org/apache/maven/plugin-tools/maven-plugin-annotations/3.1/maven-plugin-annotations-3.1.jar
125/227 KB   102/115 KB   68/309 KB   211/257 KB              
125/227 KB   102/115 KB   68/309 KB   215/257 KB   
125/227 KB   102/115 KB   68/309 KB   219/257 KB   
125/227 KB   102/115 KB   68/309 KB   223/257 KB   
125/227 KB   102/115 KB   68/309 KB   227/257 KB   
125/227 KB   102/115 KB   68/309 KB   231/257 KB   
125/227 KB   102/115 KB   68/309 KB   235/257 KB   
125/227 KB   102/115 KB   68/309 KB   239/257 KB   
125/227 KB   102/115 KB   68/309 KB   243/257 KB   
125/227 KB   102/115 KB   68/309 KB   247/257 KB   
125/227 KB   102/115 KB   68/309 KB   251/257 KB   
125/227 KB   102/115 KB   68/309 KB   255/257 KB   
125/227 KB   102/115 KB   68/309 KB   257/257 KB   
129/227 KB   102/115 KB   68/309 KB   257/257 KB   
133/227 KB   102/115 KB   68/309 KB   257/257 KB   
137/227 KB   102/115 KB   68/309 KB   257/257 KB   
141/227 KB   102/115 KB   68/309 KB   257/257 KB   
145/227 KB   102/115 KB   68/309 KB   257/257 KB   
149/227 KB   102/115 KB   68/309 KB   257/257 KB   
153/227 KB   102/115 KB   68/309 KB   257/257 KB   
157/227 KB   102/115 KB   68/309 KB   257/257 KB   
161/227 KB   102/115 KB   68/309 KB   257/257 KB   
165/227 KB   102/115 KB   68/309 KB   257/257 KB   
169/227 KB   102/115 KB   68/309 KB   257/257 KB   
173/227 KB   102/115 KB   68/309 KB   257/257 KB   
177/227 KB   102/115 KB   68/309 KB   257/257 KB   
181/227 KB   102/115 KB   68/309 KB   257/257 KB   
185/227 KB   102/115 KB   68/309 KB   257/257 KB   
189/227 KB   102/115 KB   68/309 KB   257/257 KB   
193/227 KB   102/115 KB   68/309 KB   257/257 KB   
197/227 KB   102/115 KB   68/309 KB   257/257 KB   
201/227 KB   102/115 KB   68/309 KB   257/257 KB   
205/227 KB   102/115 KB   68/309 KB   257/257 KB   
209/227 KB   102/115 KB   68/309 KB   257/257 KB   
213/227 KB   102/115 KB   68/309 KB   257/257 KB   
217/227 KB   102/115 KB   68/309 KB   257/257 KB   
221/227 KB   102/115 KB   68/309 KB   257/257 KB   
225/227 KB   102/115 KB   68/309 KB   257/257 KB   
227/227 KB   102/115 KB   68/309 KB   257/257 KB   
227/227 KB   102/115 KB   72/309 KB   257/257 KB   
227/227 KB   102/115 KB   76/309 KB   257/257 KB   
227/227 KB   102/115 KB   80/309 KB   257/257 KB   
227/227 KB   102/115 KB   84/309 KB   257/257 KB   
227/227 KB   102/115 KB   88/309 KB   257/257 KB   
227/227 KB   102/115 KB   92/309 KB   257/257 KB   
227/227 KB   102/115 KB   96/309 KB   257/257 KB   
227/227 KB   102/115 KB   100/309 KB   257/257 KB   
227/227 KB   102/115 KB   104/309 KB   257/257 KB   
227/227 KB   102/115 KB   108/309 KB   257/257 KB   
227/227 KB   102/115 KB   112/309 KB   257/257 KB   
227/227 KB   102/115 KB   115/309 KB   257/257 KB   
227/227 KB   106/115 KB   115/309 KB   257/257 KB   
227/227 KB   110/115 KB   115/309 KB   257/257 KB   
227/227 KB   114/115 KB   115/309 KB   257/257 KB   
227/227 KB   115/115 KB   115/309 KB   257/257 KB   
227/227 KB   115/115 KB   115/309 KB   4/14 KB   257/257 KB   
227/227 KB   115/115 KB   115/309 KB   8/14 KB   257/257 KB   
                                                              
227/227 KB   115/115 KB   115/309 KB   12/14 KB               
Downloaded: http://repo.maven.apache.org/maven2/org/apache/maven/surefire/maven-surefire-common/2.12.4/maven-surefire-common-2.12.4.jar
(257 KB at 3330.8 KB/sec)
227/227 KB   115/115 KB   115/309 KB   14/14 KB   
227/227 KB   115/115 KB   119/309 KB   14/14 KB   
227/227 KB   115/115 KB   123/309 KB   14/14 KB   
227/227 KB   115/115 KB   123/309 KB   14/14 KB   
227/227 KB   115/115 KB   125/309 KB   14/14 KB   
227/227 KB   115/115 KB   129/309 KB   14/14 KB   
227/227 KB   115/115 KB   133/309 KB   14/14 KB   
227/227 KB   115/115 KB   137/309 KB   14/14 KB   
227/227 KB   115/115 KB   141/309 KB   14/14 KB   
227/227 KB   115/115 KB   145/309 KB   14/14 KB   
227/227 KB   115/115 KB   149/309 KB   14/14 KB   
227/227 KB   115/115 KB   153/309 KB   14/14 KB   
227/227 KB   115/115 KB   157/309 KB   14/14 KB   
227/227 KB   115/115 KB   161/309 KB   14/14 KB   
227/227 KB   115/115 KB   164/309 KB   14/14 KB   
                                                  
Downloaded: http://repo.maven.apache.org/maven2/org/codehaus/plexus/plexus-utils/3.0.8/plexus-utils-3.0.8.jar
(227 KB at 2727.6 KB/sec)
                                                  
Downloaded: http://repo.maven.apache.org/maven2/org/apache/maven/surefire/surefire-api/2.12.4/surefire-api-2.12.4.jar
(115 KB at 1335.2 KB/sec)
168/309 KB   14/14 KB                             
172/309 KB   14/14 KB   
176/309 KB   14/14 KB   
180/309 KB   14/14 KB   
184/309 KB   14/14 KB   
185/309 KB   14/14 KB   
                        
Downloaded: http://repo.maven.apache.org/maven2/org/apache/maven/plugin-tools/maven-plugin-annotations/3.1/maven-plugin-annotations-3.1.jar
(14 KB at 318.5 KB/sec)
189/309 KB              
193/309 KB   
197/309 KB   
201/309 KB   
205/309 KB   
209/309 KB   
213/309 KB   
217/309 KB   
221/309 KB   
225/309 KB   
229/309 KB   
233/309 KB   
237/309 KB   
241/309 KB   
243/309 KB   
247/309 KB   
251/309 KB   
255/309 KB   
259/309 KB   
263/309 KB   
267/309 KB   
271/309 KB   
275/309 KB   
277/309 KB   
281/309 KB   
285/309 KB   
289/309 KB   
293/309 KB   
297/309 KB   
301/309 KB   
303/309 KB   
306/309 KB   
309/309 KB   
             
Downloaded: http://repo.maven.apache.org/maven2/org/apache/commons/commons-lang3/3.1/commons-lang3-3.1.jar
(309 KB at 2251.1 KB/sec)
[INFO] ------------------------------------------------------------------------
[INFO] Reactor Summary:
[INFO] 
[INFO] Apache CloudStack Developer Tools - Checkstyle Configuration  FAILURE [1.579s]
[INFO] Apache CloudStack ................................. SKIPPED
[INFO] Apache CloudStack Maven Conventions Parent ........ SKIPPED
[INFO] Apache CloudStack Framework - Managed Context ..... SKIPPED
[INFO] Apache CloudStack Utils ........................... SKIPPED
[INFO] Apache CloudStack Framework ....................... SKIPPED
[INFO] Apache CloudStack Framework - Event Notification .. SKIPPED
[INFO] Apache CloudStack Framework - Configuration ....... SKIPPED
[INFO] Apache CloudStack API ............................. SKIPPED
[INFO] Apache CloudStack Framework - REST ................ SKIPPED
[INFO] Apache CloudStack Framework - IPC ................. SKIPPED
[INFO] Apache CloudStack Cloud Engine .................... SKIPPED
[INFO] Apache CloudStack Cloud Engine API ................ SKIPPED
[INFO] Apache CloudStack Framework - Security ............ SKIPPED
[INFO] Apache CloudStack Core ............................ SKIPPED
[INFO] Apache CloudStack Agents .......................... SKIPPED
[INFO] Apache CloudStack Framework - Clustering .......... SKIPPED
[INFO] Apache CloudStack Framework - Event Notification .. SKIPPED
[INFO] Apache CloudStack Cloud Engine Schema Component ... SKIPPED
[INFO] Apache CloudStack Framework - Jobs ................ SKIPPED
[INFO] Apache CloudStack Cloud Engine Internal Components API  SKIPPED
[INFO] Apache CloudStack Server .......................... SKIPPED
[INFO] Apache CloudStack Usage Server .................... SKIPPED
[INFO] Apache CloudStack Cloud Engine Orchestration Component  SKIPPED
[INFO] Apache CloudStack Cloud Services .................. SKIPPED
[INFO] Apache CloudStack Secondary Storage ............... SKIPPED
[INFO] Apache CloudStack Secondary Storage Service ....... SKIPPED
[INFO] Apache CloudStack Engine Storage Component ........ SKIPPED
[INFO] Apache CloudStack Engine Storage Volume Component . SKIPPED
[INFO] Apache CloudStack Engine Storage Image Component .. SKIPPED
[INFO] Apache CloudStack Engine Storage Data Motion Component  SKIPPED
[INFO] Apache CloudStack Engine Storage Cache Component .. SKIPPED
[INFO] Apache CloudStack Engine Storage Snapshot Component  SKIPPED
[INFO] Apache CloudStack Cloud Engine API ................ SKIPPED
[INFO] Apache CloudStack Cloud Engine Service ............ SKIPPED
[INFO] Apache CloudStack Plugin POM ...................... SKIPPED
[INFO] Apache CloudStack Plugin - API Rate Limit ......... SKIPPED
[INFO] Apache CloudStack Plugin - Storage Volume default provider  SKIPPED
[INFO] Apache CloudStack Plugin - Storage Volume SolidFire Provider  SKIPPED
[INFO] Apache CloudStack Plugin - API SolidFire .......... SKIPPED
[INFO] Apache CloudStack Plugin - API Discovery .......... SKIPPED
[INFO] Apache CloudStack Plugin - ACL Static Role Based .. SKIPPED
[INFO] Apache CloudStack Plugin - Host Anti-Affinity Processor  SKIPPED
[INFO] Apache CloudStack Plugin - Explicit Dedication Processor  SKIPPED
[INFO] Apache CloudStack Plugin - User Concentrated Pod Deployment Planner  SKIPPED
[INFO] Apache CloudStack Plugin - User Dispersing Deployment Planner  SKIPPED
[INFO] Apache CloudStack Plugin - Implicit Dedication Planner  SKIPPED
[INFO] Apache CloudStack Plugin - Skip Heurestics Planner  SKIPPED
[INFO] Apache CloudStack Plugin - Host Allocator Random .. SKIPPED
[INFO] Apache CloudStack Plugin - Dedicated Resources .... SKIPPED
[INFO] Apache CloudStack Plugin - Hypervisor OracleVM .... SKIPPED
[INFO] Apache CloudStack Plugin - Open vSwitch ........... SKIPPED
[INFO] Apache CloudStack Plugin - Hypervisor XenServer ... SKIPPED
[INFO] Apache CloudStack Plugin - Hypervisor KVM ......... SKIPPED
[INFO] Apache CloudStack Plugin - RabbitMQ Event Bus ..... SKIPPED
[INFO] Apache CloudStack Plugin - In Memory Event Bus .... SKIPPED
[INFO] Apache CloudStack Plugin - Hypervisor Baremetal ... SKIPPED
[INFO] Apache CloudStack Plugin - Hypervisor UCS ......... SKIPPED
[INFO] Apache CloudStack Plugin - Hypervisor Hyper-V ..... SKIPPED
[INFO] Apache CloudStack Plugin - Network Elastic Load Balancer  SKIPPED
[INFO] Apache CloudStack Plugin - Network Internal Load Balancer  SKIPPED
[INFO] Apache CloudStack Framework - Spring Life Cycle ... SKIPPED
[INFO] Apache CloudStack Plugin - Network Juniper Contrail  SKIPPED
[INFO] Apache CloudStack Plugin - Palo Alto .............. SKIPPED
[INFO] Apache CloudStack Plugin - Network Netscaler ...... SKIPPED
[INFO] Apache CloudStack Plugin - Network Nicira NVP ..... SKIPPED
[INFO] Apache CloudStack Plugin - BigSwitch Virtual Network Segment  SKIPPED
[INFO] Apache CloudStack Plugin - Network Brocade VCS .... SKIPPED
[INFO] Apache CloudStack Plugin - Midokura Midonet ....... SKIPPED
[INFO] Apache CloudStack Plugin - Stratosphere SSP ....... SKIPPED
[INFO] Apache CloudStack Plugin - Network Opendaylight ... SKIPPED
[INFO] Apache CloudStack Plugin - Storage Allocator Random  SKIPPED
[INFO] Apache CloudStack Plugin - User Authenticator LDAP  SKIPPED
[INFO] Apache CloudStack Plugin - User Authenticator MD5 . SKIPPED
[INFO] Apache CloudStack Plugin - User Authenticator Plain Text  SKIPPED
[INFO] Apache CloudStack Plugin - User Authenticator SAML2  SKIPPED
[INFO] Apache CloudStack Plugin - User Authenticator SHA256 Salted  SKIPPED
[INFO] Apache CloudStack Plugin - Dns Notifier Example ... SKIPPED
[INFO] Apache CloudStack Plugin - Storage Image S3 ....... SKIPPED
[INFO] Apache CloudStack Plugin - Storage Image Swift provider  SKIPPED
[INFO] Apache CloudStack Plugin - Storage Image default provider  SKIPPED
[INFO] Apache CloudStack Plugin - Storage Image sample provider  SKIPPED
[INFO] Apache CloudStack Plugin - Storage Volume Nexenta Provider  SKIPPED
[INFO] Apache CloudStack Plugin - Storage Volume CloudByte Provider  SKIPPED
[INFO] Apache CloudStack Plugin - Storage Volume sample provider  SKIPPED
[INFO] Apache CloudStack Plugin - SNMP Alerts ............ SKIPPED
[INFO] Apache CloudStack Plugin - Syslog Alerts .......... SKIPPED
[INFO] Apache CloudStack Plugin - Network VXLAN .......... SKIPPED
[INFO] Apache CloudStack Plugin - GloboDNS ............... SKIPPED
[INFO] Apache CloudStack Plugin - NetApp File System ..... SKIPPED
[INFO] Apache CloudStack Plugin - F5 ..................... SKIPPED
[INFO] Apache CloudStack Plugin - Juniper SRX ............ SKIPPED
[INFO] Apache CloudStack Plugin - Nuage VSP .............. SKIPPED
[INFO] Apache CloudStack VMware Base ..................... SKIPPED
[INFO] Apache CloudStack Plugin - Hypervisor VMware ...... SKIPPED
[INFO] Apache CloudStack Plugin - Cisco VNMC ............. SKIPPED
[INFO] Apache CloudStack Plugin - MySQL HA Strategy ...... SKIPPED
[INFO] Apache CloudStack Framework - Spring Module ....... SKIPPED
[INFO] Apache CloudStack Secondary Storage Controller .... SKIPPED
[INFO] Apache CloudStack Console Proxy - RDP Client ...... SKIPPED
[INFO] Apache CloudStack Console Proxy ................... SKIPPED
[INFO] Apache CloudStack Console Proxy - Server .......... SKIPPED
[INFO] Apache CloudStack System VM ....................... SKIPPED
[INFO] Apache CloudStack Client UI ....................... SKIPPED
[INFO] Apache CloudStack Framework - QuickCloud .......... SKIPPED
[INFO] Apache CloudStack AWS API Bridge .................. SKIPPED
[INFO] ------------------------------------------------------------------------
[INFO] BUILD FAILURE
[INFO] ------------------------------------------------------------------------
[INFO] Total time: 6.575s (Wall Clock)
[INFO] Finished at: Thu Dec 04 09:22:17 CET 2014
[INFO] Final Memory: 41M/226M
[INFO] ------------------------------------------------------------------------
[ERROR] Failed to execute goal org.apache.maven.plugins:maven-surefire-plugin:2.12.4:test
(default-test) on project checkstyle: Execution default-test of goal org.apache.maven.plugins:maven-surefire-plugin:2.12.4:test
failed: Plugin org.apache.maven.plugins:maven-surefire-plugin:2.12.4 or one of its dependencies
could not be resolved: Could not find artifact org.apache.maven.shared:maven-common-artifact-filters:jar:1.3
-> [Help 1]
[ERROR] 
[ERROR] To see the full stack trace of the errors, re-run Maven with the -e switch.
[ERROR] Re-run Maven using the -X switch to enable full debug logging.
[ERROR] 
[ERROR] For more information about the errors and possible solutions, please read the following
articles:
[ERROR] [Help 1] http://cwiki.apache.org/confluence/display/MAVEN/PluginResolutionException
Build step 'Invoke top-level Maven targets' marked build as failure
Archiving artifacts

Mime
View raw message