cloudstack-dev mailing list archives

Site index · List index
Message view « Date » · « Thread »
Top « Date » · « Thread »
From jenk...@cloudstack.org
Subject Build failed in Jenkins: build-master #2123
Date Tue, 30 Dec 2014 09:19:22 GMT
See <http://jenkins.buildacloud.org/job/build-master/2123/changes>

Changes:

[likitha.shetty] CLOUDSTACK-8136. [VMware] Create VM snapshot fails if a previous attempt
to take the snapshot failed.

------------------------------------------
[...truncated 2745 lines...]
[INFO] ------------------------------------------------------------------------
[INFO] Skipping Apache CloudStack Plugin - User Authenticator SAML2
[INFO] This project has been banned from the build due to previous failures.
[INFO] ------------------------------------------------------------------------
[INFO]                                                                         
[INFO] ------------------------------------------------------------------------
[INFO] Skipping Apache CloudStack Plugin - User Authenticator SHA256 Salted
[INFO] This project has been banned from the build due to previous failures.
[INFO] ------------------------------------------------------------------------
[INFO]                                                                         
[INFO] ------------------------------------------------------------------------
[INFO] Skipping Apache CloudStack Plugin - Dns Notifier Example
[INFO] This project has been banned from the build due to previous failures.
[INFO] ------------------------------------------------------------------------
[INFO]                                                                         
[INFO] ------------------------------------------------------------------------
[INFO] Skipping Apache CloudStack Plugin - SNMP Alerts
[INFO] This project has been banned from the build due to previous failures.
[INFO] ------------------------------------------------------------------------
[INFO]                                                                         
[INFO] ------------------------------------------------------------------------
[INFO] Skipping Apache CloudStack Plugin - Syslog Alerts
[INFO] This project has been banned from the build due to previous failures.
[INFO] ------------------------------------------------------------------------
[INFO]                                                                         
[INFO] ------------------------------------------------------------------------
[INFO] Skipping Apache CloudStack Plugin - Network VXLAN
[INFO] This project has been banned from the build due to previous failures.
[INFO] ------------------------------------------------------------------------
[INFO]                                                                         
[INFO] ------------------------------------------------------------------------
[INFO] Skipping Apache CloudStack Plugin - GloboDNS
[INFO] This project has been banned from the build due to previous failures.
[INFO] ------------------------------------------------------------------------
[INFO]                                                                         
[INFO] ------------------------------------------------------------------------
[INFO] Skipping Apache CloudStack Engine Storage Component
[INFO] This project has been banned from the build due to previous failures.
[INFO] ------------------------------------------------------------------------
[INFO]                                                                         
[INFO] ------------------------------------------------------------------------
[INFO] Skipping Apache CloudStack System VM
[INFO] This project has been banned from the build due to previous failures.
[INFO] ------------------------------------------------------------------------
Tests run: 7, Failures: 0, Errors: 1, Skipped: 0, Time elapsed: 6.306 sec <<< FAILURE!

Results :

Tests in error: 
  multipleClientsCanAccessWithoutBlocking(org.apache.cloudstack.ratelimit.ApiRateLimitTest):
unable to create new native thread

Tests run: 7, Failures: 0, Errors: 1, Skipped: 0

[INFO] 
[INFO] --- maven-surefire-plugin:2.12:test (default-test) @ cloud-plugin-planner-implicit-dedication
---
[INFO] Surefire report directory: <http://jenkins.buildacloud.org/job/build-master/ws/plugins/deployment-planners/implicit-dedication/target/surefire-reports>

-------------------------------------------------------
 T E S T S
-------------------------------------------------------
Running org.apache.cloudstack.implicitplanner.ImplicitPlannerTest
[INFO] 
[INFO] --- maven-resources-plugin:2.5:testResources (default-testResources) @ cloud-plugin-hypervisor-ovm
---
[debug] execute contextualize
[INFO] Using 'UTF-8' encoding to copy filtered resources.
[INFO] skip non existing resourceDirectory <http://jenkins.buildacloud.org/job/build-master/ws/plugins/hypervisors/ovm/test/resources>
[INFO] Copying 3 resources
[INFO] 
[INFO] --- maven-compiler-plugin:2.5.1:testCompile (default-testCompile) @ cloud-plugin-hypervisor-ovm
---
[INFO] No sources to compile
[INFO] 
[INFO] --- maven-surefire-plugin:2.12:test (default-test) @ cloud-plugin-hypervisor-ovm ---
[INFO] Surefire report directory: <http://jenkins.buildacloud.org/job/build-master/ws/plugins/hypervisors/ovm/target/surefire-reports>

-------------------------------------------------------
 T E S T S
-------------------------------------------------------
[INFO] 
[INFO] --- maven-resources-plugin:2.5:testResources (default-testResources) @ cloud-mom-rabbitmq
---
[debug] execute contextualize
[INFO] Using 'UTF-8' encoding to copy filtered resources.
[INFO] skip non existing resourceDirectory <http://jenkins.buildacloud.org/job/build-master/ws/plugins/event-bus/rabbitmq/test/resources>
[INFO] Copying 3 resources
[INFO] 
[INFO] --- maven-compiler-plugin:2.5.1:testCompile (default-testCompile) @ cloud-mom-rabbitmq
---
[INFO] No sources to compile
[INFO] 
[INFO] --- maven-surefire-plugin:2.12:test (default-test) @ cloud-mom-rabbitmq ---
[INFO] Surefire report directory: <http://jenkins.buildacloud.org/job/build-master/ws/plugins/event-bus/rabbitmq/target/surefire-reports>

-------------------------------------------------------
 T E S T S
-------------------------------------------------------
log4j:WARN No appenders could be found for logger (org.springframework.test.context.junit4.SpringJUnit4ClassRunner).
log4j:WARN Please initialize the log4j system properly.
log4j:WARN See http://logging.apache.org/log4j/1.2/faq.html#noconfig for more info.
[INFO] 
[INFO] --- maven-resources-plugin:2.5:testResources (default-testResources) @ cloud-mom-inmemory
---
[debug] execute contextualize
[INFO] Using 'UTF-8' encoding to copy filtered resources.
[INFO] skip non existing resourceDirectory <http://jenkins.buildacloud.org/job/build-master/ws/plugins/event-bus/inmemory/test/resources>
[INFO] Copying 3 resources
[INFO] 
[INFO] --- maven-compiler-plugin:2.5.1:testCompile (default-testCompile) @ cloud-mom-inmemory
---
[INFO] Compiling 1 source file to <http://jenkins.buildacloud.org/job/build-master/ws/plugins/event-bus/inmemory/target/test-classes>

Results :

Tests run: 0, Failures: 0, Errors: 0, Skipped: 0

[INFO] 
[INFO] --- maven-surefire-plugin:2.12:test (default-test) @ cloud-plugin-dedicated-resources
---
[INFO] Surefire report directory: <http://jenkins.buildacloud.org/job/build-master/ws/plugins/dedicated-resources/target/surefire-reports>

-------------------------------------------------------
 T E S T S
-------------------------------------------------------

Results :

Tests run: 0, Failures: 0, Errors: 0, Skipped: 0

[INFO] ------------------------------------------------------------------------
[INFO] Reactor Summary:
[INFO] 
[INFO] Apache CloudStack Developer Tools - Checkstyle Configuration  SUCCESS [1.170s]
[INFO] Apache CloudStack ................................. SUCCESS [1.242s]
[INFO] Apache CloudStack Maven Conventions Parent ........ SUCCESS [2.595s]
[INFO] Apache CloudStack Framework - Managed Context ..... SUCCESS [6.181s]
[INFO] Apache CloudStack Utils ........................... SUCCESS [17.583s]
[INFO] Apache CloudStack Framework ....................... SUCCESS [0.246s]
[INFO] Apache CloudStack Framework - Event Notification .. SUCCESS [13.132s]
[INFO] Apache CloudStack Framework - Configuration ....... SUCCESS [4.561s]
[INFO] Apache CloudStack API ............................. SUCCESS [16.816s]
[INFO] Apache CloudStack Framework - REST ................ SUCCESS [8.911s]
[INFO] Apache CloudStack Framework - IPC ................. SUCCESS [5.386s]
[INFO] Apache CloudStack Cloud Engine .................... SUCCESS [0.231s]
[INFO] Apache CloudStack Cloud Engine API ................ SUCCESS [5.790s]
[INFO] Apache CloudStack Framework - Security ............ SUCCESS [3.423s]
[INFO] Apache CloudStack Core ............................ SUCCESS [14.826s]
[INFO] Apache CloudStack Agents .......................... SUCCESS [8.201s]
[INFO] Apache CloudStack Framework - Clustering .......... SUCCESS [4.109s]
[INFO] Apache CloudStack Framework - Event Notification .. SUCCESS [4.975s]
[INFO] Apache CloudStack Cloud Engine Schema Component ... SUCCESS [19.732s]
[INFO] Apache CloudStack Framework - Jobs ................ SUCCESS [6.149s]
[INFO] Apache CloudStack Cloud Engine Internal Components API  SUCCESS [3.557s]
[INFO] Apache CloudStack Server .......................... SUCCESS [51.019s]
[INFO] Apache CloudStack Usage Server .................... SUCCESS [12.841s]
[INFO] Apache CloudStack Cloud Engine Orchestration Component  SUCCESS [16.534s]
[INFO] Apache CloudStack Cloud Services .................. SUCCESS [0.237s]
[INFO] Apache CloudStack Secondary Storage ............... SUCCESS [5.977s]
[INFO] Apache CloudStack Secondary Storage Service ....... SUCCESS [16.058s]
[INFO] Apache CloudStack Engine Storage Component ........ SKIPPED
[INFO] Apache CloudStack Engine Storage Volume Component . SKIPPED
[INFO] Apache CloudStack Engine Storage Image Component .. SKIPPED
[INFO] Apache CloudStack Engine Storage Data Motion Component  SKIPPED
[INFO] Apache CloudStack Engine Storage Cache Component .. SKIPPED
[INFO] Apache CloudStack Engine Storage Snapshot Component  SKIPPED
[INFO] Apache CloudStack Cloud Engine API ................ SUCCESS [4.132s]
[INFO] Apache CloudStack Cloud Engine Service ............ SKIPPED
[INFO] Apache CloudStack Plugin POM ...................... SUCCESS [0.629s]
[INFO] Apache CloudStack Plugin - API Rate Limit ......... FAILURE [24.749s]
[INFO] Apache CloudStack Plugin - Storage Volume default provider  SKIPPED
[INFO] Apache CloudStack Plugin - Storage Volume SolidFire Provider  SKIPPED
[INFO] Apache CloudStack Plugin - API SolidFire .......... SKIPPED
[INFO] Apache CloudStack Plugin - API Discovery .......... SUCCESS [21.061s]
[INFO] Apache CloudStack Plugin - ACL Static Role Based .. SUCCESS [10.898s]
[INFO] Apache CloudStack Plugin - Host Anti-Affinity Processor  SUCCESS [11.040s]
[INFO] Apache CloudStack Plugin - Explicit Dedication Processor  SUCCESS [11.961s]
[INFO] Apache CloudStack Plugin - User Concentrated Pod Deployment Planner  SUCCESS [10.949s]
[INFO] Apache CloudStack Plugin - User Dispersing Deployment Planner  SUCCESS [10.300s]
[INFO] Apache CloudStack Plugin - Implicit Dedication Planner  SKIPPED
[INFO] Apache CloudStack Plugin - Skip Heurestics Planner  SUCCESS [9.256s]
[INFO] Apache CloudStack Plugin - Host Allocator Random .. SUCCESS [10.020s]
[INFO] Apache CloudStack Plugin - Dedicated Resources .... SKIPPED
[INFO] Apache CloudStack Plugin - Hypervisor OracleVM .... SUCCESS [12.791s]
[INFO] Apache CloudStack Plugin - Open vSwitch ........... SKIPPED
[INFO] Apache CloudStack Plugin - Hypervisor XenServer ... SKIPPED
[INFO] Apache CloudStack Plugin - Hypervisor KVM ......... SKIPPED
[INFO] Apache CloudStack Plugin - RabbitMQ Event Bus ..... SUCCESS [8.629s]
[INFO] Apache CloudStack Plugin - In Memory Event Bus .... SKIPPED
[INFO] Apache CloudStack Plugin - Hypervisor Baremetal ... FAILURE [2.783s]
[INFO] Apache CloudStack Plugin - Hypervisor UCS ......... SKIPPED
[INFO] Apache CloudStack Plugin - Hypervisor Hyper-V ..... SKIPPED
[INFO] Apache CloudStack Plugin - Network Elastic Load Balancer  SKIPPED
[INFO] Apache CloudStack Plugin - Network Internal Load Balancer  SKIPPED
[INFO] Apache CloudStack Framework - Spring Life Cycle ... SUCCESS [3.108s]
[INFO] Apache CloudStack Plugin - Network Juniper Contrail  SKIPPED
[INFO] Apache CloudStack Plugin - Palo Alto .............. SKIPPED
[INFO] Apache CloudStack Plugin - Network Netscaler ...... SKIPPED
[INFO] Apache CloudStack Plugin - Network Nicira NVP ..... SKIPPED
[INFO] Apache CloudStack Plugin - BigSwitch Virtual Network Segment  SKIPPED
[INFO] Apache CloudStack Plugin - Network Brocade VCS .... SKIPPED
[INFO] Apache CloudStack Plugin - Midokura Midonet ....... SKIPPED
[INFO] Apache CloudStack Plugin - Stratosphere SSP ....... SKIPPED
[INFO] Apache CloudStack Plugin - Network Opendaylight ... SKIPPED
[INFO] Apache CloudStack Plugin - Storage Allocator Random  SKIPPED
[INFO] Apache CloudStack Plugin - User Authenticator LDAP  SKIPPED
[INFO] Apache CloudStack Plugin - User Authenticator MD5 . SKIPPED
[INFO] Apache CloudStack Plugin - User Authenticator Plain Text  SKIPPED
[INFO] Apache CloudStack Plugin - User Authenticator SAML2  SKIPPED
[INFO] Apache CloudStack Plugin - User Authenticator SHA256 Salted  SKIPPED
[INFO] Apache CloudStack Plugin - Dns Notifier Example ... SKIPPED
[INFO] Apache CloudStack Plugin - Storage Image S3 ....... SKIPPED
[INFO] Apache CloudStack Plugin - Storage Image Swift provider  SKIPPED
[INFO] Apache CloudStack Plugin - Storage Image default provider  SKIPPED
[INFO] Apache CloudStack Plugin - Storage Image sample provider  SKIPPED
[INFO] Apache CloudStack Plugin - Storage Volume Nexenta Provider  SKIPPED
[INFO] Apache CloudStack Plugin - Storage Volume CloudByte Provider  SKIPPED
[INFO] Apache CloudStack Plugin - Storage Volume sample provider  SKIPPED
[INFO] Apache CloudStack Plugin - SNMP Alerts ............ SKIPPED
[INFO] Apache CloudStack Plugin - Syslog Alerts .......... SKIPPED
[INFO] Apache CloudStack Plugin - Network VXLAN .......... SKIPPED
[INFO] Apache CloudStack Plugin - GloboDNS ............... SKIPPED
[INFO] Apache CloudStack Framework - Spring Module ....... SUCCESS [12.586s]
[INFO] Apache CloudStack Secondary Storage Controller .... SUCCESS [10.085s]
[INFO] Apache CloudStack Console Proxy - RDP Client ...... SUCCESS [19.068s]
[INFO] Apache CloudStack Console Proxy ................... SUCCESS [5.821s]
[INFO] Apache CloudStack Console Proxy - Server .......... SUCCESS [10.270s]
[INFO] Apache CloudStack System VM ....................... SKIPPED
[INFO] Apache CloudStack Client UI ....................... SKIPPED
[INFO] Apache CloudStack Framework - QuickCloud .......... SUCCESS [2.116s]
[INFO] Apache CloudStack AWS API Bridge .................. SKIPPED
[INFO] ------------------------------------------------------------------------
[INFO] BUILD FAILURE
[INFO] ------------------------------------------------------------------------
[INFO] Total time: 3:07.045s (Wall Clock)
[INFO] Finished at: Tue Dec 30 10:19:06 CET 2014
[INFO] Final Memory: 61M/372M
[INFO] ------------------------------------------------------------------------
[ERROR] Failed to execute goal org.apache.maven.plugins:maven-compiler-plugin:2.5.1:compile
(default-compile) on project cloud-plugin-hypervisor-baremetal: Fatal error compiling: Unknown
error trying to execute the external compiler:
[ERROR] /bin/sh -c cd <http://jenkins.buildacloud.org/job/build-master/ws/plugins/hypervisors/baremetal>
&& /usr/lib/jvm/java-1.7.0-openjdk-1.7.0.25.x86_64/jre/../bin/javac @/tmp/org.codehaus.plexus.compiler.javac.JavacCompiler5579332165016210454arguments
-J-Xmx512m -J-Xms128m
[ERROR] -> [Help 1]
[ERROR] Failed to execute goal org.apache.maven.plugins:maven-surefire-plugin:2.12:test (default-test)
on project cloud-plugin-api-limit-account-based: There are test failures.
[ERROR] 
[ERROR] Please refer to <http://jenkins.buildacloud.org/job/build-master/ws/plugins/api/rate-limit/target/surefire-reports>
for the individual test results.
[ERROR] -> [Help 2]
[ERROR] 
[ERROR] To see the full stack trace of the errors, re-run Maven with the -e switch.
[ERROR] Re-run Maven using the -X switch to enable full debug logging.
[ERROR] 
[ERROR] For more information about the errors and possible solutions, please read the following
articles:
[ERROR] [Help 1] http://cwiki.apache.org/confluence/display/MAVEN/MojoExecutionException
[ERROR] [Help 2] http://cwiki.apache.org/confluence/display/MAVEN/MojoFailureException
[ERROR] 
[ERROR] After correcting the problems, you can resume the build with the command
[ERROR]   mvn <goals> -rf :cloud-plugin-hypervisor-baremetal
Build step 'Invoke top-level Maven targets' marked build as failure
Recording test results

Mime
View raw message