cloudstack-dev mailing list archives

Site index · List index
Message view « Date » · « Thread »
Top « Date » · « Thread »
From jenk...@cloudstack.org
Subject Build failed in Jenkins: build-master #2121
Date Fri, 26 Dec 2014 15:58:11 GMT
See <http://jenkins.buildacloud.org/job/build-master/2121/changes>

Changes:

[rajesh.battala] CLOUDSTACK-6920 Support listing of LBHealthcheck policy with LBHealthcheck
policy ID

------------------------------------------
[...truncated 2734 lines...]
[INFO]                                                                         
[INFO] ------------------------------------------------------------------------
[INFO] Skipping Apache CloudStack Plugin - User Authenticator MD5
[INFO] This project has been banned from the build due to previous failures.
[INFO] ------------------------------------------------------------------------
[INFO]                                                                         
[INFO] ------------------------------------------------------------------------
[INFO] Skipping Apache CloudStack Plugin - User Authenticator Plain Text
[INFO] This project has been banned from the build due to previous failures.
[INFO] ------------------------------------------------------------------------
[INFO]                                                                         
[INFO] ------------------------------------------------------------------------
[INFO] Skipping Apache CloudStack Plugin - User Authenticator SAML2
[INFO] This project has been banned from the build due to previous failures.
[INFO] ------------------------------------------------------------------------
[INFO]                                                                         
[INFO] ------------------------------------------------------------------------
[INFO] Skipping Apache CloudStack Plugin - User Authenticator SHA256 Salted
[INFO] This project has been banned from the build due to previous failures.
[INFO] ------------------------------------------------------------------------
[INFO]                                                                         
[INFO] ------------------------------------------------------------------------
[INFO] Skipping Apache CloudStack Plugin - Dns Notifier Example
[INFO] This project has been banned from the build due to previous failures.
[INFO] ------------------------------------------------------------------------
[INFO]                                                                         
[INFO] ------------------------------------------------------------------------
[INFO] Skipping Apache CloudStack Plugin - SNMP Alerts
[INFO] This project has been banned from the build due to previous failures.
[INFO] ------------------------------------------------------------------------
[INFO]                                                                         
[INFO] ------------------------------------------------------------------------
[INFO] Skipping Apache CloudStack Plugin - Syslog Alerts
[INFO] This project has been banned from the build due to previous failures.
[INFO] ------------------------------------------------------------------------
[INFO]                                                                         
[INFO] ------------------------------------------------------------------------
[INFO] Skipping Apache CloudStack Plugin - Network VXLAN
[INFO] This project has been banned from the build due to previous failures.
[INFO] ------------------------------------------------------------------------
[INFO]                                                                         
[INFO] ------------------------------------------------------------------------
[INFO] Skipping Apache CloudStack Plugin - GloboDNS
[INFO] This project has been banned from the build due to previous failures.
[INFO] ------------------------------------------------------------------------
[INFO]                                                                         
[INFO] ------------------------------------------------------------------------
[INFO] Skipping Apache CloudStack Engine Storage Component
[INFO] This project has been banned from the build due to previous failures.
[INFO] ------------------------------------------------------------------------
[INFO]                                                                         
[INFO] ------------------------------------------------------------------------
[INFO] Skipping Apache CloudStack System VM
[INFO] This project has been banned from the build due to previous failures.
[INFO] ------------------------------------------------------------------------
Tests run: 7, Failures: 0, Errors: 0, Skipped: 0, Time elapsed: 7.631 sec

Results :

Tests run: 7, Failures: 0, Errors: 0, Skipped: 0

[INFO] 
[INFO] --- maven-surefire-plugin:2.12:test (default-test) @ cloud-plugin-planner-implicit-dedication
---
[INFO] Surefire report directory: <http://jenkins.buildacloud.org/job/build-master/ws/plugins/deployment-planners/implicit-dedication/target/surefire-reports>

-------------------------------------------------------
 T E S T S
-------------------------------------------------------
[INFO] 
[INFO] --- maven-resources-plugin:2.5:testResources (default-testResources) @ cloud-mom-inmemory
---
[debug] execute contextualize
[INFO] Using 'UTF-8' encoding to copy filtered resources.
[INFO] skip non existing resourceDirectory <http://jenkins.buildacloud.org/job/build-master/ws/plugins/event-bus/inmemory/test/resources>
[INFO] Copying 3 resources
[INFO] 
[INFO] --- maven-compiler-plugin:2.5.1:testCompile (default-testCompile) @ cloud-mom-inmemory
---
[INFO] Compiling 1 source file to <http://jenkins.buildacloud.org/job/build-master/ws/plugins/event-bus/inmemory/target/test-classes>
Running org.apache.cloudstack.implicitplanner.ImplicitPlannerTest
[INFO] 
[INFO] --- maven-surefire-plugin:2.12:test (default-test) @ cloud-plugin-dedicated-resources
---
[INFO] Surefire report directory: <http://jenkins.buildacloud.org/job/build-master/ws/plugins/dedicated-resources/target/surefire-reports>

-------------------------------------------------------
 T E S T S
-------------------------------------------------------
log4j:WARN No appenders could be found for logger (org.springframework.test.context.junit4.SpringJUnit4ClassRunner).
log4j:WARN Please initialize the log4j system properly.
log4j:WARN See http://logging.apache.org/log4j/1.2/faq.html#noconfig for more info.
[INFO] 
[INFO] --- maven-resources-plugin:2.5:testResources (default-testResources) @ cloud-mom-rabbitmq
---
[debug] execute contextualize
[INFO] Using 'UTF-8' encoding to copy filtered resources.
[INFO] skip non existing resourceDirectory <http://jenkins.buildacloud.org/job/build-master/ws/plugins/event-bus/rabbitmq/test/resources>
[INFO] Copying 3 resources
[INFO] 
[INFO] --- maven-compiler-plugin:2.5.1:testCompile (default-testCompile) @ cloud-mom-rabbitmq
---
[INFO] No sources to compile
[INFO] 
[INFO] --- maven-surefire-plugin:2.12:test (default-test) @ cloud-mom-rabbitmq ---
[INFO] Surefire report directory: <http://jenkins.buildacloud.org/job/build-master/ws/plugins/event-bus/rabbitmq/target/surefire-reports>

-------------------------------------------------------
 T E S T S
-------------------------------------------------------
[INFO] 
[INFO] --- maven-resources-plugin:2.5:testResources (default-testResources) @ cloud-plugin-hypervisor-ovm
---
[debug] execute contextualize
[INFO] Using 'UTF-8' encoding to copy filtered resources.
[INFO] skip non existing resourceDirectory <http://jenkins.buildacloud.org/job/build-master/ws/plugins/hypervisors/ovm/test/resources>
[INFO] Copying 3 resources
[INFO] 
[INFO] --- maven-compiler-plugin:2.5.1:testCompile (default-testCompile) @ cloud-plugin-hypervisor-ovm
---
[INFO] No sources to compile
[INFO] 
[INFO] --- maven-surefire-plugin:2.12:test (default-test) @ cloud-plugin-hypervisor-ovm ---
[INFO] Surefire report directory: <http://jenkins.buildacloud.org/job/build-master/ws/plugins/hypervisors/ovm/target/surefire-reports>

-------------------------------------------------------
 T E S T S
-------------------------------------------------------
Running org.apache.cloudstack.dedicated.manager.DedicatedApiUnitTest
[INFO] ------------------------------------------------------------------------
[INFO] Reactor Summary:
[INFO] 
[INFO] Apache CloudStack Developer Tools - Checkstyle Configuration  SUCCESS [0.891s]
[INFO] Apache CloudStack ................................. SUCCESS [0.699s]
[INFO] Apache CloudStack Maven Conventions Parent ........ SUCCESS [1.920s]
[INFO] Apache CloudStack Framework - Managed Context ..... SUCCESS [4.668s]
[INFO] Apache CloudStack Utils ........................... SUCCESS [13.101s]
[INFO] Apache CloudStack Framework ....................... SUCCESS [0.299s]
[INFO] Apache CloudStack Framework - Event Notification .. SUCCESS [9.883s]
[INFO] Apache CloudStack Framework - Configuration ....... SUCCESS [3.998s]
[INFO] Apache CloudStack API ............................. SUCCESS [13.131s]
[INFO] Apache CloudStack Framework - REST ................ SUCCESS [6.554s]
[INFO] Apache CloudStack Framework - IPC ................. SUCCESS [4.526s]
[INFO] Apache CloudStack Cloud Engine .................... SUCCESS [0.281s]
[INFO] Apache CloudStack Cloud Engine API ................ SUCCESS [5.009s]
[INFO] Apache CloudStack Framework - Security ............ SUCCESS [3.061s]
[INFO] Apache CloudStack Core ............................ SUCCESS [14.844s]
[INFO] Apache CloudStack Agents .......................... SUCCESS [8.281s]
[INFO] Apache CloudStack Framework - Clustering .......... SUCCESS [3.579s]
[INFO] Apache CloudStack Framework - Event Notification .. SUCCESS [3.835s]
[INFO] Apache CloudStack Cloud Engine Schema Component ... SUCCESS [20.627s]
[INFO] Apache CloudStack Framework - Jobs ................ SUCCESS [6.496s]
[INFO] Apache CloudStack Cloud Engine Internal Components API  SUCCESS [3.058s]
[INFO] Apache CloudStack Server .......................... SUCCESS [50.132s]
[INFO] Apache CloudStack Usage Server .................... SUCCESS [12.401s]
[INFO] Apache CloudStack Cloud Engine Orchestration Component  SUCCESS [15.674s]
[INFO] Apache CloudStack Cloud Services .................. SUCCESS [0.193s]
[INFO] Apache CloudStack Secondary Storage ............... SUCCESS [3.821s]
[INFO] Apache CloudStack Secondary Storage Service ....... SUCCESS [18.085s]
[INFO] Apache CloudStack Engine Storage Component ........ SKIPPED
[INFO] Apache CloudStack Engine Storage Volume Component . SKIPPED
[INFO] Apache CloudStack Engine Storage Image Component .. SKIPPED
[INFO] Apache CloudStack Engine Storage Data Motion Component  SKIPPED
[INFO] Apache CloudStack Engine Storage Cache Component .. SKIPPED
[INFO] Apache CloudStack Engine Storage Snapshot Component  SKIPPED
[INFO] Apache CloudStack Cloud Engine API ................ SUCCESS [3.935s]
[INFO] Apache CloudStack Cloud Engine Service ............ SKIPPED
[INFO] Apache CloudStack Plugin POM ...................... SUCCESS [0.485s]
[INFO] Apache CloudStack Plugin - API Rate Limit ......... SUCCESS [25.255s]
[INFO] Apache CloudStack Plugin - Storage Volume default provider  SKIPPED
[INFO] Apache CloudStack Plugin - Storage Volume SolidFire Provider  SKIPPED
[INFO] Apache CloudStack Plugin - API SolidFire .......... SKIPPED
[INFO] Apache CloudStack Plugin - API Discovery .......... SUCCESS [19.451s]
[INFO] Apache CloudStack Plugin - ACL Static Role Based .. SUCCESS [10.422s]
[INFO] Apache CloudStack Plugin - Host Anti-Affinity Processor  SUCCESS [10.839s]
[INFO] Apache CloudStack Plugin - Explicit Dedication Processor  SUCCESS [10.598s]
[INFO] Apache CloudStack Plugin - User Concentrated Pod Deployment Planner  SUCCESS [10.658s]
[INFO] Apache CloudStack Plugin - User Dispersing Deployment Planner  SUCCESS [9.243s]
[INFO] Apache CloudStack Plugin - Implicit Dedication Planner  SKIPPED
[INFO] Apache CloudStack Plugin - Skip Heurestics Planner  SUCCESS [9.412s]
[INFO] Apache CloudStack Plugin - Host Allocator Random .. SUCCESS [9.994s]
[INFO] Apache CloudStack Plugin - Dedicated Resources .... SKIPPED
[INFO] Apache CloudStack Plugin - Hypervisor OracleVM .... SKIPPED
[INFO] Apache CloudStack Plugin - Open vSwitch ........... SKIPPED
[INFO] Apache CloudStack Plugin - Hypervisor XenServer ... SKIPPED
[INFO] Apache CloudStack Plugin - Hypervisor KVM ......... SKIPPED
[INFO] Apache CloudStack Plugin - RabbitMQ Event Bus ..... SKIPPED
[INFO] Apache CloudStack Plugin - In Memory Event Bus .... SKIPPED
[INFO] Apache CloudStack Plugin - Hypervisor Baremetal ... FAILURE [3.634s]
[INFO] Apache CloudStack Plugin - Hypervisor UCS ......... SKIPPED
[INFO] Apache CloudStack Plugin - Hypervisor Hyper-V ..... SKIPPED
[INFO] Apache CloudStack Plugin - Network Elastic Load Balancer  SKIPPED
[INFO] Apache CloudStack Plugin - Network Internal Load Balancer  SKIPPED
[INFO] Apache CloudStack Framework - Spring Life Cycle ... SUCCESS [2.501s]
[INFO] Apache CloudStack Plugin - Network Juniper Contrail  SKIPPED
[INFO] Apache CloudStack Plugin - Palo Alto .............. SKIPPED
[INFO] Apache CloudStack Plugin - Network Netscaler ...... SKIPPED
[INFO] Apache CloudStack Plugin - Network Nicira NVP ..... SKIPPED
[INFO] Apache CloudStack Plugin - BigSwitch Virtual Network Segment  SKIPPED
[INFO] Apache CloudStack Plugin - Network Brocade VCS .... SKIPPED
[INFO] Apache CloudStack Plugin - Midokura Midonet ....... SKIPPED
[INFO] Apache CloudStack Plugin - Stratosphere SSP ....... SKIPPED
[INFO] Apache CloudStack Plugin - Network Opendaylight ... SKIPPED
[INFO] Apache CloudStack Plugin - Storage Allocator Random  SKIPPED
[INFO] Apache CloudStack Plugin - User Authenticator LDAP  SKIPPED
[INFO] Apache CloudStack Plugin - User Authenticator MD5 . SKIPPED
[INFO] Apache CloudStack Plugin - User Authenticator Plain Text  SKIPPED
[INFO] Apache CloudStack Plugin - User Authenticator SAML2  SKIPPED
[INFO] Apache CloudStack Plugin - User Authenticator SHA256 Salted  SKIPPED
[INFO] Apache CloudStack Plugin - Dns Notifier Example ... SKIPPED
[INFO] Apache CloudStack Plugin - Storage Image S3 ....... SKIPPED
[INFO] Apache CloudStack Plugin - Storage Image Swift provider  SKIPPED
[INFO] Apache CloudStack Plugin - Storage Image default provider  SKIPPED
[INFO] Apache CloudStack Plugin - Storage Image sample provider  SKIPPED
[INFO] Apache CloudStack Plugin - Storage Volume Nexenta Provider  SKIPPED
[INFO] Apache CloudStack Plugin - Storage Volume CloudByte Provider  SKIPPED
[INFO] Apache CloudStack Plugin - Storage Volume sample provider  SKIPPED
[INFO] Apache CloudStack Plugin - SNMP Alerts ............ SKIPPED
[INFO] Apache CloudStack Plugin - Syslog Alerts .......... SKIPPED
[INFO] Apache CloudStack Plugin - Network VXLAN .......... SKIPPED
[INFO] Apache CloudStack Plugin - GloboDNS ............... SKIPPED
[INFO] Apache CloudStack Framework - Spring Module ....... SUCCESS [9.541s]
[INFO] Apache CloudStack Secondary Storage Controller .... SUCCESS [9.635s]
[INFO] Apache CloudStack Console Proxy - RDP Client ...... SUCCESS [13.315s]
[INFO] Apache CloudStack Console Proxy ................... SUCCESS [3.876s]
[INFO] Apache CloudStack Console Proxy - Server .......... SUCCESS [7.689s]
[INFO] Apache CloudStack System VM ....................... SKIPPED
[INFO] Apache CloudStack Client UI ....................... SKIPPED
[INFO] Apache CloudStack Framework - QuickCloud .......... SUCCESS [1.741s]
[INFO] Apache CloudStack AWS API Bridge .................. SKIPPED
[INFO] ------------------------------------------------------------------------
[INFO] BUILD FAILURE
[INFO] ------------------------------------------------------------------------
[INFO] Total time: 2:50.730s (Wall Clock)
[INFO] Finished at: Fri Dec 26 16:57:57 CET 2014
log4j:WARN No appenders could be found for logger (org.springframework.test.context.junit4.SpringJUnit4ClassRunner).
log4j:WARN Please initialize the log4j system properly.
log4j:WARN See http://logging.apache.org/log4j/1.2/faq.html#noconfig for more info.
[INFO] Final Memory: 62M/359M
[INFO] ------------------------------------------------------------------------

Results :

Tests run: 0, Failures: 0, Errors: 0, Skipped: 0

[ERROR] Failed to execute goal org.apache.maven.plugins:maven-compiler-plugin:2.5.1:compile
(default-compile) on project cloud-plugin-hypervisor-baremetal: Fatal error compiling: Error
while executing the external compiler. Error while executing process. Cannot run program "/bin/sh"
(in directory "<http://jenkins.buildacloud.org/job/build-master/ws/plugins/hypervisors/baremetal")>:
error=11, Resource temporarily unavailable -> [Help 1]
[ERROR] 
[ERROR] To see the full stack trace of the errors, re-run Maven with the -e switch.
[ERROR] Re-run Maven using the -X switch to enable full debug logging.
[ERROR] 
[ERROR] For more information about the errors and possible solutions, please read the following
articles:
[ERROR] [Help 1] http://cwiki.apache.org/confluence/display/MAVEN/MojoExecutionException
[ERROR] 
[ERROR] After correcting the problems, you can resume the build with the command
[ERROR]   mvn <goals> -rf :cloud-plugin-hypervisor-baremetal
Build step 'Invoke top-level Maven targets' marked build as failure
Recording test results

Mime
View raw message