cloudstack-dev mailing list archives

Site index · List index
Message view « Date » · « Thread »
Top « Date » · « Thread »
From jenk...@cloudstack.org
Subject Build failed in Jenkins: build-master-simulator #1414
Date Mon, 15 Dec 2014 06:21:31 GMT
See <http://jenkins.buildacloud.org/job/build-master-simulator/1414/changes>

Changes:

[rajanikaruturi] Small typo correction, exisits -> exists

------------------------------------------
[...truncated 19231 lines...]
548/1316 KB   
552/1316 KB   
556/1316 KB   
560/1316 KB   
564/1316 KB   
568/1316 KB   
572/1316 KB   
576/1316 KB   
580/1316 KB   
584/1316 KB   
588/1316 KB   
592/1316 KB   
596/1316 KB   
600/1316 KB   
604/1316 KB   
608/1316 KB   
612/1316 KB   
616/1316 KB   
620/1316 KB   
624/1316 KB   
628/1316 KB   
632/1316 KB   
636/1316 KB   
640/1316 KB   
644/1316 KB   
648/1316 KB   
652/1316 KB   
656/1316 KB   
660/1316 KB   
664/1316 KB   
668/1316 KB   
672/1316 KB   
676/1316 KB   
680/1316 KB   
684/1316 KB   
688/1316 KB   
692/1316 KB   
696/1316 KB   
700/1316 KB   
704/1316 KB   
708/1316 KB   
712/1316 KB   
716/1316 KB   
720/1316 KB   
724/1316 KB   
728/1316 KB   
732/1316 KB   
736/1316 KB   
740/1316 KB   
744/1316 KB   
748/1316 KB   
752/1316 KB   
756/1316 KB   
760/1316 KB   
764/1316 KB   
768/1316 KB   
772/1316 KB   
776/1316 KB   
780/1316 KB   
784/1316 KB   
788/1316 KB   
792/1316 KB   
796/1316 KB   
800/1316 KB   
804/1316 KB   
808/1316 KB   
812/1316 KB   
816/1316 KB   
820/1316 KB   
824/1316 KB   
828/1316 KB   
832/1316 KB   
836/1316 KB   
840/1316 KB   
844/1316 KB   
848/1316 KB   
852/1316 KB   
856/1316 KB   
860/1316 KB   
864/1316 KB   
868/1316 KB   
872/1316 KB   
876/1316 KB   
880/1316 KB   
884/1316 KB   
888/1316 KB   
892/1316 KB   
896/1316 KB   
900/1316 KB   
904/1316 KB   
908/1316 KB   
912/1316 KB   
916/1316 KB   
920/1316 KB   
924/1316 KB   
928/1316 KB   
932/1316 KB   
936/1316 KB   
940/1316 KB   
944/1316 KB   
948/1316 KB   
952/1316 KB   
956/1316 KB   
960/1316 KB   
964/1316 KB   
968/1316 KB   
972/1316 KB   
976/1316 KB   
980/1316 KB   
984/1316 KB   
988/1316 KB   
992/1316 KB   
996/1316 KB   
1000/1316 KB   
1004/1316 KB   
1008/1316 KB   
1012/1316 KB   
1016/1316 KB   
1020/1316 KB   
1024/1316 KB   
1028/1316 KB   
1032/1316 KB   
1036/1316 KB   
1040/1316 KB   
1044/1316 KB   
1048/1316 KB   
1052/1316 KB   
1056/1316 KB   
1060/1316 KB   
1064/1316 KB   
1068/1316 KB   
1072/1316 KB   
1076/1316 KB   
1080/1316 KB   
1084/1316 KB   
1088/1316 KB   
1092/1316 KB   
1096/1316 KB   
1100/1316 KB   
1104/1316 KB   
1108/1316 KB   
1112/1316 KB   
1116/1316 KB   
1120/1316 KB   
1124/1316 KB   
1128/1316 KB   
1132/1316 KB   
1136/1316 KB   
1140/1316 KB   
1144/1316 KB   
1148/1316 KB   
1152/1316 KB   
1156/1316 KB   
1160/1316 KB   
1164/1316 KB   
1168/1316 KB   
1172/1316 KB   
1176/1316 KB   
1180/1316 KB   
1184/1316 KB   
1188/1316 KB   
1192/1316 KB   
1196/1316 KB   
1200/1316 KB   
1204/1316 KB   
1208/1316 KB   
1212/1316 KB   
1216/1316 KB   
1220/1316 KB   
1224/1316 KB   
1228/1316 KB   
1232/1316 KB   
1236/1316 KB   
1240/1316 KB   
1244/1316 KB   
1248/1316 KB   
1252/1316 KB   
1256/1316 KB   
1260/1316 KB   
1264/1316 KB   
1268/1316 KB   
1272/1316 KB   
1276/1316 KB   
1280/1316 KB   
1284/1316 KB   
1288/1316 KB   
1292/1316 KB   
1296/1316 KB   
1300/1316 KB   
1304/1316 KB   
1308/1316 KB   
1312/1316 KB   
1316/1316 KB   
1316/1316 KB   
               
Downloaded: http://repo.maven.apache.org/maven2/net/sf/ehcache/ehcache-core/2.6.9/ehcache-core-2.6.9.jar
(1316 KB at 12531.8 KB/sec)
[INFO] ------------------------------------------------------------------------
[INFO] Reactor Summary:
[INFO] 
[INFO] Apache CloudStack Developer Tools - Checkstyle Configuration  SUCCESS [2.606s]
[INFO] Apache CloudStack ................................. SUCCESS [2.122s]
[INFO] Apache CloudStack Maven Conventions Parent ........ SUCCESS [2.467s]
[INFO] Apache CloudStack Framework - Managed Context ..... SUCCESS [5.411s]
[INFO] Apache CloudStack Utils ........................... SUCCESS [20.508s]
[INFO] Apache CloudStack Framework ....................... SUCCESS [0.075s]
[INFO] Apache CloudStack Framework - Event Notification .. FAILURE [0.285s]
[INFO] Apache CloudStack Framework - Configuration ....... SKIPPED
[INFO] Apache CloudStack API ............................. SKIPPED
[INFO] Apache CloudStack Framework - REST ................ SKIPPED
[INFO] Apache CloudStack Framework - IPC ................. SKIPPED
[INFO] Apache CloudStack Cloud Engine .................... SKIPPED
[INFO] Apache CloudStack Cloud Engine API ................ SKIPPED
[INFO] Apache CloudStack Framework - Security ............ SKIPPED
[INFO] Apache CloudStack Core ............................ SKIPPED
[INFO] Apache CloudStack Agents .......................... SKIPPED
[INFO] Apache CloudStack Framework - Clustering .......... SKIPPED
[INFO] Apache CloudStack Framework - Event Notification .. SKIPPED
[INFO] Apache CloudStack Cloud Engine Schema Component ... SKIPPED
[INFO] Apache CloudStack Framework - Jobs ................ SKIPPED
[INFO] Apache CloudStack Cloud Engine Internal Components API  SKIPPED
[INFO] Apache CloudStack Server .......................... SKIPPED
[INFO] Apache CloudStack Cloud Services .................. SKIPPED
[INFO] Apache CloudStack Secondary Storage ............... SKIPPED
[INFO] Apache CloudStack Secondary Storage Service ....... SKIPPED
[INFO] Apache CloudStack Engine Storage Component ........ SKIPPED
[INFO] Apache CloudStack Engine Storage Volume Component . SKIPPED
[INFO] Apache CloudStack Engine Storage Image Component .. SKIPPED
[INFO] Apache CloudStack Engine Storage Snapshot Component  SKIPPED
[INFO] Apache CloudStack Plugin POM ...................... SKIPPED
[INFO] Apache CloudStack Plugin - Hypervisor Simulator ... SKIPPED
[INFO] ------------------------------------------------------------------------
[INFO] BUILD FAILURE
[INFO] ------------------------------------------------------------------------
[INFO] Total time: 36.077s
[INFO] Finished at: Mon Dec 15 07:21:17 CET 2014
[INFO] Final Memory: 50M/330M
[INFO] ------------------------------------------------------------------------
[ERROR] Failed to execute goal on project cloud-framework-db: Could not resolve dependencies
for project org.apache.cloudstack:cloud-framework-db:jar:4.6.0-SNAPSHOT: The following artifacts
could not be resolved: org.eclipse.persistence:javax.persistence:jar:2.1.0, commons-dbcp:commons-dbcp:jar:1.4,
commons-pool:commons-pool:jar:1.6: Could not find artifact org.eclipse.persistence:javax.persistence:jar:2.1.0
-> [Help 1]
[ERROR] 
[ERROR] To see the full stack trace of the errors, re-run Maven with the -e switch.
[ERROR] Re-run Maven using the -X switch to enable full debug logging.
[ERROR] 
[ERROR] For more information about the errors and possible solutions, please read the following
articles:
[ERROR] [Help 1] http://cwiki.apache.org/confluence/display/MAVEN/DependencyResolutionException
[ERROR] 
[ERROR] After correcting the problems, you can resume the build with the command
[ERROR]   mvn <goals> -rf :cloud-framework-db
Build step 'Invoke top-level Maven targets' marked build as failure
Recording test results

Mime
View raw message