cloudstack-dev mailing list archives

Site index · List index
Message view « Date » · « Thread »
Top « Date » · « Thread »
From jenk...@cloudstack.org
Subject Build failed in Jenkins: build-master-noredist #3941
Date Thu, 11 Dec 2014 12:52:31 GMT
See <http://jenkins.buildacloud.org/job/build-master-noredist/3941/changes>

Changes:

[talluri] CLOUDSTACK:8058: Fix test_reset_ssh_keypair.py for EIP setup

[talluri] CLOUDSTACK:8018: Fix test_redundant_router.test_redundantVR_internals - The SSH
to router was being done from wrong host

[talluri] CLOUDSTACK-8062: test_multiple_ip_ranges.py - Fix the test case to avoid using same
vlan IP range in each test case

------------------------------------------
[...truncated 8521 lines...]
[INFO] 
[INFO] --- maven-install-plugin:2.3.1:install (default-install) @ cloud-plugin-storage-volume-nexenta
---
[INFO] Installing <http://jenkins.buildacloud.org/job/build-master-noredist/ws/plugins/storage/volume/nexenta/target/cloud-plugin-storage-volume-nexenta-4.6.0-SNAPSHOT.jar>
to /jenkins/.m2/repository/org/apache/cloudstack/cloud-plugin-storage-volume-nexenta/4.6.0-SNAPSHOT/cloud-plugin-storage-volume-nexenta-4.6.0-SNAPSHOT.jar
[INFO] Installing <http://jenkins.buildacloud.org/job/build-master-noredist/ws/plugins/storage/volume/nexenta/pom.xml>
to /jenkins/.m2/repository/org/apache/cloudstack/cloud-plugin-storage-volume-nexenta/4.6.0-SNAPSHOT/cloud-plugin-storage-volume-nexenta-4.6.0-SNAPSHOT.pom

Results :

Tests run: 2, Failures: 0, Errors: 0, Skipped: 0

[INFO] 
[INFO] --- maven-jar-plugin:2.4:jar (default-jar) @ cloud-plugin-network-midonet ---
[INFO]                                                                         
[INFO] ------------------------------------------------------------------------
[INFO] Building Apache CloudStack Plugin - Network Juniper Contrail 4.6.0-SNAPSHOT
[INFO] ------------------------------------------------------------------------
[INFO] Building jar: <http://jenkins.buildacloud.org/job/build-master-noredist/ws/plugins/network-elements/midonet/target/cloud-plugin-network-midonet-4.6.0-SNAPSHOT.jar>
[INFO] 
[INFO] --- maven-site-plugin:3.3:attach-descriptor (attach-descriptor) @ cloud-plugin-network-midonet
---
[INFO] 
[INFO] --- maven-install-plugin:2.3.1:install (default-install) @ cloud-plugin-network-midonet
---
[INFO] Installing <http://jenkins.buildacloud.org/job/build-master-noredist/ws/plugins/network-elements/midonet/target/cloud-plugin-network-midonet-4.6.0-SNAPSHOT.jar>
to /jenkins/.m2/repository/org/apache/cloudstack/cloud-plugin-network-midonet/4.6.0-SNAPSHOT/cloud-plugin-network-midonet-4.6.0-SNAPSHOT.jar
[WARNING] The POM for net.juniper.contrail:juniper-contrail-api:jar:1.0-SNAPSHOT is missing,
no dependency information available
[INFO] Installing <http://jenkins.buildacloud.org/job/build-master-noredist/ws/plugins/network-elements/midonet/pom.xml>
to /jenkins/.m2/repository/org/apache/cloudstack/cloud-plugin-network-midonet/4.6.0-SNAPSHOT/cloud-plugin-network-midonet-4.6.0-SNAPSHOT.pom
[INFO] Starting audit...
Audit done.

[INFO] 
[INFO] --- maven-remote-resources-plugin:1.3:process (default) @ cloud-plugin-storage-volume-solidfire
---
[INFO] Starting audit...
Audit done.

[INFO] 
[INFO] --- maven-remote-resources-plugin:1.3:process (default) @ cloud-plugin-storage-volume-cloudbyte
---
[INFO] 
[INFO] --- maven-resources-plugin:2.5:resources (default-resources) @ cloud-plugin-storage-volume-solidfire
---
[debug] execute contextualize
[INFO] Using 'UTF-8' encoding to copy filtered resources.
[INFO] Copying 2 resources
[INFO] Copying 3 resources
[INFO] 
[INFO] --- maven-compiler-plugin:2.5.1:compile (default-compile) @ cloud-plugin-storage-volume-solidfire
---
[INFO] Compiling 9 source files to <http://jenkins.buildacloud.org/job/build-master-noredist/ws/plugins/storage/volume/solidfire/target/classes>
[INFO] 
[INFO] --- maven-resources-plugin:2.5:resources (default-resources) @ cloud-plugin-storage-volume-cloudbyte
---
[debug] execute contextualize
[INFO] Using 'UTF-8' encoding to copy filtered resources.
[INFO] Copying 2 resources
[INFO] Copying 3 resources
[INFO] 
[INFO] --- maven-compiler-plugin:2.5.1:compile (default-compile) @ cloud-plugin-storage-volume-cloudbyte
---
[INFO] Compiling 13 source files to <http://jenkins.buildacloud.org/job/build-master-noredist/ws/plugins/storage/volume/cloudbyte/target/classes>
[INFO] 
[INFO] --- maven-surefire-plugin:2.12:test (default-test) @ cloud-plugin-hypervisor-vmware
---
[INFO] Surefire report directory: <http://jenkins.buildacloud.org/job/build-master-noredist/ws/plugins/hypervisors/vmware/target/surefire-reports>

-------------------------------------------------------
 T E S T S
-------------------------------------------------------
[INFO] 
[INFO] --- maven-resources-plugin:2.5:testResources (default-testResources) @ cloud-plugin-storage-image-sample
---
[debug] execute contextualize
[INFO] Using 'UTF-8' encoding to copy filtered resources.
[INFO] skip non existing resourceDirectory <http://jenkins.buildacloud.org/job/build-master-noredist/ws/plugins/storage/image/sample/test/resources>
[INFO] Copying 3 resources
[INFO] 
[INFO] --- maven-compiler-plugin:2.5.1:testCompile (default-testCompile) @ cloud-plugin-storage-image-sample
---
[INFO] No sources to compile
[INFO] 
[INFO] --- maven-surefire-plugin:2.12:test (default-test) @ cloud-plugin-storage-image-sample
---
[INFO] Tests are skipped.
[INFO] 
[INFO] --- maven-jar-plugin:2.4:jar (default-jar) @ cloud-plugin-storage-image-sample ---
[INFO] Building jar: <http://jenkins.buildacloud.org/job/build-master-noredist/ws/plugins/storage/image/sample/target/cloud-plugin-storage-image-sample-4.6.0-SNAPSHOT.jar>
[INFO] 
[INFO] --- maven-site-plugin:3.3:attach-descriptor (attach-descriptor) @ cloud-plugin-storage-image-sample
---
[INFO] 
[INFO] --- maven-surefire-plugin:2.12:test (default) @ cloud-plugin-storage-image-sample ---
[INFO] Tests are skipped.
[INFO] 
[INFO] --- maven-install-plugin:2.3.1:install (default-install) @ cloud-plugin-storage-image-sample
---
[INFO] Installing <http://jenkins.buildacloud.org/job/build-master-noredist/ws/plugins/storage/image/sample/target/cloud-plugin-storage-image-sample-4.6.0-SNAPSHOT.jar>
to /jenkins/.m2/repository/org/apache/cloudstack/cloud-plugin-storage-image-sample/4.6.0-SNAPSHOT/cloud-plugin-storage-image-sample-4.6.0-SNAPSHOT.jar
[INFO] Installing <http://jenkins.buildacloud.org/job/build-master-noredist/ws/plugins/storage/image/sample/pom.xml>
to /jenkins/.m2/repository/org/apache/cloudstack/cloud-plugin-storage-image-sample/4.6.0-SNAPSHOT/cloud-plugin-storage-image-sample-4.6.0-SNAPSHOT.pom
Running com.cloud.hypervisor.vmware.resource.VmwareResourceTest
[INFO] 
[INFO] --- maven-resources-plugin:2.5:testResources (default-testResources) @ cloud-plugin-storage-image-default
---
[debug] execute contextualize
[INFO] Using 'UTF-8' encoding to copy filtered resources.
[INFO] skip non existing resourceDirectory <http://jenkins.buildacloud.org/job/build-master-noredist/ws/plugins/storage/image/default/test/resources>
[INFO] Copying 3 resources
[INFO] 
[INFO] --- maven-compiler-plugin:2.5.1:testCompile (default-testCompile) @ cloud-plugin-storage-image-default
---
[INFO] No sources to compile
[INFO] 
[INFO] --- maven-surefire-plugin:2.12:test (default-test) @ cloud-plugin-storage-image-default
---
[INFO] Tests are skipped.
[INFO] 
[INFO] --- maven-jar-plugin:2.4:jar (default-jar) @ cloud-plugin-storage-image-default ---
[INFO] Building jar: <http://jenkins.buildacloud.org/job/build-master-noredist/ws/plugins/storage/image/default/target/cloud-plugin-storage-image-default-4.6.0-SNAPSHOT.jar>
[INFO] 
[INFO] --- maven-site-plugin:3.3:attach-descriptor (attach-descriptor) @ cloud-plugin-storage-image-default
---
[INFO] 
[INFO] --- maven-surefire-plugin:2.12:test (default) @ cloud-plugin-storage-image-default
---
[INFO] Tests are skipped.
[INFO] 
[INFO] --- maven-install-plugin:2.3.1:install (default-install) @ cloud-plugin-storage-image-default
---
[INFO] Installing <http://jenkins.buildacloud.org/job/build-master-noredist/ws/plugins/storage/image/default/target/cloud-plugin-storage-image-default-4.6.0-SNAPSHOT.jar>
to /jenkins/.m2/repository/org/apache/cloudstack/cloud-plugin-storage-image-default/4.6.0-SNAPSHOT/cloud-plugin-storage-image-default-4.6.0-SNAPSHOT.jar
[INFO] Installing <http://jenkins.buildacloud.org/job/build-master-noredist/ws/plugins/storage/image/default/pom.xml>
to /jenkins/.m2/repository/org/apache/cloudstack/cloud-plugin-storage-image-default/4.6.0-SNAPSHOT/cloud-plugin-storage-image-default-4.6.0-SNAPSHOT.pom
log4j:WARN No appenders could be found for logger (com.cloud.serializer.GsonHelper).
log4j:WARN Please initialize the log4j system properly.
log4j:WARN See http://logging.apache.org/log4j/1.2/faq.html#noconfig for more info.
Tests run: 1, Failures: 0, Errors: 0, Skipped: 0, Time elapsed: 1.358 sec
Running com.cloud.hypervisor.vmware.VmwareDatacenterApiUnitTest
[INFO] ------------------------------------------------------------------------
[INFO] Reactor Summary:
[INFO] 
[INFO] Apache CloudStack Developer Tools - Checkstyle Configuration  SUCCESS [1.351s]
[INFO] Apache CloudStack ................................. SUCCESS [1.838s]
[INFO] Apache CloudStack Maven Conventions Parent ........ SUCCESS [1.180s]
[INFO] Apache CloudStack Framework - Managed Context ..... SUCCESS [4.715s]
[INFO] Apache CloudStack Utils ........................... SUCCESS [12.823s]
[INFO] Apache CloudStack Framework ....................... SUCCESS [0.204s]
[INFO] Apache CloudStack Framework - Event Notification .. SUCCESS [9.580s]
[INFO] Apache CloudStack Framework - Configuration ....... SUCCESS [3.736s]
[INFO] Apache CloudStack API ............................. SUCCESS [12.400s]
[INFO] Apache CloudStack Framework - REST ................ SUCCESS [5.644s]
[INFO] Apache CloudStack Framework - IPC ................. SUCCESS [4.769s]
[INFO] Apache CloudStack Cloud Engine .................... SUCCESS [0.433s]
[INFO] Apache CloudStack Cloud Engine API ................ SUCCESS [5.026s]
[INFO] Apache CloudStack Framework - Security ............ SUCCESS [3.070s]
[INFO] Apache CloudStack Core ............................ SUCCESS [19.112s]
[INFO] Apache CloudStack Agents .......................... SUCCESS [7.251s]
[INFO] Apache CloudStack Framework - Clustering .......... SUCCESS [3.956s]
[INFO] Apache CloudStack Framework - Event Notification .. SUCCESS [3.797s]
[INFO] Apache CloudStack Cloud Engine Schema Component ... SUCCESS [14.170s]
[INFO] Apache CloudStack Framework - Jobs ................ SUCCESS [6.037s]
[INFO] Apache CloudStack Cloud Engine Internal Components API  SUCCESS [3.216s]
[INFO] Apache CloudStack Server .......................... SUCCESS [35.638s]
[INFO] Apache CloudStack Usage Server .................... SUCCESS [9.243s]
[INFO] Apache CloudStack Cloud Engine Orchestration Component  SUCCESS [10.676s]
[INFO] Apache CloudStack Cloud Services .................. SUCCESS [0.431s]
[INFO] Apache CloudStack Secondary Storage ............... SUCCESS [3.189s]
[INFO] Apache CloudStack Secondary Storage Service ....... SUCCESS [12.343s]
[INFO] Apache CloudStack Engine Storage Component ........ SUCCESS [16.040s]
[INFO] Apache CloudStack Engine Storage Volume Component . SUCCESS [15.753s]
[INFO] Apache CloudStack Engine Storage Image Component .. SUCCESS [11.707s]
[INFO] Apache CloudStack Engine Storage Data Motion Component  SUCCESS [9.528s]
[INFO] Apache CloudStack Engine Storage Cache Component .. SUCCESS [8.866s]
[INFO] Apache CloudStack Engine Storage Snapshot Component  SUCCESS [22.107s]
[INFO] Apache CloudStack Cloud Engine API ................ SUCCESS [3.761s]
[INFO] Apache CloudStack Cloud Engine Service ............ SUCCESS [20.152s]
[INFO] Apache CloudStack Plugin POM ...................... SUCCESS [0.449s]
[INFO] Apache CloudStack Plugin - API Rate Limit ......... SUCCESS [20.212s]
[INFO] Apache CloudStack Plugin - Storage Volume default provider  SUCCESS [7.670s]
[INFO] Apache CloudStack Plugin - Storage Volume SolidFire Provider  SKIPPED
[INFO] Apache CloudStack Plugin - API SolidFire .......... SKIPPED
[INFO] Apache CloudStack Plugin - API Discovery .......... SUCCESS [15.176s]
[INFO] Apache CloudStack Plugin - ACL Static Role Based .. SUCCESS [8.368s]
[INFO] Apache CloudStack Plugin - Host Anti-Affinity Processor  SUCCESS [8.358s]
[INFO] Apache CloudStack Plugin - Explicit Dedication Processor  SUCCESS [8.363s]
[INFO] Apache CloudStack Plugin - User Concentrated Pod Deployment Planner  SUCCESS [8.322s]
[INFO] Apache CloudStack Plugin - User Dispersing Deployment Planner  SUCCESS [7.315s]
[INFO] Apache CloudStack Plugin - Implicit Dedication Planner  SUCCESS [22.274s]
[INFO] Apache CloudStack Plugin - Skip Heurestics Planner  SUCCESS [7.652s]
[INFO] Apache CloudStack Plugin - Host Allocator Random .. SUCCESS [8.179s]
[INFO] Apache CloudStack Plugin - Dedicated Resources .... SUCCESS [19.460s]
[INFO] Apache CloudStack Plugin - Hypervisor OracleVM .... SUCCESS [8.900s]
[INFO] Apache CloudStack Plugin - Open vSwitch ........... SUCCESS [11.746s]
[INFO] Apache CloudStack Plugin - Hypervisor XenServer ... SUCCESS [29.614s]
[INFO] Apache CloudStack Plugin - Hypervisor KVM ......... SUCCESS [22.732s]
[INFO] Apache CloudStack Plugin - RabbitMQ Event Bus ..... SUCCESS [7.244s]
[INFO] Apache CloudStack Plugin - In Memory Event Bus .... SUCCESS [13.241s]
[INFO] Apache CloudStack Plugin - Hypervisor Baremetal ... SUCCESS [13.212s]
[INFO] Apache CloudStack Plugin - Hypervisor UCS ......... SUCCESS [10.096s]
[INFO] Apache CloudStack Plugin - Hypervisor Hyper-V ..... SUCCESS [16.454s]
[INFO] Apache CloudStack Plugin - Network Elastic Load Balancer  SUCCESS [15.810s]
[INFO] Apache CloudStack Plugin - Network Internal Load Balancer  SUCCESS [26.558s]
[INFO] Apache CloudStack Framework - Spring Life Cycle ... SUCCESS [2.637s]
[INFO] Apache CloudStack Plugin - Network Juniper Contrail  FAILURE [0.151s]
[INFO] Apache CloudStack Plugin - Palo Alto .............. SUCCESS [22.904s]
[INFO] Apache CloudStack Plugin - Network Netscaler ...... SUCCESS [13.326s]
[INFO] Apache CloudStack Plugin - Network Nicira NVP ..... SUCCESS [32.374s]
[INFO] Apache CloudStack Plugin - BigSwitch Virtual Network Segment  SUCCESS [20.503s]
[INFO] Apache CloudStack Plugin - Network Brocade VCS .... SUCCESS [25.884s]
[INFO] Apache CloudStack Plugin - Midokura Midonet ....... SUCCESS [21.380s]
[INFO] Apache CloudStack Plugin - Stratosphere SSP ....... SUCCESS [17.895s]
[INFO] Apache CloudStack Plugin - Network Opendaylight ... SUCCESS [18.561s]
[INFO] Apache CloudStack Plugin - Storage Allocator Random  SUCCESS [7.880s]
[INFO] Apache CloudStack Plugin - User Authenticator LDAP  SUCCESS [11.007s]
[INFO] Apache CloudStack Plugin - User Authenticator MD5 . SUCCESS [13.278s]
[INFO] Apache CloudStack Plugin - User Authenticator Plain Text  SUCCESS [6.956s]
[INFO] Apache CloudStack Plugin - User Authenticator SAML2  SUCCESS [29.283s]
[INFO] Apache CloudStack Plugin - User Authenticator SHA256 Salted  SUCCESS [14.547s]
[INFO] Apache CloudStack Plugin - Dns Notifier Example ... SUCCESS [6.974s]
[INFO] Apache CloudStack Plugin - Storage Image S3 ....... SUCCESS [8.118s]
[INFO] Apache CloudStack Plugin - Storage Image Swift provider  SUCCESS [7.537s]
[INFO] Apache CloudStack Plugin - Storage Image default provider  SUCCESS [6.204s]
[INFO] Apache CloudStack Plugin - Storage Image sample provider  SUCCESS [5.558s]
[INFO] Apache CloudStack Plugin - Storage Volume Nexenta Provider  SUCCESS [12.818s]
[INFO] Apache CloudStack Plugin - Storage Volume CloudByte Provider  SKIPPED
[INFO] Apache CloudStack Plugin - Storage Volume sample provider  SUCCESS [7.525s]
[INFO] Apache CloudStack Plugin - SNMP Alerts ............ SUCCESS [14.093s]
[INFO] Apache CloudStack Plugin - Syslog Alerts .......... SUCCESS [12.070s]
[INFO] Apache CloudStack Plugin - Network VXLAN .......... SUCCESS [15.740s]
[INFO] Apache CloudStack Plugin - GloboDNS ............... SUCCESS [21.289s]
[INFO] Apache CloudStack Plugin - NetApp File System ..... SUCCESS [9.097s]
[INFO] Apache CloudStack Plugin - F5 ..................... SUCCESS [9.391s]
[INFO] Apache CloudStack Plugin - Juniper SRX ............ SUCCESS [11.605s]
[INFO] Apache CloudStack Plugin - Nuage VSP .............. SUCCESS [17.883s]
[INFO] Apache CloudStack VMware Base ..................... SUCCESS [7.982s]
[INFO] Apache CloudStack Plugin - Hypervisor VMware ...... SKIPPED
[INFO] Apache CloudStack Plugin - Cisco VNMC ............. SKIPPED
[INFO] Apache CloudStack Plugin - MySQL HA Strategy ...... SUCCESS [6.564s]
[INFO] Apache CloudStack Framework - Spring Module ....... SUCCESS [9.102s]
[INFO] Apache CloudStack Secondary Storage Controller .... SUCCESS [7.510s]
[INFO] Apache CloudStack Console Proxy - RDP Client ...... SUCCESS [12.051s]
[INFO] Apache CloudStack Console Proxy ................... SUCCESS [3.184s]
[INFO] Apache CloudStack Console Proxy - Server .......... SUCCESS [7.440s]
[INFO] Apache CloudStack System VM ....................... SKIPPED
[INFO] Apache CloudStack Client UI ....................... SKIPPED
[INFO] Apache CloudStack Framework - QuickCloud .......... SUCCESS [1.290s]
[INFO] Apache CloudStack AWS API Bridge .................. SKIPPED
[INFO] ------------------------------------------------------------------------
[INFO] BUILD FAILURE
[INFO] ------------------------------------------------------------------------
[INFO] Total time: 4:04.593s (Wall Clock)
[INFO] Finished at: Thu Dec 11 13:52:55 CET 2014
[INFO] Final Memory: 102M/455M
[INFO] ------------------------------------------------------------------------
[INFO] 
[INFO] --- maven-resources-plugin:2.5:testResources (default-testResources) @ cloud-plugin-storage-volume-solidfire
---
[debug] execute contextualize
[INFO] Using 'UTF-8' encoding to copy filtered resources.
[INFO] skip non existing resourceDirectory <http://jenkins.buildacloud.org/job/build-master-noredist/ws/plugins/storage/volume/solidfire/test/resources>
[INFO] Copying 3 resources
[INFO] 
[INFO] --- maven-compiler-plugin:2.5.1:testCompile (default-testCompile) @ cloud-plugin-storage-volume-solidfire
---
[INFO] Compiling 4 source files to <http://jenkins.buildacloud.org/job/build-master-noredist/ws/plugins/storage/volume/solidfire/target/test-classes>
[ERROR] Failed to execute goal on project cloud-plugin-network-contrail: Could not resolve
dependencies for project org.apache.cloudstack:cloud-plugin-network-contrail:jar:4.6.0-SNAPSHOT:
Failure to find net.juniper.contrail:juniper-contrail-api:jar:1.0-SNAPSHOT in http://juniper.github.io/contrail-maven/snapshots
was cached in the local repository, resolution will not be reattempted until the update interval
of juniper-contrail has elapsed or updates are forced -> [Help 1]
[ERROR] 
[ERROR] To see the full stack trace of the errors, re-run Maven with the -e switch.
[ERROR] Re-run Maven using the -X switch to enable full debug logging.
[ERROR] 
[ERROR] For more information about the errors and possible solutions, please read the following
articles:
[ERROR] [Help 1] http://cwiki.apache.org/confluence/display/MAVEN/DependencyResolutionException
[ERROR] 
[ERROR] After correcting the problems, you can resume the build with the command
[ERROR]   mvn <goals> -rf :cloud-plugin-network-contrail
Build step 'Invoke top-level Maven targets' marked build as failure
Archiving artifacts

Mime
View raw message