cloudstack-dev mailing list archives

Site index · List index
Message view « Date » · « Thread »
Top « Date » · « Thread »
From jenk...@cloudstack.org
Subject Build failed in Jenkins: simulator-singlerun #852
Date Fri, 26 Dec 2014 07:18:24 GMT
See <http://jenkins.buildacloud.org/job/simulator-singlerun/852/changes>

Changes:

[likitha.shetty] CLOUDSTACK-8129. Cold migration of VM across VMware DCs leaves the VM behind
in the source host.

------------------------------------------
[...truncated 9043 lines...]
+ echo ''
+ rm -rf /tmp/MarvinLogs
+ echo Check for initialization of the management server
Check for initialization of the management server
+ COUNTER=0
+ SERVER_PID=26619
+ '[' 0 -lt 44 ']'
+ mvn -P systemvm,simulator -pl :cloud-client-ui jetty:run
+ grep -q 'Management server node 127.0.0.1 is up' jetty-output.out
+ sleep 5
+ COUNTER=1
+ '[' 1 -lt 44 ']'
+ grep -q 'Management server node 127.0.0.1 is up' jetty-output.out
+ sleep 5
+ COUNTER=2
+ '[' 2 -lt 44 ']'
+ grep -q 'Management server node 127.0.0.1 is up' jetty-output.out
+ sleep 5
+ COUNTER=3
+ '[' 3 -lt 44 ']'
+ grep -q 'Management server node 127.0.0.1 is up' jetty-output.out
+ sleep 5
+ COUNTER=4
+ '[' 4 -lt 44 ']'
+ grep -q 'Management server node 127.0.0.1 is up' jetty-output.out
+ sleep 5
+ COUNTER=5
+ '[' 5 -lt 44 ']'
+ grep -q 'Management server node 127.0.0.1 is up' jetty-output.out
+ sleep 5
+ COUNTER=6
+ '[' 6 -lt 44 ']'
+ grep -q 'Management server node 127.0.0.1 is up' jetty-output.out
+ sleep 5
+ COUNTER=7
+ '[' 7 -lt 44 ']'
+ grep -q 'Management server node 127.0.0.1 is up' jetty-output.out
+ sleep 5
+ COUNTER=8
+ '[' 8 -lt 44 ']'
+ grep -q 'Management server node 127.0.0.1 is up' jetty-output.out
+ sleep 5
+ COUNTER=9
+ '[' 9 -lt 44 ']'
+ grep -q 'Management server node 127.0.0.1 is up' jetty-output.out
+ sleep 5
+ COUNTER=10
+ '[' 10 -lt 44 ']'
+ grep -q 'Management server node 127.0.0.1 is up' jetty-output.out
+ sleep 5
+ COUNTER=11
+ '[' 11 -lt 44 ']'
+ grep -q 'Management server node 127.0.0.1 is up' jetty-output.out
+ sleep 5
+ COUNTER=12
+ '[' 12 -lt 44 ']'
+ grep -q 'Management server node 127.0.0.1 is up' jetty-output.out
+ sleep 5
+ COUNTER=13
+ '[' 13 -lt 44 ']'
+ grep -q 'Management server node 127.0.0.1 is up' jetty-output.out
+ sleep 5
+ COUNTER=14
+ '[' 14 -lt 44 ']'
+ grep -q 'Management server node 127.0.0.1 is up' jetty-output.out
+ sleep 5
+ COUNTER=15
+ '[' 15 -lt 44 ']'
+ grep -q 'Management server node 127.0.0.1 is up' jetty-output.out
+ sleep 5
+ COUNTER=16
+ '[' 16 -lt 44 ']'
+ grep -q 'Management server node 127.0.0.1 is up' jetty-output.out
+ sleep 5
+ COUNTER=17
+ '[' 17 -lt 44 ']'
+ grep -q 'Management server node 127.0.0.1 is up' jetty-output.out
+ sleep 5
+ COUNTER=18
+ '[' 18 -lt 44 ']'
+ grep -q 'Management server node 127.0.0.1 is up' jetty-output.out
+ sleep 5
+ COUNTER=19
+ '[' 19 -lt 44 ']'
+ grep -q 'Management server node 127.0.0.1 is up' jetty-output.out
+ sleep 5
+ COUNTER=20
+ '[' 20 -lt 44 ']'
+ grep -q 'Management server node 127.0.0.1 is up' jetty-output.out
+ sleep 5
+ COUNTER=21
+ '[' 21 -lt 44 ']'
+ grep -q 'Management server node 127.0.0.1 is up' jetty-output.out
+ sleep 5
+ COUNTER=22
+ '[' 22 -lt 44 ']'
+ grep -q 'Management server node 127.0.0.1 is up' jetty-output.out
+ sleep 5
+ COUNTER=23
+ '[' 23 -lt 44 ']'
+ grep -q 'Management server node 127.0.0.1 is up' jetty-output.out
+ sleep 5
+ COUNTER=24
+ '[' 24 -lt 44 ']'
+ grep -q 'Management server node 127.0.0.1 is up' jetty-output.out
+ sleep 5
+ COUNTER=25
+ '[' 25 -lt 44 ']'
+ grep -q 'Management server node 127.0.0.1 is up' jetty-output.out
+ sleep 5
+ COUNTER=26
+ '[' 26 -lt 44 ']'
+ grep -q 'Management server node 127.0.0.1 is up' jetty-output.out
+ sleep 5
+ COUNTER=27
+ '[' 27 -lt 44 ']'
+ grep -q 'Management server node 127.0.0.1 is up' jetty-output.out
+ sleep 5
+ COUNTER=28
+ '[' 28 -lt 44 ']'
+ grep -q 'Management server node 127.0.0.1 is up' jetty-output.out
+ sleep 5
+ COUNTER=29
+ '[' 29 -lt 44 ']'
+ grep -q 'Management server node 127.0.0.1 is up' jetty-output.out
+ sleep 5
+ COUNTER=30
+ '[' 30 -lt 44 ']'
+ grep -q 'Management server node 127.0.0.1 is up' jetty-output.out
+ sleep 5
+ COUNTER=31
+ '[' 31 -lt 44 ']'
+ grep -q 'Management server node 127.0.0.1 is up' jetty-output.out
+ break
+ grep -q 'Management server node 127.0.0.1 is up' jetty-output.out
+ echo Started OK pid 26619
Started OK pid 26619
+ sleep 20
+ export PYTHONPATH=<http://jenkins.buildacloud.org/job/simulator-singlerun/ws/tools/marvin>
+ PYTHONPATH=<http://jenkins.buildacloud.org/job/simulator-singlerun/ws/tools/marvin>
+ python2.6 tools/marvin/marvin/deployDataCenter.py -i setup/dev/advanced.cfg
/usr/lib/python2.6/site-packages/pycrypto-2.6-py2.6-linux-x86_64.egg/Crypto/Util/number.py:57:
PowmInsecureWarning: Not using mpz_powm_sec.  You should rebuild using libgmp >= 5 to avoid
timing attack vulnerability.
  _warn("Not using mpz_powm_sec.  You should rebuild using libgmp >= 5 to avoid timing
attack vulnerability.", PowmInsecureWarning)

==== Log Folder Path: /tmp//MarvinLogs//DeployDataCenter__Dec_26_2014_01_35_49_CP1MVP. All
logs will be available here ====

==== Deploy DC Started ====

=== Data Center Settings are dumped to /tmp//MarvinLogs//DeployDataCenter__Dec_26_2014_01_35_49_CP1MVP/dc_entries.obj===

====Deploy DC Successful=====
+ sleep 60
+ /usr/local/bin/nosetests-2.7 -v --with-marvin --marvin-config=setup/dev/advanced.cfg --with-xunit
--xunit-file=xunit.xml -a tags=advanced,required_hardware=false --zone=Sandbox-simulator --hypervisor=simulator
-w test/integration/smoke
====Trying SSH Connection: Host:192.168.2.5 User:root                                   Port:22
RetryCnt:2===
SshClient: Exception under createConnection: ['Traceback (most recent call last):\n', '  File
"<http://jenkins.buildacloud.org/job/simulator-singlerun/ws/tools/marvin/marvin/sshClient.py",>
line 121, in createConnection\n    timeout=self.timeout)\n', '  File "/usr/local/lib/python2.7/site-packages/paramiko-1.13.0-py2.7.egg/paramiko/client.py",
line 236, in connect\n    retry_on_signal(lambda: sock.connect(addr))\n', '  File "/usr/local/lib/python2.7/site-packages/paramiko-1.13.0-py2.7.egg/paramiko/util.py",
line 279, in retry_on_signal\n    return function()\n', '  File "/usr/local/lib/python2.7/site-packages/paramiko-1.13.0-py2.7.egg/paramiko/client.py",
line 236, in <lambda>\n    retry_on_signal(lambda: sock.connect(addr))\n', '  File "/usr/local/lib/python2.7/socket.py",
line 222, in meth\n    return getattr(self._sock,name)(*args)\n', 'timeout: timed out\n']
Traceback (most recent call last):
  File "<http://jenkins.buildacloud.org/job/simulator-singlerun/ws/tools/marvin/marvin/sshClient.py",>
line 121, in createConnection
    timeout=self.timeout)
  File "/usr/local/lib/python2.7/site-packages/paramiko-1.13.0-py2.7.egg/paramiko/client.py",
line 236, in connect
    retry_on_signal(lambda: sock.connect(addr))
  File "/usr/local/lib/python2.7/site-packages/paramiko-1.13.0-py2.7.egg/paramiko/util.py",
line 279, in retry_on_signal
    return function()
  File "/usr/local/lib/python2.7/site-packages/paramiko-1.13.0-py2.7.egg/paramiko/client.py",
line 236, in <lambda>
    retry_on_signal(lambda: sock.connect(addr))
  File "/usr/local/lib/python2.7/socket.py", line 222, in meth
    return getattr(self._sock,name)(*args)
timeout: timed out
====Trying SSH Connection: Host:192.168.2.5 User:root                                   Port:22
RetryCnt:1===
SshClient: Exception under createConnection: ['Traceback (most recent call last):\n', '  File
"<http://jenkins.buildacloud.org/job/simulator-singlerun/ws/tools/marvin/marvin/sshClient.py",>
line 121, in createConnection\n    timeout=self.timeout)\n', '  File "/usr/local/lib/python2.7/site-packages/paramiko-1.13.0-py2.7.egg/paramiko/client.py",
line 236, in connect\n    retry_on_signal(lambda: sock.connect(addr))\n', '  File "/usr/local/lib/python2.7/site-packages/paramiko-1.13.0-py2.7.egg/paramiko/util.py",
line 279, in retry_on_signal\n    return function()\n', '  File "/usr/local/lib/python2.7/site-packages/paramiko-1.13.0-py2.7.egg/paramiko/client.py",
line 236, in <lambda>\n    retry_on_signal(lambda: sock.connect(addr))\n', '  File "/usr/local/lib/python2.7/socket.py",
line 222, in meth\n    return getattr(self._sock,name)(*args)\n', 'timeout: timed out\n']
Traceback (most recent call last):
  File "<http://jenkins.buildacloud.org/job/simulator-singlerun/ws/tools/marvin/marvin/sshClient.py",>
line 121, in createConnection
    timeout=self.timeout)
  File "/usr/local/lib/python2.7/site-packages/paramiko-1.13.0-py2.7.egg/paramiko/client.py",
line 236, in connect
    retry_on_signal(lambda: sock.connect(addr))
  File "/usr/local/lib/python2.7/site-packages/paramiko-1.13.0-py2.7.egg/paramiko/util.py",
line 279, in retry_on_signal
    return function()
  File "/usr/local/lib/python2.7/site-packages/paramiko-1.13.0-py2.7.egg/paramiko/client.py",
line 236, in <lambda>
    retry_on_signal(lambda: sock.connect(addr))
  File "/usr/local/lib/python2.7/socket.py", line 222, in meth
    return getattr(self._sock,name)(*args)
timeout: timed out
====Trying SSH Connection: Host:192.168.2.5 User:root                                   Port:22
RetryCnt:0===

==== Marvin Init Started ====

=== Marvin Parse Config Successful ===

=== Marvin Setting TestData Successful===

==== Log Folder Path: /tmp//MarvinLogs//Dec_26_2014_01_39_42_0N1S59. All logs will be available
here ====

=== Marvin Init Logging Successful===

==== Marvin Init Successful ====
Traceback (most recent call last):
  File "/usr/local/bin/nosetests-2.7", line 9, in <module>
    load_entry_point('nose==1.3.3', 'console_scripts', 'nosetests-2.7')()
  File "/usr/local/lib/python2.7/site-packages/nose-1.3.3-py2.7.egg/nose/core.py", line 121,
in __init__
    **extra_args)
  File "/usr/local/lib/python2.7/unittest/main.py", line 95, in __init__
    self.runTests()
  File "/usr/local/lib/python2.7/site-packages/nose-1.3.3-py2.7.egg/nose/core.py", line 207,
in runTests
    result = self.testRunner.run(self.test)
  File "/usr/local/lib/python2.7/site-packages/nose-1.3.3-py2.7.egg/nose/core.py", line 66,
in run
    result.printErrors()
  File "/usr/local/lib/python2.7/site-packages/nose-1.3.3-py2.7.egg/nose/result.py", line
110, in printErrors
    self.config.plugins.report(self.stream)
  File "/usr/local/lib/python2.7/site-packages/nose-1.3.3-py2.7.egg/nose/plugins/manager.py",
line 99, in __call__
    return self.call(*arg, **kw)
  File "/usr/local/lib/python2.7/site-packages/nose-1.3.3-py2.7.egg/nose/plugins/manager.py",
line 167, in simple
    result = meth(*arg, **kw)
  File "/usr/local/lib/python2.7/site-packages/nose-1.3.3-py2.7.egg/nose/plugins/xunit.py",
line 209, in report
    for e in self.errorlist]))
  File "/usr/local/lib/python2.7/codecs.py", line 691, in write
    return self.writer.write(data)
  File "/usr/local/lib/python2.7/codecs.py", line 352, in write
    self.stream.write(data)
IOError: [Errno 28] No space left on device
+ mvn -P systemvm,simulator -pl :cloud-client-ui jetty:stop
[INFO] Scanning for projects...
[INFO]                                                                         
[INFO] ------------------------------------------------------------------------
[INFO] Building Apache CloudStack Client UI 4.6.0-SNAPSHOT
[INFO] ------------------------------------------------------------------------
[INFO] 
[INFO] --- jetty-maven-plugin:9.2.6.v20141205:stop (default-cli) @ cloud-client-ui ---
[INFO] ------------------------------------------------------------------------
[INFO] BUILD SUCCESS
[INFO] ------------------------------------------------------------------------
[INFO] Total time: 6.886s
[INFO] Finished at: Fri Dec 26 02:18:55 EST 2014
[INFO] Final Memory: 26M/113M
[INFO] ------------------------------------------------------------------------
+ sleep 10
+ kill -KILL 26619
/tmp/hudson7175415794071963462.sh: line 44: kill: (26619) - No such process
+ rm -rf '*.log.*'
[locks-and-latches] Releasing all the locks
[locks-and-latches] All the locks released
[xUnit] [INFO] - Starting to record.
[xUnit] [INFO] - Processing JUnit
[xUnit] [WARNING] - Can't create the path <http://jenkins.buildacloud.org/job/simulator-singlerun/ws/generatedJUnitFiles.>
Maybe the directory already exists.
[xUnit] [INFO] - [JUnit] - 1 test report file(s) were found with the pattern 'xunit.xml' relative
to '<http://jenkins.buildacloud.org/job/simulator-singlerun/ws/'> for the testing framework
'JUnit'.
[xUnit] [ERROR] - The result file '<http://jenkins.buildacloud.org/job/simulator-singlerun/ws/xunit.xml'>
for the metric 'JUnit' is empty. The result file has been skipped.
[xUnit] [INFO] - Failing BUILD because 'set build failed if errors' option is activated.
[xUnit] [INFO] - There are errors when processing test results.
[xUnit] [INFO] - Skipping tests recording.
[xUnit] [INFO] - Stop build.
Build step 'Publish xUnit test result report' changed build result to FAILURE

Mime
View raw message