cloudstack-dev mailing list archives

Site index · List index
Message view « Date » · « Thread »
Top « Date » · « Thread »
From Daan Hoogland <daan.hoogl...@gmail.com>
Subject certificate error (was: Build failed in Jenkins: cloudstack-4.4-maven-build #485)
Date Sun, 09 Nov 2014 12:42:19 GMT
Wasn't this fixed? Does someone know if we can merge something into
4.4 for this?


On Sun, Nov 9, 2014 at 1:33 PM,  <jenkins@cloudstack.org> wrote:
> See <http://jenkins.buildacloud.org/job/cloudstack-4.4-maven-build/485/changes>
>
> Changes:
>
> [Daan Hoogland] Logrotate is called from crontab. Debian crontab does not include everything
in it's path. Therefore reference to these bins need to be absoluut.
>
> ------------------------------------------
> [...truncated 1334 lines...]
> [INFO] Using 'UTF-8' encoding to copy filtered resources.
> [INFO] Copying 30 resources
> [INFO] Copying 3 resources
> [INFO]
> [INFO] --- maven-compiler-plugin:2.5.1:compile (default-compile) @ cloud-server ---
> [INFO] Compiling 360 source files to <http://jenkins.buildacloud.org/job/cloudstack-4.4-maven-build/ws/server/target/classes>
> [INFO]
> [INFO] --- maven-resources-plugin:2.5:testResources (default-testResources) @ cloud-server
---
> [debug] execute contextualize
> [INFO] Using 'UTF-8' encoding to copy filtered resources.
> [INFO] Copying 29 resources
> [INFO] Copying 3 resources
> [INFO]
> [INFO] --- maven-compiler-plugin:2.5.1:testCompile (default-testCompile) @ cloud-server
---
> [INFO] Compiling 82 source files to <http://jenkins.buildacloud.org/job/cloudstack-4.4-maven-build/ws/server/target/test-classes>
> [INFO]
> [INFO] --- maven-surefire-plugin:2.12:test (default-test) @ cloud-server ---
> [INFO] Surefire report directory: <http://jenkins.buildacloud.org/job/cloudstack-4.4-maven-build/ws/server/target/surefire-reports>
>
> -------------------------------------------------------
>  T E S T S
> -------------------------------------------------------
> Running org.apache.cloudstack.region.gslb.GlobalLoadBalancingRulesServiceImplTest
> log4j:WARN No appenders could be found for logger (org.apache.cloudstack.region.gslb.GlobalLoadBalancingRulesServiceImplTest).
> log4j:WARN Please initialize the log4j system properly.
> log4j:WARN See http://logging.apache.org/log4j/1.2/faq.html#noconfig for more info.
> Tests run: 4, Failures: 0, Errors: 0, Skipped: 0, Time elapsed: 4.902 sec
> Running org.apache.cloudstack.region.RegionManagerTest
> Tests run: 2, Failures: 0, Errors: 0, Skipped: 0, Time elapsed: 0.113 sec
> Running org.apache.cloudstack.service.ServiceOfferingVOTest
> Tests run: 2, Failures: 0, Errors: 0, Skipped: 0, Time elapsed: 0.186 sec
> Running org.apache.cloudstack.affinity.AffinityApiUnitTest
> Tests run: 7, Failures: 0, Errors: 0, Skipped: 0, Time elapsed: 8.972 sec
> Running org.apache.cloudstack.privategw.AclOnPrivateGwTest
> Tests run: 2, Failures: 0, Errors: 0, Skipped: 0, Time elapsed: 7.998 sec
> Running org.apache.cloudstack.network.lb.CertServiceTest
> Tests run: 15, Failures: 5, Errors: 3, Skipped: 0, Time elapsed: 12.586 sec <<<
FAILURE!
> Running org.apache.cloudstack.network.lb.ApplicationLoadBalancerTest
> Tests run: 11, Failures: 0, Errors: 0, Skipped: 0, Time elapsed: 3.7 sec
> Running org.apache.cloudstack.networkoffering.CreateNetworkOfferingTest
> Tests run: 10, Failures: 0, Errors: 0, Skipped: 0, Time elapsed: 55.328 sec
> Running com.cloud.template.TemplateManagerImplTest
> Tests run: 1, Failures: 0, Errors: 0, Skipped: 0, Time elapsed: 0.146 sec
> Running com.cloud.keystore.KeystoreTest
> org.apache.cloudstack.api.response.UserVmResponse/null/{"id":"3","securitygroup":[],"nic":[],"tags":[],"affinitygroup":[]}
> org.apache.cloudstack.api.response.AlertResponse/null/{"id":"100","description":"Hello"}
> Tests run: 1, Failures: 0, Errors: 0, Skipped: 0, Time elapsed: 1.307 sec
> Running com.cloud.server.ConfigurationServerImplTest
> Tests run: 3, Failures: 0, Errors: 0, Skipped: 0, Time elapsed: 0.167 sec
> Running com.cloud.event.EventControlsUnitTest
> Tests run: 1, Failures: 0, Errors: 0, Skipped: 0, Time elapsed: 0.756 sec
> Running com.cloud.resourcelimit.ResourceLimitManagerImplTest
> Tests run: 1, Failures: 0, Errors: 0, Skipped: 0, Time elapsed: 0.014 sec
> Running com.cloud.api.dispatch.ParamGenericValidationWorkerTest
> Tests run: 4, Failures: 0, Errors: 0, Skipped: 0, Time elapsed: 0.247 sec
> Running com.cloud.api.dispatch.ParamProcessWorkerTest
> Tests run: 1, Failures: 0, Errors: 0, Skipped: 0, Time elapsed: 0.183 sec
> Running com.cloud.api.dispatch.CommandCreationWorkerTest
> Tests run: 1, Failures: 0, Errors: 0, Skipped: 0, Time elapsed: 0.216 sec
> Running com.cloud.api.dispatch.DispatchChainFactoryTest
> Tests run: 1, Failures: 0, Errors: 0, Skipped: 0, Time elapsed: 0.045 sec
> Running com.cloud.api.dispatch.SpecificCmdValidationWorkerTest
> Tests run: 1, Failures: 0, Errors: 0, Skipped: 0, Time elapsed: 0.056 sec
> Running com.cloud.alert.AlertControlsUnitTest
> Tests run: 1, Failures: 0, Errors: 0, Skipped: 0, Time elapsed: 0.118 sec
> Running com.cloud.ha.KVMFencerTest
> Tests run: 6, Failures: 0, Errors: 0, Skipped: 0, Time elapsed: 0.716 sec
> Running com.cloud.capacity.CapacityManagerTest
> Tests run: 1, Failures: 0, Errors: 0, Skipped: 0, Time elapsed: 0.512 sec
> Running com.cloud.vm.snapshot.VMSnapshotManagerTest
> Tests run: 7, Failures: 0, Errors: 0, Skipped: 0, Time elapsed: 2.243 sec
> Running com.cloud.vm.UserVmManagerTest
> Tests run: 9, Failures: 0, Errors: 0, Skipped: 0, Time elapsed: 3.395 sec
> Running com.cloud.vm.DeploymentPlanningManagerImplTest
> Tests run: 3, Failures: 0, Errors: 0, Skipped: 0, Time elapsed: 5.723 sec
> Running com.cloud.network.NetworkModelTest
> Tests run: 1, Failures: 0, Errors: 0, Skipped: 0, Time elapsed: 0.337 sec
> Running com.cloud.network.security.SecurityGroupManagerImplTest
> Tests run: 4, Failures: 0, Errors: 0, Skipped: 0, Time elapsed: 10.513 sec
> Running com.cloud.network.security.SecurityGroupQueueTest
> Total jobs dequeued = 10, num queued=1000 queue current size=990
> Num Vms= 50 Queue size = 50
> Num Vms= 20000 Queue size = 20000 time=27286 ms
> Num Vms= 5000 Queue size = 5000 time=12939 ms
> Num Vms= 1 Queue size = 1 time=20 ms
> Num Vms= 1000000 Queue size = 1000000 time=7143 ms
> Num Vms= 1 Queue size = 1 time=7263 ms
> Total jobs dequeued = 10, num queued=1010 queue current size=1000
> Total jobs dequeued = 1, num queued=1001 queue current size=1000
> Total jobs dequeued = 10, num queued=1000 queue current size=990
> Total jobs dequeued = 10, num queued=10 queue current size=0
> Tests run: 4, Failures: 0, Errors: 0, Skipped: 0, Time elapsed: 57.193 sec
> Running com.cloud.network.UpdatePhysicalNetworkTest
> Tests run: 1, Failures: 0, Errors: 0, Skipped: 0, Time elapsed: 0.075 sec
> Running com.cloud.network.DedicateGuestVlanRangesTest
> Tests run: 2, Failures: 0, Errors: 0, Skipped: 0, Time elapsed: 0.101 sec
> Running com.cloud.network.CreatePrivateNetworkTest
> Tests run: 1, Failures: 0, Errors: 0, Skipped: 0, Time elapsed: 0.066 sec
> Running com.cloud.network.lb.AssignLoadBalancerTest
> Tests run: 4, Failures: 0, Errors: 0, Skipped: 0, Time elapsed: 0.392 sec
> Running com.cloud.network.firewall.FirewallManagerTest
> Tests run: 1, Failures: 0, Errors: 0, Skipped: 1, Time elapsed: 0.018 sec
> Running com.cloud.network.dao.NetworkDaoTest
> Tests run: 2, Failures: 0, Errors: 0, Skipped: 0, Time elapsed: 0.02 sec
> Running com.cloud.network.vpc.VpcManagerImplTest
> Tests run: 1, Failures: 0, Errors: 0, Skipped: 0, Time elapsed: 0.044 sec
> Running com.cloud.vpc.Site2SiteVpnTest
> Tests run: 1, Failures: 0, Errors: 0, Skipped: 0, Time elapsed: 20.096 sec
> Running com.cloud.vpc.NetworkACLServiceTest
> Tests run: 5, Failures: 0, Errors: 0, Skipped: 0, Time elapsed: 1.299 sec
> Running com.cloud.vpc.NetworkACLManagerTest
> Tests run: 6, Failures: 0, Errors: 0, Skipped: 0, Time elapsed: 1.127 sec
> Running com.cloud.configuration.ValidateIpRangeTest
> Tests run: 3, Failures: 0, Errors: 0, Skipped: 0, Time elapsed: 0.073 sec
> Running com.cloud.configuration.ConfigurationManagerTest
> Tests run: 8, Failures: 0, Errors: 0, Skipped: 0, Time elapsed: 0.302 sec
>
> Results :
>
> Failed tests:   runUploadSslCertBadkeyAlgo(org.apache.cloudstack.network.lb.CertServiceTest)
>   runUploadSslCertBadkeyPair(org.apache.cloudstack.network.lb.CertServiceTest)
>   runUploadSslCertBadChain(org.apache.cloudstack.network.lb.CertServiceTest)
>   runUploadSslCertNoRootCert(org.apache.cloudstack.network.lb.CertServiceTest)
>   runUploadSslCertNoChain(org.apache.cloudstack.network.lb.CertServiceTest)
>
> Tests in error:
>   runUploadSslCertWithCAChain(org.apache.cloudstack.network.lb.CertServiceTest): Error
parsing certificate data Certificate expired or not valid
>   runUploadSslCertSelfSignedNoPassword(org.apache.cloudstack.network.lb.CertServiceTest):
Error parsing certificate data Certificate expired or not valid
>   runUploadSslCertSelfSignedWithPassword(org.apache.cloudstack.network.lb.CertServiceTest):
Error parsing certificate data Certificate expired or not valid
>
> Tests run: 139, Failures: 5, Errors: 3, Skipped: 1
>
> [INFO] ------------------------------------------------------------------------
> [INFO] Reactor Summary:
> [INFO]
> [INFO] Apache CloudStack Developer Tools - Checkstyle Configuration  SUCCESS [2.960s]
> [INFO] Apache CloudStack ................................. SUCCESS [2.672s]
> [INFO] Apache CloudStack Maven Conventions Parent ........ SUCCESS [7.685s]
> [INFO] Apache CloudStack Framework - Managed Context ..... SUCCESS [15.474s]
> [INFO] Apache CloudStack Utils ........................... SUCCESS [47.914s]
> [INFO] Apache CloudStack Framework ....................... SUCCESS [0.131s]
> [INFO] Apache CloudStack Framework - Event Notification .. SUCCESS [19.255s]
> [INFO] Apache CloudStack Framework - Configuration ....... SUCCESS [22.425s]
> [INFO] Apache CloudStack API ............................. SUCCESS [43.962s]
> [INFO] Apache CloudStack Framework - REST ................ SUCCESS [8.357s]
> [INFO] Apache CloudStack Framework - IPC ................. SUCCESS [16.610s]
> [INFO] Apache CloudStack Cloud Engine .................... SUCCESS [0.155s]
> [INFO] Apache CloudStack Cloud Engine API ................ SUCCESS [16.620s]
> [INFO] Apache CloudStack Framework - Security ............ SUCCESS [6.111s]
> [INFO] Apache CloudStack Core ............................ SUCCESS [46.267s]
> [INFO] Apache CloudStack Agents .......................... SUCCESS [25.253s]
> [INFO] Apache CloudStack Framework - Clustering .......... SUCCESS [11.904s]
> [INFO] Apache CloudStack Framework - Event Notification .. SUCCESS [6.147s]
> [INFO] Apache CloudStack Cloud Engine Schema Component ... SUCCESS [1:04.622s]
> [INFO] Apache CloudStack Framework - Jobs ................ SUCCESS [16.650s]
> [INFO] Apache CloudStack Cloud Engine Internal Components API  SUCCESS [8.593s]
> [INFO] Apache CloudStack Server .......................... FAILURE [4:54.817s]
> [INFO] Apache CloudStack Usage Server .................... SKIPPED
> [INFO] Apache XenSource XAPI ............................. SKIPPED
> [INFO] Apache CloudStack Cloud Engine Orchestration Component  SKIPPED
> [INFO] Apache CloudStack Cloud Services .................. SKIPPED
> [INFO] Apache CloudStack Secondary Storage ............... SKIPPED
> [INFO] Apache CloudStack Secondary Storage Service ....... SKIPPED
> [INFO] Apache CloudStack Engine Storage Component ........ SKIPPED
> [INFO] Apache CloudStack Engine Storage Volume Component . SKIPPED
> [INFO] Apache CloudStack Engine Storage Image Component .. SKIPPED
> [INFO] Apache CloudStack Engine Storage Data Motion Component  SKIPPED
> [INFO] Apache CloudStack Engine Storage Cache Component .. SKIPPED
> [INFO] Apache CloudStack Engine Storage Snapshot Component  SKIPPED
> [INFO] Apache CloudStack Cloud Engine API ................ SKIPPED
> [INFO] Apache CloudStack Cloud Engine Service ............ SKIPPED
> [INFO] Apache CloudStack Plugin POM ...................... SKIPPED
> [INFO] Apache CloudStack Plugin - API Rate Limit ......... SKIPPED
> [INFO] Apache CloudStack Plugin - API Discovery .......... SKIPPED
> [INFO] Apache CloudStack Plugin - ACL Static Role Based .. SKIPPED
> [INFO] Apache CloudStack Plugin - Host Anti-Affinity Processor  SKIPPED
> [INFO] Apache CloudStack Plugin - Explicit Dedication Processor  SKIPPED
> [INFO] Apache CloudStack Plugin - User Concentrated Pod Deployment Planner  SKIPPED
> [INFO] Apache CloudStack Plugin - User Dispersing Deployment Planner  SKIPPED
> [INFO] Apache CloudStack Plugin - Implicit Dedication Planner  SKIPPED
> [INFO] Apache CloudStack Plugin - Skip Heurestics Planner  SKIPPED
> [INFO] Apache CloudStack Plugin - Host Allocator Random .. SKIPPED
> [INFO] Apache CloudStack Plugin - Dedicated Resources .... SKIPPED
> [INFO] Apache CloudStack Plugin - Hypervisor OracleVM .... SKIPPED
> [INFO] Apache CloudStack Plugin - Open vSwitch ........... SKIPPED
> [INFO] Apache CloudStack Plugin - Hypervisor Xen ......... SKIPPED
> [INFO] Apache CloudStack Plugin - Hypervisor KVM ......... SKIPPED
> [INFO] Apache CloudStack Plugin - RabbitMQ Event Bus ..... SKIPPED
> [INFO] Apache CloudStack Plugin - In Memory Event Bus .... SKIPPED
> [INFO] Apache CloudStack Plugin - Hypervisor Baremetal ... SKIPPED
> [INFO] Apache CloudStack Plugin - Hypervisor UCS ......... SKIPPED
> [INFO] Apache CloudStack Plugin - Hypervisor Hyper-V ..... SKIPPED
> [INFO] Apache CloudStack Plugin - Network Elastic Load Balancer  SKIPPED
> [INFO] Apache CloudStack Plugin - Network Internal Load Balancer  SKIPPED
> [INFO] Apache CloudStack Framework - Spring Life Cycle ... SKIPPED
> [INFO] Apache CloudStack Plugin - Network Juniper Contrail  SKIPPED
> [INFO] Apache CloudStack Plugin - Palo Alto .............. SKIPPED
> [INFO] Apache CloudStack Plugin - Network Netscaler ...... SKIPPED
> [INFO] Apache CloudStack Plugin - Network Nicira NVP ..... SKIPPED
> [INFO] Apache CloudStack Plugin - BigSwitch Virtual Network Segment  SKIPPED
> [INFO] Apache CloudStack Plugin - Midokura Midonet ....... SKIPPED
> [INFO] Apache CloudStack Plugin - Stratosphere SSP ....... SKIPPED
> [INFO] Apache CloudStack Plugin - Network Opendaylight ... SKIPPED
> [INFO] Apache CloudStack Plugin - Storage Allocator Random  SKIPPED
> [INFO] Apache CloudStack Plugin - User Authenticator LDAP  SKIPPED
> [INFO] Apache CloudStack Plugin - User Authenticator MD5 . SKIPPED
> [INFO] Apache CloudStack Plugin - User Authenticator Plain Text  SKIPPED
> [INFO] Apache CloudStack Plugin - User Authenticator SHA256 Salted  SKIPPED
> [INFO] Apache CloudStack Plugin - Dns Notifier Example ... SKIPPED
> [INFO] Apache CloudStack Plugin - Storage Image S3 ....... SKIPPED
> [INFO] Apache CloudStack Plugin - Storage Image Swift provider  SKIPPED
> [INFO] Apache CloudStack Plugin - Storage Image default provider  SKIPPED
> [INFO] Apache CloudStack Plugin - Storage Image sample provider  SKIPPED
> [INFO] Apache CloudStack Plugin - Storage Volume Nexenta Provider  SKIPPED
> [INFO] Apache CloudStack Plugin - Storage Volume SolidFire Provider  SKIPPED
> [INFO] Apache CloudStack Plugin - Storage Volume default provider  SKIPPED
> [INFO] Apache CloudStack Plugin - Storage Volume CloudByte Provider  SKIPPED
> [INFO] Apache CloudStack Plugin - Storage Volume sample provider  SKIPPED
> [INFO] Apache CloudStack Plugin - SNMP Alerts ............ SKIPPED
> [INFO] Apache CloudStack Plugin - Syslog Alerts .......... SKIPPED
> [INFO] Apache CloudStack Plugin - Network VXLAN .......... SKIPPED
> [INFO] Apache CloudStack Framework - Spring Module ....... SKIPPED
> [INFO] Apache CloudStack Secondary Storage Controller .... SKIPPED
> [INFO] Apache CloudStack Client UI ....................... SKIPPED
> [INFO] Apache CloudStack Console Proxy - RDP Client ...... SKIPPED
> [INFO] Apache CloudStack Console Proxy ................... SKIPPED
> [INFO] Apache CloudStack Console Proxy - Server .......... SKIPPED
> [INFO] Apache CloudStack Framework - QuickCloud .......... SKIPPED
> [INFO] ------------------------------------------------------------------------
> [INFO] BUILD FAILURE
> [INFO] ------------------------------------------------------------------------
> [INFO] Total time: 11:33.305s
> [INFO] Finished at: Sun Nov 09 07:33:33 EST 2014
> [INFO] Final Memory: 46M/229M
> [INFO] ------------------------------------------------------------------------
> [ERROR] Failed to execute goal org.apache.maven.plugins:maven-surefire-plugin:2.12:test
(default-test) on project cloud-server: There are test failures.
> [ERROR]
> [ERROR] Please refer to <http://jenkins.buildacloud.org/job/cloudstack-4.4-maven-build/ws/server/target/surefire-reports>
for the individual test results.
> [ERROR] -> [Help 1]
> [ERROR]
> [ERROR] To see the full stack trace of the errors, re-run Maven with the -e switch.
> [ERROR] Re-run Maven using the -X switch to enable full debug logging.
> [ERROR]
> [ERROR] For more information about the errors and possible solutions, please read the
following articles:
> [ERROR] [Help 1] http://cwiki.apache.org/confluence/display/MAVEN/MojoFailureException
> [ERROR]
> [ERROR] After correcting the problems, you can resume the build with the command
> [ERROR]   mvn <goals> -rf :cloud-server
> Build step 'Invoke top-level Maven targets' marked build as failure



-- 
Daan

Mime
View raw message