cloudstack-dev mailing list archives

Site index · List index
Message view « Date » · « Thread »
Top « Date » · « Thread »
From jenk...@cloudstack.org
Subject Build failed in Jenkins: build-4.5 #159
Date Fri, 21 Nov 2014 10:56:29 GMT
See <http://jenkins.buildacloud.org/job/build-4.5/159/>

------------------------------------------
[...truncated 6018 lines...]
[INFO] --- maven-resources-plugin:2.5:testResources (default-testResources) @ cloud-plugin-storage-image-default
---
[debug] execute contextualize
[INFO] Using 'UTF-8' encoding to copy filtered resources.
[INFO] skip non existing resourceDirectory <http://jenkins.buildacloud.org/job/build-4.5/ws/plugins/storage/image/default/test/resources>
[INFO] Surefire report directory: <http://jenkins.buildacloud.org/job/build-4.5/ws/plugins/network-elements/midonet/target/surefire-reports>
[INFO] Copying 3 resources
[INFO] 
[INFO] --- maven-compiler-plugin:2.5.1:testCompile (default-testCompile) @ cloud-plugin-storage-image-default
---
[INFO] No sources to compile
[INFO] 
[INFO] --- maven-surefire-plugin:2.12:test (default-test) @ cloud-plugin-storage-image-default
---

-------------------------------------------------------
 T E S T S
-------------------------------------------------------
[INFO] Tests are skipped.
[INFO]                                                                         
[INFO] ------------------------------------------------------------------------
[INFO] Building Apache CloudStack Plugin - Storage Volume SolidFire Provider 4.5.0-SNAPSHOT
[INFO] ------------------------------------------------------------------------
[INFO] 
[INFO] --- maven-clean-plugin:2.5:clean (default-clean) @ cloud-plugin-storage-volume-solidfire
---
[INFO] Deleting <http://jenkins.buildacloud.org/job/build-4.5/ws/plugins/storage/volume/solidfire/target>
(includes = [**/*], excludes = [])
[INFO] Deleting <http://jenkins.buildacloud.org/job/build-4.5/ws/plugins/storage/volume/solidfire>
(includes = [target, dist], excludes = [])
[INFO] 
[INFO] --- maven-checkstyle-plugin:2.11:check (cloudstack-checkstyle) @ cloud-plugin-storage-volume-solidfire
---
[INFO] 
[INFO] --- maven-resources-plugin:2.5:resources (default-resources) @ cloud-plugin-storage-image-sample
---
[debug] execute contextualize
[INFO] Using 'UTF-8' encoding to copy filtered resources.
[INFO] skip non existing resourceDirectory <http://jenkins.buildacloud.org/job/build-4.5/ws/plugins/storage/image/sample/resources>
[INFO] Copying 3 resources
[INFO] 
[INFO] --- maven-compiler-plugin:2.5.1:compile (default-compile) @ cloud-plugin-storage-image-sample
---
[INFO] Compiling 3 source files to <http://jenkins.buildacloud.org/job/build-4.5/ws/plugins/storage/image/sample/target/classes>
[INFO] Starting audit...
Audit done.

[INFO] 
[INFO] --- maven-remote-resources-plugin:1.3:process (default) @ cloud-plugin-storage-volume-solidfire
---
Running com.cloud.network.element.MidoNetElementTest
[INFO] 
[INFO] --- maven-resources-plugin:2.5:resources (default-resources) @ cloud-plugin-storage-volume-solidfire
---
[debug] execute contextualize
[INFO] Using 'UTF-8' encoding to copy filtered resources.
[INFO] Copying 2 resources
[INFO] Copying 3 resources
[INFO] 
[INFO] --- maven-compiler-plugin:2.5.1:compile (default-compile) @ cloud-plugin-storage-volume-solidfire
---
[INFO] Compiling 9 source files to <http://jenkins.buildacloud.org/job/build-4.5/ws/plugins/storage/volume/solidfire/target/classes>
log4j:WARN No appenders could be found for logger (com.cloud.network.element.MidoNetElement).
log4j:WARN Please initialize the log4j system properly.
log4j:WARN See http://logging.apache.org/log4j/1.2/faq.html#noconfig for more info.
Tests run: 2, Failures: 0, Errors: 0, Skipped: 0, Time elapsed: 6.378 sec

Results :

Tests run: 2, Failures: 0, Errors: 0, Skipped: 0

[INFO]                                                                         
[INFO] ------------------------------------------------------------------------
[INFO] Building Apache CloudStack Plugin - Storage Volume CloudByte Provider 4.5.0-SNAPSHOT
[INFO] ------------------------------------------------------------------------
[INFO] 
[INFO] --- maven-clean-plugin:2.5:clean (default-clean) @ cloud-plugin-storage-volume-cloudbyte
---
[INFO] Deleting <http://jenkins.buildacloud.org/job/build-4.5/ws/plugins/storage/volume/cloudbyte/target>
(includes = [**/*], excludes = [])
[INFO] Deleting <http://jenkins.buildacloud.org/job/build-4.5/ws/plugins/storage/volume/cloudbyte>
(includes = [target, dist], excludes = [])
[INFO] 
[INFO] --- maven-checkstyle-plugin:2.11:check (cloudstack-checkstyle) @ cloud-plugin-storage-volume-cloudbyte
---
[INFO] 
[INFO] --- maven-resources-plugin:2.5:testResources (default-testResources) @ cloud-plugin-storage-image-sample
---
[debug] execute contextualize
[INFO] Using 'UTF-8' encoding to copy filtered resources.
[INFO] skip non existing resourceDirectory <http://jenkins.buildacloud.org/job/build-4.5/ws/plugins/storage/image/sample/test/resources>
[INFO] Copying 3 resources
[INFO] 
[INFO] --- maven-compiler-plugin:2.5.1:testCompile (default-testCompile) @ cloud-plugin-storage-image-sample
---
[INFO] No sources to compile
[INFO] 
[INFO] --- maven-surefire-plugin:2.12:test (default-test) @ cloud-plugin-storage-image-sample
---
[INFO] Tests are skipped.
[INFO]                                                                         
[INFO] ------------------------------------------------------------------------
[INFO] Building Apache CloudStack Plugin - Network Juniper Contrail 4.5.0-SNAPSHOT
[INFO] ------------------------------------------------------------------------
[INFO] 
[INFO] --- maven-clean-plugin:2.5:clean (default-clean) @ cloud-plugin-network-contrail ---
[INFO] Deleting <http://jenkins.buildacloud.org/job/build-4.5/ws/plugins/network-elements/juniper-contrail/target>
(includes = [**/*], excludes = [])
[INFO] Deleting <http://jenkins.buildacloud.org/job/build-4.5/ws/plugins/network-elements/juniper-contrail>
(includes = [target, dist], excludes = [])
[INFO] 
[INFO] --- maven-checkstyle-plugin:2.11:check (cloudstack-checkstyle) @ cloud-plugin-network-contrail
---
[INFO] Starting audit...
Audit done.

[INFO] 
[INFO] --- maven-remote-resources-plugin:1.3:process (default) @ cloud-plugin-storage-volume-cloudbyte
---
[INFO] Starting audit...
Audit done.

[INFO] 
[INFO] --- maven-remote-resources-plugin:1.3:process (default) @ cloud-plugin-network-contrail
---
[INFO] 
[INFO] --- maven-resources-plugin:2.5:resources (default-resources) @ cloud-plugin-storage-volume-cloudbyte
---
[debug] execute contextualize
[INFO] Using 'UTF-8' encoding to copy filtered resources.
[INFO] Copying 2 resources
[INFO] Copying 3 resources
[INFO] 
[INFO] --- maven-compiler-plugin:2.5.1:compile (default-compile) @ cloud-plugin-storage-volume-cloudbyte
---
[INFO] Compiling 13 source files to <http://jenkins.buildacloud.org/job/build-4.5/ws/plugins/storage/volume/cloudbyte/target/classes>
Build timed out (after 17 minutes). Marking the build as failed.
Build was aborted
Recording test results
[INFO] 
[INFO] --- maven-resources-plugin:2.5:resources (default-resources) @ cloud-plugin-network-contrail
---
[debug] execute contextualize
[INFO] Using 'UTF-8' encoding to copy filtered resources.
[INFO] Copying 3 resources
[INFO] Copying 3 resources
[INFO] 
[INFO] --- maven-compiler-plugin:2.5.1:compile (default-compile) @ cloud-plugin-network-contrail
---
[INFO] Compiling 30 source files to <http://jenkins.buildacloud.org/job/build-4.5/ws/plugins/network-elements/juniper-contrail/target/classes>
[INFO] ------------------------------------------------------------------------
[INFO] Reactor Summary:
[INFO] 
[INFO] Apache CloudStack Developer Tools - Checkstyle Configuration  SUCCESS [3.636s]
[INFO] Apache CloudStack ................................. SUCCESS [5.533s]
[INFO] Apache CloudStack Maven Conventions Parent ........ SUCCESS [6.858s]
[INFO] Apache CloudStack Framework - Managed Context ..... SUCCESS [18.671s]
[INFO] Apache CloudStack Utils ........................... SUCCESS [1:06.728s]
[INFO] Apache CloudStack Framework ....................... SUCCESS [0.718s]
[INFO] Apache CloudStack Framework - Event Notification .. SUCCESS [52.633s]
[INFO] Apache CloudStack Framework - Configuration ....... SUCCESS [17.167s]
[INFO] Apache CloudStack API ............................. SUCCESS [44.627s]
[INFO] Apache CloudStack Framework - REST ................ SUCCESS [31.700s]
[INFO] Apache CloudStack Framework - IPC ................. SUCCESS [16.781s]
[INFO] Apache CloudStack Cloud Engine .................... SUCCESS [0.823s]
[INFO] Apache CloudStack Cloud Engine API ................ SUCCESS [15.574s]
[INFO] Apache CloudStack Framework - Security ............ SUCCESS [9.719s]
[INFO] Apache CloudStack Core ............................ SUCCESS [43.545s]
[INFO] Apache CloudStack Agents .......................... SUCCESS [20.178s]
[INFO] Apache CloudStack Framework - Clustering .......... SUCCESS [13.955s]
[INFO] Apache CloudStack Framework - Event Notification .. SUCCESS [20.976s]
[INFO] Apache CloudStack Cloud Engine Schema Component ... SUCCESS [57.428s]
[INFO] Apache CloudStack Framework - Jobs ................ SUCCESS [14.722s]
[INFO] Apache CloudStack Cloud Engine Internal Components API  SUCCESS [8.264s]
[INFO] Apache CloudStack Server .......................... SUCCESS [2:11.620s]
[INFO] Apache CloudStack Usage Server .................... SUCCESS [31.965s]
[INFO] Apache CloudStack Cloud Engine Orchestration Component  SUCCESS [44.705s]
[INFO] Apache CloudStack Cloud Services .................. SUCCESS [0.816s]
[INFO] Apache CloudStack Secondary Storage ............... SUCCESS [19.710s]
[INFO] Apache CloudStack Secondary Storage Service ....... SUCCESS [29.987s]
[INFO] Apache CloudStack Engine Storage Component ........ SUCCESS [40.235s]
[INFO] Apache CloudStack Engine Storage Volume Component . SUCCESS [33.312s]
[INFO] Apache CloudStack Engine Storage Image Component .. SUCCESS [23.844s]
[INFO] Apache CloudStack Engine Storage Data Motion Component  SUCCESS [21.818s]
[INFO] Apache CloudStack Engine Storage Cache Component .. SUCCESS [19.624s]
[INFO] Apache CloudStack Engine Storage Snapshot Component  SUCCESS [1:10.568s]
[INFO] Apache CloudStack Cloud Engine API ................ SUCCESS [11.068s]
[INFO] Apache CloudStack Cloud Engine Service ............ SUCCESS [7.792s]
[INFO] Apache CloudStack Plugin POM ...................... SUCCESS [1.815s]
[INFO] Apache CloudStack Plugin - API Rate Limit ......... SUCCESS [35.268s]
[INFO] Apache CloudStack Plugin - Storage Volume default provider  SUCCESS [26.734s]
[INFO] Apache CloudStack Plugin - Storage Volume SolidFire Provider  FAILURE [17.677s]
[INFO] Apache CloudStack Plugin - API SolidFire .......... SKIPPED
[INFO] Apache CloudStack Plugin - API Discovery .......... SUCCESS [29.452s]
[INFO] Apache CloudStack Plugin - ACL Static Role Based .. SUCCESS [14.292s]
[INFO] Apache CloudStack Plugin - Host Anti-Affinity Processor  SUCCESS [14.159s]
[INFO] Apache CloudStack Plugin - Explicit Dedication Processor  SUCCESS [14.984s]
[INFO] Apache CloudStack Plugin - User Concentrated Pod Deployment Planner  SUCCESS [12.996s]
[INFO] Apache CloudStack Plugin - User Dispersing Deployment Planner  SUCCESS [13.190s]
[INFO] Apache CloudStack Plugin - Implicit Dedication Planner  SUCCESS [43.750s]
[INFO] Apache CloudStack Plugin - Skip Heurestics Planner  SUCCESS [12.352s]
[INFO] Apache CloudStack Plugin - Host Allocator Random .. SUCCESS [14.039s]
[INFO] Apache CloudStack Plugin - Dedicated Resources .... SUCCESS [45.742s]
[INFO] Apache CloudStack Plugin - Hypervisor OracleVM .... SUCCESS [21.582s]
[INFO] Apache CloudStack Plugin - Open vSwitch ........... SUCCESS [21.712s]
[INFO] Apache CloudStack Plugin - Hypervisor XenServer ... SUCCESS [1:26.577s]
[INFO] Apache CloudStack Plugin - Hypervisor KVM ......... SUCCESS [1:08.665s]
[INFO] Apache CloudStack Plugin - RabbitMQ Event Bus ..... SUCCESS [14.659s]
[INFO] Apache CloudStack Plugin - In Memory Event Bus .... SUCCESS [25.956s]
[INFO] Apache CloudStack Plugin - Hypervisor Baremetal ... SUCCESS [30.748s]
[INFO] Apache CloudStack Plugin - Hypervisor UCS ......... SUCCESS [16.662s]
[INFO] Apache CloudStack Plugin - Hypervisor Hyper-V ..... SUCCESS [36.546s]
[INFO] Apache CloudStack Plugin - Network Elastic Load Balancer  SUCCESS [38.890s]
[INFO] Apache CloudStack Plugin - Network Internal Load Balancer  SUCCESS [55.690s]
[INFO] Apache CloudStack Framework - Spring Life Cycle ... SUCCESS [7.415s]
[INFO] Apache CloudStack Plugin - Network Juniper Contrail  FAILURE [7.759s]
[INFO] Apache CloudStack Plugin - Palo Alto .............. SUCCESS [45.215s]
[INFO] Apache CloudStack Plugin - Network Netscaler ...... SUCCESS [28.228s]
[INFO] Apache CloudStack Plugin - Network Nicira NVP ..... SUCCESS [54.642s]
[INFO] Apache CloudStack Plugin - BigSwitch Virtual Network Segment  SUCCESS [37.002s]
[INFO] Apache CloudStack Plugin - Network Brocade VCS .... SUCCESS [57.937s]
[INFO] Apache CloudStack Plugin - Midokura Midonet ....... SUCCESS [56.517s]
[INFO] Apache CloudStack Plugin - Stratosphere SSP ....... SUCCESS [42.543s]
[INFO] Apache CloudStack Plugin - Network Opendaylight ... SUCCESS [41.286s]
[INFO] Apache CloudStack Plugin - Storage Allocator Random  SUCCESS [21.903s]
[INFO] Apache CloudStack Plugin - User Authenticator LDAP  SUCCESS [24.091s]
[INFO] Apache CloudStack Plugin - User Authenticator MD5 . SUCCESS [29.982s]
[INFO] Apache CloudStack Plugin - User Authenticator Plain Text  SUCCESS [16.081s]
[INFO] Apache CloudStack Plugin - User Authenticator SAML2  SUCCESS [1:12.100s]
[INFO] Apache CloudStack Plugin - User Authenticator SHA256 Salted  SUCCESS [36.330s]
[INFO] Apache CloudStack Plugin - Dns Notifier Example ... SUCCESS [15.758s]
[INFO] Apache CloudStack Plugin - Storage Image S3 ....... SUCCESS [18.624s]
[INFO] Apache CloudStack Plugin - Storage Image Swift provider  SUCCESS [14.916s]
[INFO] Apache CloudStack Plugin - Storage Image default provider  SUCCESS [15.236s]
[INFO] Apache CloudStack Plugin - Storage Image sample provider  SUCCESS [24.504s]
[INFO] Apache CloudStack Plugin - Storage Volume Nexenta Provider  SUCCESS [45.306s]
[INFO] Apache CloudStack Plugin - Storage Volume CloudByte Provider  FAILURE [8.234s]
[INFO] Apache CloudStack Plugin - Storage Volume sample provider  SUCCESS [28.545s]
[INFO] Apache CloudStack Plugin - SNMP Alerts ............ SUCCESS [29.776s]
[INFO] Apache CloudStack Plugin - Syslog Alerts .......... SUCCESS [23.880s]
[INFO] Apache CloudStack Plugin - Network VXLAN .......... SUCCESS [34.595s]
[INFO] Apache CloudStack Plugin - GloboDNS ............... SUCCESS [59.694s]
[INFO] Apache CloudStack Framework - Spring Module ....... SUCCESS [50.884s]
[INFO] Apache CloudStack Secondary Storage Controller .... SUCCESS [20.835s]
[INFO] Apache CloudStack Console Proxy - RDP Client ...... SUCCESS [1:14.707s]
[INFO] Apache CloudStack Console Proxy ................... SUCCESS [12.767s]
[INFO] Apache CloudStack Console Proxy - Server .......... SUCCESS [46.518s]
[INFO] Apache CloudStack System VM ....................... SUCCESS [4.666s]
[INFO] Apache CloudStack Client UI ....................... SKIPPED
[INFO] Apache CloudStack Framework - QuickCloud .......... SUCCESS [4.919s]
[INFO] Apache CloudStack AWS API Bridge .................. FAILURE [3:41.473s]
[INFO] ------------------------------------------------------------------------
[INFO] BUILD FAILURE
[INFO] ------------------------------------------------------------------------
[INFO] Total time: 16:52.809s (Wall Clock)
[INFO] Finished at: Fri Nov 21 05:56:06 EST 2014
[INFO] Final Memory: 74M/327M
[INFO] ------------------------------------------------------------------------
[ERROR] Failed to execute goal org.apache.maven.plugins:maven-compiler-plugin:2.5.1:compile
(default-compile) on project cloud-plugin-storage-volume-cloudbyte: Fatal error compiling:
Unknown error trying to execute the external compiler:
[ERROR] /bin/sh -c cd <http://jenkins.buildacloud.org/job/build-4.5/ws/plugins/storage/volume/cloudbyte>
&& /usr/lib/jvm/java-1.7.0-openjdk-1.7.0.51.x86_64/jre/../bin/javac @/tmp/org.codehaus.plexus.compiler.javac.JavacCompiler1812695888518453623arguments
-J-Xmx512m -J-Xms128m
[ERROR] -> [Help 1]
[ERROR] Failed to execute goal org.apache.maven.plugins:maven-compiler-plugin:2.5.1:compile
(default-compile) on project cloud-plugin-storage-volume-solidfire: Fatal error compiling:
Unknown error trying to execute the external compiler:
[ERROR] /bin/sh -c cd <http://jenkins.buildacloud.org/job/build-4.5/ws/plugins/storage/volume/solidfire>
&& /usr/lib/jvm/java-1.7.0-openjdk-1.7.0.51.x86_64/jre/../bin/javac @/tmp/org.codehaus.plexus.compiler.javac.JavacCompiler5352151548338068603arguments
-J-Xmx512m -J-Xms128m
[ERROR] -> [Help 1]
[ERROR] Failed to execute goal org.apache.maven.plugins:maven-compiler-plugin:2.5.1:compile
(default-compile) on project cloud-awsapi: Fatal error compiling: Unknown error trying to
execute the external compiler:
[ERROR] /bin/sh -c cd <http://jenkins.buildacloud.org/job/build-4.5/ws/awsapi> &&
/usr/lib/jvm/java-1.7.0-openjdk-1.7.0.51.x86_64/jre/../bin/javac @/tmp/org.codehaus.plexus.compiler.javac.JavacCompiler4768576474481719990arguments
-J-Xmx512m -J-Xms128m
[ERROR] -> [Help 1]
[ERROR] Failed to execute goal org.apache.maven.plugins:maven-compiler-plugin:2.5.1:compile
(default-compile) on project cloud-plugin-network-contrail: Fatal error compiling: Shutdown
in progress -> [Help 1]
[ERROR] 
[ERROR] To see the full stack trace of the errors, re-run Maven with the -e switch.
[ERROR] Re-run Maven using the -X switch to enable full debug logging.
[ERROR] 
[ERROR] For more information about the errors and possible solutions, please read the following
articles:
[ERROR] [Help 1] http://cwiki.apache.org/confluence/display/MAVEN/MojoExecutionException
[ERROR] 
[ERROR] After correcting the problems, you can resume the build with the command
[ERROR]   mvn <goals> -rf :cloud-plugin-storage-volume-cloudbyte

Mime
View raw message