cloudstack-dev mailing list archives

Site index · List index
Message view « Date » · « Thread »
Top « Date » · « Thread »
From jenk...@cloudstack.org
Subject Build failed in Jenkins: build-4.5 #84
Date Tue, 04 Nov 2014 19:55:17 GMT
See <http://jenkins.buildacloud.org/job/build-4.5/84/changes>

Changes:

[jessicawang] CLOUDSTACK-7384: UI > Instances > detailView > change service offering
option > hide it when VM state is Running and hyperviror is LXC.

------------------------------------------
[...truncated 3544 lines...]
Running com.cloud.server.auth.MD5UserAuthenticatorTest

Results :

Tests run: 0, Failures: 0, Errors: 0, Skipped: 0

[INFO]                                                                         
[INFO] ------------------------------------------------------------------------
[INFO] Building Apache CloudStack Plugin - Dns Notifier Example 4.5.0-SNAPSHOT
[INFO] ------------------------------------------------------------------------
[INFO] 
[INFO] --- maven-resources-plugin:2.5:resources (default-resources) @ cloud-plugin-user-authenticator-sha256salted
---
[debug] execute contextualize
[INFO] Using 'UTF-8' encoding to copy filtered resources.
[INFO] Copying 2 resources
[INFO] Copying 3 resources
[INFO] 
[INFO] --- maven-compiler-plugin:2.5.1:compile (default-compile) @ cloud-plugin-user-authenticator-sha256salted
---
[INFO] Compiling 1 source file to <http://jenkins.buildacloud.org/job/build-4.5/ws/plugins/user-authenticators/sha256salted/target/classes>
[INFO] 
[INFO] --- maven-clean-plugin:2.5:clean (default-clean) @ cloud-plugin-example-dns-notifier
---
[INFO] Deleting <http://jenkins.buildacloud.org/job/build-4.5/ws/plugins/network-elements/dns-notifier/target>
(includes = [**/*], excludes = [])
[INFO] Deleting <http://jenkins.buildacloud.org/job/build-4.5/ws/plugins/network-elements/dns-notifier>
(includes = [target, dist], excludes = [])
[INFO] 
[INFO] --- maven-checkstyle-plugin:2.11:check (cloudstack-checkstyle) @ cloud-plugin-example-dns-notifier
---
[INFO] Starting audit...
Audit done.

[INFO] 
[INFO] --- maven-remote-resources-plugin:1.3:process (default) @ cloud-plugin-example-dns-notifier
---
[INFO] 
[INFO] --- maven-resources-plugin:2.5:resources (default-resources) @ cloud-plugin-example-dns-notifier
---
[debug] execute contextualize
[INFO] Using 'UTF-8' encoding to copy filtered resources.
[INFO] Copying 1 resource
[INFO] Copying 3 resources
[INFO] 
[INFO] --- maven-compiler-plugin:2.5.1:compile (default-compile) @ cloud-plugin-example-dns-notifier
---
[INFO] Compiling 1 source file to <http://jenkins.buildacloud.org/job/build-4.5/ws/plugins/network-elements/dns-notifier/target/classes>
log4j:WARN No appenders could be found for logger (com.cloud.server.auth.MD5UserAuthenticator).
log4j:WARN Please initialize the log4j system properly.
log4j:WARN See http://logging.apache.org/log4j/1.2/faq.html#noconfig for more info.
Tests run: 4, Failures: 0, Errors: 0, Skipped: 0, Time elapsed: 5.363 sec

Results :

Tests run: 4, Failures: 0, Errors: 0, Skipped: 0

[INFO]                                                                         
[INFO] ------------------------------------------------------------------------
[INFO] Building Apache CloudStack Plugin - SNMP Alerts 4.5.0-SNAPSHOT
[INFO] ------------------------------------------------------------------------
[INFO] 
[INFO] --- maven-clean-plugin:2.5:clean (default-clean) @ cloud-plugin-snmp-alerts ---
[INFO] Deleting <http://jenkins.buildacloud.org/job/build-4.5/ws/plugins/alert-handlers/snmp-alerts/target>
(includes = [**/*], excludes = [])
[INFO] Deleting <http://jenkins.buildacloud.org/job/build-4.5/ws/plugins/alert-handlers/snmp-alerts>
(includes = [target, dist], excludes = [])
[INFO] 
[INFO] --- maven-checkstyle-plugin:2.11:check (cloudstack-checkstyle) @ cloud-plugin-snmp-alerts
---
[INFO] Starting audit...
Audit done.

[INFO] 
[INFO] --- maven-remote-resources-plugin:1.3:process (default) @ cloud-plugin-snmp-alerts
---
[INFO] 
[INFO] --- maven-resources-plugin:2.5:testResources (default-testResources) @ cloud-plugin-user-authenticator-saml2
---
[debug] execute contextualize
[INFO] Using 'UTF-8' encoding to copy filtered resources.
[INFO] skip non existing resourceDirectory <http://jenkins.buildacloud.org/job/build-4.5/ws/plugins/user-authenticators/saml2/test/resources>
[INFO] Copying 3 resources
[INFO] 
[INFO] --- maven-compiler-plugin:2.5.1:testCompile (default-testCompile) @ cloud-plugin-user-authenticator-saml2
---
[INFO] Compiling 4 source files to <http://jenkins.buildacloud.org/job/build-4.5/ws/plugins/user-authenticators/saml2/target/test-classes>
[INFO] 
[INFO] --- maven-resources-plugin:2.5:resources (default-resources) @ cloud-plugin-snmp-alerts
---
[debug] execute contextualize
[INFO] Using 'UTF-8' encoding to copy filtered resources.
[INFO] skip non existing resourceDirectory <http://jenkins.buildacloud.org/job/build-4.5/ws/plugins/alert-handlers/snmp-alerts/resources>
[INFO] Copying 3 resources
[INFO] 
[INFO] --- maven-compiler-plugin:2.5.1:compile (default-compile) @ cloud-plugin-snmp-alerts
---
[INFO] Compiling 5 source files to <http://jenkins.buildacloud.org/job/build-4.5/ws/plugins/alert-handlers/snmp-alerts/target/classes>
Build timed out (after 11 minutes). Marking the build as failed.
Recording test results
[INFO]                                                                         
[INFO] ------------------------------------------------------------------------
[INFO] Skipping Apache CloudStack Plugin - Syslog Alerts
[INFO] This project has been banned from the build due to previous failures.
[INFO] ------------------------------------------------------------------------
[INFO]                                                                         
[INFO] ------------------------------------------------------------------------
[INFO] Skipping Apache CloudStack Plugin - Network VXLAN
[INFO] This project has been banned from the build due to previous failures.
[INFO] ------------------------------------------------------------------------
[INFO]                                                                         
[INFO] ------------------------------------------------------------------------
[INFO] Skipping Apache CloudStack Plugin - GloboDNS
[INFO] This project has been banned from the build due to previous failures.
[INFO] ------------------------------------------------------------------------
[INFO]                                                                         
[INFO] ------------------------------------------------------------------------
[INFO] Skipping Apache CloudStack Engine Storage Component
[INFO] This project has been banned from the build due to previous failures.
[INFO] ------------------------------------------------------------------------
[INFO]                                                                         
[INFO] ------------------------------------------------------------------------
[INFO] Skipping Apache CloudStack System VM
[INFO] This project has been banned from the build due to previous failures.
[INFO] ------------------------------------------------------------------------
[INFO]                                                                         
[INFO] ------------------------------------------------------------------------
[INFO] Skipping Apache CloudStack Plugin - Hypervisor KVM
[INFO] This project has been banned from the build due to previous failures.
[INFO] ------------------------------------------------------------------------
[INFO] 
[INFO] --- maven-resources-plugin:2.5:testResources (default-testResources) @ cloud-plugin-user-authenticator-sha256salted
---
[debug] execute contextualize
[INFO] Using 'UTF-8' encoding to copy filtered resources.
[INFO] skip non existing resourceDirectory <http://jenkins.buildacloud.org/job/build-4.5/ws/plugins/user-authenticators/sha256salted/test/resources>
[INFO] Copying 3 resources
[INFO] 
[INFO] --- maven-compiler-plugin:2.5.1:testCompile (default-testCompile) @ cloud-plugin-user-authenticator-sha256salted
---
[INFO] Compiling 1 source file to <http://jenkins.buildacloud.org/job/build-4.5/ws/plugins/user-authenticators/sha256salted/target/test-classes>
[INFO] ------------------------------------------------------------------------
[INFO] Reactor Summary:
[INFO] 
[INFO] Apache CloudStack Developer Tools - Checkstyle Configuration  SUCCESS [3.410s]
[INFO] Apache CloudStack ................................. SUCCESS [2.432s]
[INFO] Apache CloudStack Maven Conventions Parent ........ SUCCESS [7.202s]
[INFO] Apache CloudStack Framework - Managed Context ..... SUCCESS [10.545s]
[INFO] Apache CloudStack Utils ........................... SUCCESS [33.533s]
[INFO] Apache CloudStack Framework ....................... SUCCESS [0.583s]
[INFO] Apache CloudStack Framework - Event Notification .. SUCCESS [34.838s]
[INFO] Apache CloudStack Framework - Configuration ....... SUCCESS [10.659s]
[INFO] Apache CloudStack API ............................. SUCCESS [38.393s]
[INFO] Apache CloudStack Framework - REST ................ SUCCESS [25.161s]
[INFO] Apache CloudStack Framework - IPC ................. SUCCESS [15.705s]
[INFO] Apache CloudStack Cloud Engine .................... SUCCESS [0.645s]
[INFO] Apache CloudStack Cloud Engine API ................ SUCCESS [14.204s]
[INFO] Apache CloudStack Framework - Security ............ SUCCESS [8.988s]
[INFO] Apache CloudStack Core ............................ SUCCESS [46.001s]
[INFO] Apache CloudStack Agents .......................... SUCCESS [22.681s]
[INFO] Apache CloudStack Framework - Clustering .......... SUCCESS [12.409s]
[INFO] Apache CloudStack Framework - Event Notification .. SUCCESS [12.185s]
[INFO] Apache CloudStack Cloud Engine Schema Component ... SUCCESS [55.587s]
[INFO] Apache CloudStack Framework - Jobs ................ SUCCESS [18.867s]
[INFO] Apache CloudStack Cloud Engine Internal Components API  SUCCESS [8.057s]
[INFO] Apache CloudStack Server .......................... SUCCESS [2:23.312s]
[INFO] Apache CloudStack Usage Server .................... SUCCESS [34.244s]
[INFO] Apache CloudStack Cloud Engine Orchestration Component  SUCCESS [43.071s]
[INFO] Apache CloudStack Cloud Services .................. SUCCESS [0.621s]
[INFO] Apache CloudStack Secondary Storage ............... SUCCESS [25.491s]
[INFO] Apache CloudStack Secondary Storage Service ....... SUCCESS [33.598s]
[INFO] Apache CloudStack Engine Storage Component ........ SKIPPED
[INFO] Apache CloudStack Engine Storage Volume Component . SKIPPED
[INFO] Apache CloudStack Engine Storage Image Component .. SKIPPED
[INFO] Apache CloudStack Engine Storage Data Motion Component  SKIPPED
[INFO] Apache CloudStack Engine Storage Cache Component .. SKIPPED
[INFO] Apache CloudStack Engine Storage Snapshot Component  SKIPPED
[INFO] Apache CloudStack Cloud Engine API ................ SUCCESS [11.096s]
[INFO] Apache CloudStack Cloud Engine Service ............ SKIPPED
[INFO] Apache CloudStack Plugin POM ...................... SUCCESS [1.598s]
[INFO] Apache CloudStack Plugin - API Rate Limit ......... SUCCESS [41.328s]
[INFO] Apache CloudStack Plugin - Storage Volume default provider  SKIPPED
[INFO] Apache CloudStack Plugin - Storage Volume SolidFire Provider  SKIPPED
[INFO] Apache CloudStack Plugin - API SolidFire .......... SKIPPED
[INFO] Apache CloudStack Plugin - API Discovery .......... SUCCESS [29.328s]
[INFO] Apache CloudStack Plugin - ACL Static Role Based .. SUCCESS [14.676s]
[INFO] Apache CloudStack Plugin - Host Anti-Affinity Processor  SUCCESS [12.444s]
[INFO] Apache CloudStack Plugin - Explicit Dedication Processor  SUCCESS [13.016s]
[INFO] Apache CloudStack Plugin - User Concentrated Pod Deployment Planner  SUCCESS [13.784s]
[INFO] Apache CloudStack Plugin - User Dispersing Deployment Planner  SUCCESS [14.599s]
[INFO] Apache CloudStack Plugin - Implicit Dedication Planner  SUCCESS [42.976s]
[INFO] Apache CloudStack Plugin - Skip Heurestics Planner  SUCCESS [13.209s]
[INFO] Apache CloudStack Plugin - Host Allocator Random .. SUCCESS [14.230s]
[INFO] Apache CloudStack Plugin - Dedicated Resources .... SUCCESS [45.340s]
[INFO] Apache CloudStack Plugin - Hypervisor OracleVM .... SUCCESS [21.259s]
[INFO] Apache CloudStack Plugin - Open vSwitch ........... SUCCESS [22.072s]
[INFO] Apache CloudStack Plugin - Hypervisor XenServer ... SKIPPED
[INFO] Apache CloudStack Plugin - Hypervisor KVM ......... SKIPPED
[INFO] Apache CloudStack Plugin - RabbitMQ Event Bus ..... SUCCESS [16.050s]
[INFO] Apache CloudStack Plugin - In Memory Event Bus .... SUCCESS [28.819s]
[INFO] Apache CloudStack Plugin - Hypervisor Baremetal ... SUCCESS [30.655s]
[INFO] Apache CloudStack Plugin - Hypervisor UCS ......... SUCCESS [21.733s]
[INFO] Apache CloudStack Plugin - Hypervisor Hyper-V ..... SUCCESS [40.147s]
[INFO] Apache CloudStack Plugin - Network Elastic Load Balancer  SUCCESS [36.377s]
[INFO] Apache CloudStack Plugin - Network Internal Load Balancer  SUCCESS [1:00.143s]
[INFO] Apache CloudStack Framework - Spring Life Cycle ... SUCCESS [7.460s]
[INFO] Apache CloudStack Plugin - Network Juniper Contrail  SKIPPED
[INFO] Apache CloudStack Plugin - Palo Alto .............. SUCCESS [51.972s]
[INFO] Apache CloudStack Plugin - Network Netscaler ...... SUCCESS [29.727s]
[INFO] Apache CloudStack Plugin - Network Nicira NVP ..... SUCCESS [57.024s]
[INFO] Apache CloudStack Plugin - BigSwitch Virtual Network Segment  SUCCESS [42.025s]
[INFO] Apache CloudStack Plugin - Network Brocade VCS .... SUCCESS [1:00.604s]
[INFO] Apache CloudStack Plugin - Midokura Midonet ....... SKIPPED
[INFO] Apache CloudStack Plugin - Stratosphere SSP ....... SUCCESS [44.823s]
[INFO] Apache CloudStack Plugin - Network Opendaylight ... SUCCESS [42.004s]
[INFO] Apache CloudStack Plugin - Storage Allocator Random  SKIPPED
[INFO] Apache CloudStack Plugin - User Authenticator LDAP  SUCCESS [26.421s]
[INFO] Apache CloudStack Plugin - User Authenticator MD5 . SUCCESS [35.060s]
[INFO] Apache CloudStack Plugin - User Authenticator Plain Text  SUCCESS [18.986s]
[INFO] Apache CloudStack Plugin - User Authenticator SAML2  FAILURE [24.717s]
[INFO] Apache CloudStack Plugin - User Authenticator SHA256 Salted  FAILURE [16.229s]
[INFO] Apache CloudStack Plugin - Dns Notifier Example ... FAILURE [11.553s]
[INFO] Apache CloudStack Plugin - Storage Image S3 ....... SKIPPED
[INFO] Apache CloudStack Plugin - Storage Image Swift provider  SKIPPED
[INFO] Apache CloudStack Plugin - Storage Image default provider  SKIPPED
[INFO] Apache CloudStack Plugin - Storage Image sample provider  SKIPPED
[INFO] Apache CloudStack Plugin - Storage Volume Nexenta Provider  SKIPPED
[INFO] Apache CloudStack Plugin - Storage Volume CloudByte Provider  SKIPPED
[INFO] Apache CloudStack Plugin - Storage Volume sample provider  SKIPPED
[INFO] Apache CloudStack Plugin - SNMP Alerts ............ FAILURE [7.146s]
[INFO] Apache CloudStack Plugin - Syslog Alerts .......... SKIPPED
[INFO] Apache CloudStack Plugin - Network VXLAN .......... SKIPPED
[INFO] Apache CloudStack Plugin - GloboDNS ............... SKIPPED
[INFO] Apache CloudStack Framework - Spring Module ....... SUCCESS [35.384s]
[INFO] Apache CloudStack Secondary Storage Controller .... SUCCESS [18.226s]
[INFO] Apache CloudStack Console Proxy - RDP Client ...... SUCCESS [54.586s]
[INFO] Apache CloudStack Console Proxy ................... SUCCESS [18.890s]
[INFO] Apache CloudStack Console Proxy - Server .......... SUCCESS [28.102s]
[INFO] Apache CloudStack System VM ....................... SKIPPED
[INFO] Apache CloudStack Client UI ....................... SKIPPED
[INFO] Apache CloudStack Framework - QuickCloud .......... SUCCESS [2.013s]
[INFO] Apache CloudStack AWS API Bridge .................. SKIPPED
[INFO] ------------------------------------------------------------------------
[INFO] BUILD FAILURE
[INFO] ------------------------------------------------------------------------
[INFO] Total time: 11:27.250s (Wall Clock)
[INFO] Finished at: Tue Nov 04 14:54:36 EST 2014
[INFO] Final Memory: 60M/272M
[INFO] ------------------------------------------------------------------------
[ERROR] Failed to execute goal org.apache.maven.plugins:maven-compiler-plugin:2.5.1:testCompile
(default-testCompile) on project cloud-plugin-user-authenticator-saml2: Fatal error compiling:
Unknown error trying to execute the external compiler:
[ERROR] /bin/sh -c cd <http://jenkins.buildacloud.org/job/build-4.5/ws/plugins/user-authenticators/saml2>
&& /usr/lib/jvm/java-1.7.0-openjdk-1.7.0.51.x86_64/jre/../bin/javac @/tmp/org.codehaus.plexus.compiler.javac.JavacCompiler2758009581298594919arguments
-J-Xmx512m -J-Xms128m
[ERROR] -> [Help 1]
[ERROR] Failed to execute goal org.apache.maven.plugins:maven-compiler-plugin:2.5.1:compile
(default-compile) on project cloud-plugin-example-dns-notifier: Fatal error compiling: Unknown
error trying to execute the external compiler:
[ERROR] /bin/sh -c cd <http://jenkins.buildacloud.org/job/build-4.5/ws/plugins/network-elements/dns-notifier>
&& /usr/lib/jvm/java-1.7.0-openjdk-1.7.0.51.x86_64/jre/../bin/javac @/tmp/org.codehaus.plexus.compiler.javac.JavacCompiler8645106973821377555arguments
-J-Xmx512m -J-Xms128m
[ERROR] -> [Help 1]
[ERROR] Failed to execute goal org.apache.maven.plugins:maven-compiler-plugin:2.5.1:testCompile
(default-testCompile) on project cloud-plugin-user-authenticator-sha256salted: Fatal error
compiling: Error while executing the external compiler. Error inside systemErr parser: Stream
closed -> [Help 1]
[ERROR] Failed to execute goal org.apache.maven.plugins:maven-compiler-plugin:2.5.1:compile
(default-compile) on project cloud-plugin-snmp-alerts: Fatal error compiling: Unknown error
trying to execute the external compiler:
[ERROR] /bin/sh -c cd <http://jenkins.buildacloud.org/job/build-4.5/ws/plugins/alert-handlers/snmp-alerts>
&& /usr/lib/jvm/java-1.7.0-openjdk-1.7.0.51.x86_64/jre/../bin/javac @/tmp/org.codehaus.plexus.compiler.javac.JavacCompiler3455361395240038016arguments
-J-Xmx512m -J-Xms128m
[ERROR] -> [Help 1]
[ERROR] 
[ERROR] To see the full stack trace of the errors, re-run Maven with the -e switch.
[ERROR] Re-run Maven using the -X switch to enable full debug logging.
[ERROR] 
[ERROR] For more information about the errors and possible solutions, please read the following
articles:
[ERROR] [Help 1] http://cwiki.apache.org/confluence/display/MAVEN/MojoExecutionException
[ERROR] 
[ERROR] After correcting the problems, you can resume the build with the command
[ERROR]   mvn <goals> -rf :cloud-plugin-user-authenticator-saml2

Mime
View raw message