cloudstack-dev mailing list archives

Site index · List index
Message view « Date » · « Thread »
Top « Date » · « Thread »
From jenk...@cloudstack.org
Subject Build failed in Jenkins: cloudstack-4.3-maven-build #585
Date Tue, 09 Sep 2014 14:38:37 GMT
See <http://jenkins.buildacloud.org/job/cloudstack-4.3-maven-build/585/>

------------------------------------------
[...truncated 2035 lines...]
[INFO] --- maven-surefire-plugin:2.12:test (default-test) @ cloud-plugin-hypervisor-ovm ---
[INFO] Surefire report directory: <http://jenkins.buildacloud.org/job/cloudstack-4.3-maven-build/ws/plugins/hypervisors/ovm/target/surefire-reports>

-------------------------------------------------------
 T E S T S
-------------------------------------------------------

Results :

Tests run: 0, Failures: 0, Errors: 0, Skipped: 0

[INFO]                                                                         
[INFO] ------------------------------------------------------------------------
[INFO] Building Apache CloudStack Plugin - Open vSwitch 4.3.1
[INFO] ------------------------------------------------------------------------
[INFO] 
[INFO] --- maven-clean-plugin:2.5:clean (default-clean) @ cloud-plugin-network-ovs ---
[INFO] Deleting <http://jenkins.buildacloud.org/job/cloudstack-4.3-maven-build/ws/plugins/network-elements/ovs/target>
(includes = [**/*], excludes = [])
[INFO] Deleting <http://jenkins.buildacloud.org/job/cloudstack-4.3-maven-build/ws/plugins/network-elements/ovs>
(includes = [target, dist], excludes = [])
[INFO] 
[INFO] --- maven-remote-resources-plugin:1.3:process (default) @ cloud-plugin-network-ovs
---
[INFO] 
[INFO] --- maven-resources-plugin:2.5:resources (default-resources) @ cloud-plugin-network-ovs
---
[debug] execute contextualize
[INFO] Using 'UTF-8' encoding to copy filtered resources.
[INFO] Copying 2 resources
[INFO] Copying 3 resources
[INFO] 
[INFO] --- maven-compiler-plugin:2.5.1:compile (default-compile) @ cloud-plugin-network-ovs
---
[INFO] Compiling 23 source files to <http://jenkins.buildacloud.org/job/cloudstack-4.3-maven-build/ws/plugins/network-elements/ovs/target/classes>
[INFO] 
[INFO] --- maven-resources-plugin:2.5:testResources (default-testResources) @ cloud-plugin-network-ovs
---
[debug] execute contextualize
[INFO] Using 'UTF-8' encoding to copy filtered resources.
[INFO] skip non existing resourceDirectory <http://jenkins.buildacloud.org/job/cloudstack-4.3-maven-build/ws/plugins/network-elements/ovs/test/resources>
[INFO] Copying 3 resources
[INFO] 
[INFO] --- maven-compiler-plugin:2.5.1:testCompile (default-testCompile) @ cloud-plugin-network-ovs
---
[INFO] No sources to compile
[INFO] 
[INFO] --- maven-surefire-plugin:2.12:test (default-test) @ cloud-plugin-network-ovs ---
[INFO] Surefire report directory: <http://jenkins.buildacloud.org/job/cloudstack-4.3-maven-build/ws/plugins/network-elements/ovs/target/surefire-reports>

-------------------------------------------------------
 T E S T S
-------------------------------------------------------

Results :

Tests run: 0, Failures: 0, Errors: 0, Skipped: 0

[INFO]                                                                         
[INFO] ------------------------------------------------------------------------
[INFO] Building Apache CloudStack Plugin - Hypervisor Xen 4.3.1
[INFO] ------------------------------------------------------------------------
[INFO] 
[INFO] --- maven-clean-plugin:2.5:clean (default-clean) @ cloud-plugin-hypervisor-xen ---
[INFO] Deleting <http://jenkins.buildacloud.org/job/cloudstack-4.3-maven-build/ws/plugins/hypervisors/xen/target>
(includes = [**/*], excludes = [])
[INFO] Deleting <http://jenkins.buildacloud.org/job/cloudstack-4.3-maven-build/ws/plugins/hypervisors/xen>
(includes = [target, dist], excludes = [])
[INFO] 
[INFO] --- maven-remote-resources-plugin:1.3:process (default) @ cloud-plugin-hypervisor-xen
---
[INFO] 
[INFO] --- maven-resources-plugin:2.5:resources (default-resources) @ cloud-plugin-hypervisor-xen
---
[debug] execute contextualize
[INFO] Using 'UTF-8' encoding to copy filtered resources.
[INFO] Copying 4 resources
[INFO] Copying 3 resources
[INFO] 
[INFO] --- maven-compiler-plugin:2.5.1:compile (default-compile) @ cloud-plugin-hypervisor-xen
---
[INFO] Compiling 22 source files to <http://jenkins.buildacloud.org/job/cloudstack-4.3-maven-build/ws/plugins/hypervisors/xen/target/classes>
[INFO] -------------------------------------------------------------
[ERROR] COMPILATION ERROR : 
[INFO] -------------------------------------------------------------
[ERROR] <http://jenkins.buildacloud.org/job/cloudstack-4.3-maven-build/ws/plugins/hypervisors/xen/src/org/apache/cloudstack/hypervisor/xenserver/XenServerResourceNewBase.java>:[108,33]
cannot find symbol
symbol  : method properFrom(com.xensource.xenapi.Connection,java.util.Set<java.lang.String>,java.lang.String,java.lang.Double)
location: class com.xensource.xenapi.Event
[ERROR] <http://jenkins.buildacloud.org/job/cloudstack-4.3-maven-build/ws/plugins/hypervisors/xen/src/org/apache/cloudstack/hypervisor/xenserver/XenServerResourceNewBase.java>:[171,39]
cannot find symbol
symbol  : method properFrom(com.xensource.xenapi.Connection,java.util.Set<java.lang.String>,java.lang.String,java.lang.Double)
location: class com.xensource.xenapi.Event
[ERROR] <http://jenkins.buildacloud.org/job/cloudstack-4.3-maven-build/ws/plugins/hypervisors/xen/src/org/apache/cloudstack/hypervisor/xenserver/XenServerResourceNewBase.java>:[308,35]
cannot find symbol
symbol  : method properFrom(com.xensource.xenapi.Connection,java.util.Set<java.lang.String>,java.lang.String,java.lang.Double)
location: class com.xensource.xenapi.Event
[ERROR] <http://jenkins.buildacloud.org/job/cloudstack-4.3-maven-build/ws/plugins/hypervisors/xen/src/com/cloud/hypervisor/xen/resource/Xenserver625StorageProcessor.java>:[177,34]
cannot find symbol
symbol  : method copyAsync2(com.xensource.xenapi.Connection,com.xensource.xenapi.SR,<nulltype>,<nulltype>)
location: class com.xensource.xenapi.VDI
[ERROR] <http://jenkins.buildacloud.org/job/cloudstack-4.3-maven-build/ws/plugins/hypervisors/xen/src/com/cloud/hypervisor/xen/resource/Xenserver625StorageProcessor.java>:[236,34]
cannot find symbol
symbol  : method copyAsync2(com.xensource.xenapi.Connection,com.xensource.xenapi.SR,com.xensource.xenapi.VDI,<nulltype>)
location: class com.xensource.xenapi.VDI
[ERROR] <http://jenkins.buildacloud.org/job/cloudstack-4.3-maven-build/ws/plugins/hypervisors/xen/src/com/cloud/hypervisor/xen/resource/Xenserver625StorageProcessor.java>:[347,43]
cannot find symbol
symbol  : method copyAsync2(com.xensource.xenapi.Connection,com.xensource.xenapi.SR,<nulltype>,<nulltype>)
location: class com.xensource.xenapi.VDI
[ERROR] <http://jenkins.buildacloud.org/job/cloudstack-4.3-maven-build/ws/plugins/hypervisors/xen/src/com/cloud/hypervisor/xen/resource/Xenserver625StorageProcessor.java>:[465,27]
cannot find symbol
symbol  : method copyAsync2(com.xensource.xenapi.Connection,com.xensource.xenapi.SR,<nulltype>,<nulltype>)
location: class com.xensource.xenapi.VDI
[ERROR] <http://jenkins.buildacloud.org/job/cloudstack-4.3-maven-build/ws/plugins/hypervisors/xen/src/com/cloud/hypervisor/xen/resource/Xenserver625StorageProcessor.java>:[581,37]
cannot find symbol
symbol  : method copyAsync2(com.xensource.xenapi.Connection,<nulltype>,<nulltype>,com.xensource.xenapi.VDI)
location: class com.xensource.xenapi.VDI
[ERROR] <http://jenkins.buildacloud.org/job/cloudstack-4.3-maven-build/ws/plugins/hypervisors/xen/src/com/cloud/hypervisor/xen/resource/Xenserver625StorageProcessor.java>:[644,34]
cannot find symbol
symbol  : method copyAsync2(com.xensource.xenapi.Connection,com.xensource.xenapi.SR,<nulltype>,<nulltype>)
location: class com.xensource.xenapi.VDI
[ERROR] <http://jenkins.buildacloud.org/job/cloudstack-4.3-maven-build/ws/plugins/hypervisors/xen/src/com/cloud/hypervisor/xen/resource/Xenserver625StorageProcessor.java>:[696,34]
cannot find symbol
symbol  : method copyAsync2(com.xensource.xenapi.Connection,com.xensource.xenapi.SR,<nulltype>,<nulltype>)
location: class com.xensource.xenapi.VDI
[ERROR] <http://jenkins.buildacloud.org/job/cloudstack-4.3-maven-build/ws/plugins/hypervisors/xen/src/com/cloud/hypervisor/xen/resource/Xenserver625StorageProcessor.java>:[780,37]
cannot find symbol
symbol  : method copyAsync2(com.xensource.xenapi.Connection,<nulltype>,<nulltype>,com.xensource.xenapi.VDI)
location: class com.xensource.xenapi.VDI
[INFO] 11 errors 
[INFO] -------------------------------------------------------------
[INFO] ------------------------------------------------------------------------
[INFO] Reactor Summary:
[INFO] 
[INFO] Apache CloudStack ................................. SUCCESS [0.695s]
[INFO] Apache CloudStack Maven Conventions Parent ........ SUCCESS [0.040s]
[INFO] Apache CloudStack Framework - Managed Context ..... SUCCESS [2.692s]
[INFO] Apache CloudStack Utils ........................... SUCCESS [8.139s]
[INFO] Apache CloudStack Framework ....................... SUCCESS [0.033s]
[INFO] Apache CloudStack Framework - Event Notification .. SUCCESS [4.258s]
[INFO] Apache CloudStack Framework - Configuration ....... SUCCESS [3.336s]
[INFO] Apache CloudStack API ............................. SUCCESS [7.738s]
[INFO] Apache CloudStack Framework - REST ................ SUCCESS [2.595s]
[INFO] Apache CloudStack Framework - IPC ................. SUCCESS [4.686s]
[INFO] Apache CloudStack Cloud Engine .................... SUCCESS [0.030s]
[INFO] Apache CloudStack Cloud Engine API ................ SUCCESS [3.570s]
[INFO] Apache CloudStack Core ............................ SUCCESS [5.747s]
[INFO] Apache CloudStack Agents .......................... SUCCESS [4.247s]
[INFO] Apache CloudStack Framework - Clustering .......... SUCCESS [2.267s]
[INFO] Apache CloudStack Framework - Jobs ................ SUCCESS [2.560s]
[INFO] Apache CloudStack Cloud Engine Schema Component ... SUCCESS [6.055s]
[INFO] Apache CloudStack Framework - Event Notification .. SUCCESS [1.654s]
[INFO] Apache CloudStack Cloud Engine Internal Components API  SUCCESS [2.360s]
[INFO] Apache CloudStack Server .......................... SUCCESS [27.902s]
[INFO] Apache CloudStack Usage Server .................... SUCCESS [4.361s]
[INFO] Apache XenSource XAPI ............................. SUCCESS [3.587s]
[INFO] Apache CloudStack Cloud Engine Orchestration Component  SUCCESS [5.385s]
[INFO] Apache CloudStack Cloud Services .................. SUCCESS [0.026s]
[INFO] Apache CloudStack Secondary Storage Service ....... SUCCESS [3.840s]
[INFO] Apache CloudStack Engine Storage Component ........ SUCCESS [4.962s]
[INFO] Apache CloudStack Engine Storage Volume Component . SUCCESS [3.414s]
[INFO] Apache CloudStack Engine Storage Image Component .. SUCCESS [2.381s]
[INFO] Apache CloudStack Engine Storage Data Motion Component  SUCCESS [2.412s]
[INFO] Apache CloudStack Engine Storage Cache Component .. SUCCESS [2.118s]
[INFO] Apache CloudStack Engine Storage Snapshot Component  SUCCESS [5.951s]
[INFO] Apache CloudStack Cloud Engine API ................ SUCCESS [1.762s]
[INFO] Apache CloudStack Cloud Engine Service ............ SUCCESS [0.952s]
[INFO] Apache CloudStack Plugin POM ...................... SUCCESS [0.318s]
[INFO] Apache CloudStack Plugin - API Rate Limit ......... SUCCESS [6.047s]
[INFO] Apache CloudStack Plugin - API Discovery .......... SUCCESS [3.732s]
[INFO] Apache CloudStack Plugin - ACL Static Role Based .. SUCCESS [1.930s]
[INFO] Apache CloudStack Plugin - Host Anti-Affinity Processor  SUCCESS [2.071s]
[INFO] Apache CloudStack Plugin - Explicit Dedication Processor  SUCCESS [2.069s]
[INFO] Apache CloudStack Plugin - User Concentrated Pod Deployment Planner  SUCCESS [1.993s]
[INFO] Apache CloudStack Plugin - User Dispersing Deployment Planner  SUCCESS [2.003s]
[INFO] Apache CloudStack Plugin - Implicit Dedication Planner  SUCCESS [6.146s]
[INFO] Apache CloudStack Plugin - Skip Heurestics Planner  SUCCESS [1.888s]
[INFO] Apache CloudStack Plugin - Host Allocator Random .. SUCCESS [2.024s]
[INFO] Apache CloudStack Plugin - Dedicated Resources .... SUCCESS [5.986s]
[INFO] Apache CloudStack Plugin - Hypervisor OracleVM .... SUCCESS [2.567s]
[INFO] Apache CloudStack Plugin - Open vSwitch ........... SUCCESS [2.367s]
[INFO] Apache CloudStack Plugin - Hypervisor Xen ......... FAILURE [3.704s]
[INFO] Apache CloudStack Plugin - Hypervisor KVM ......... SKIPPED
[INFO] Apache CloudStack Plugin - RabbitMQ Event Bus ..... SKIPPED
[INFO] Apache CloudStack Plugin - Hypervisor Baremetal ... SKIPPED
[INFO] Apache CloudStack Plugin - Hypervisor UCS ......... SKIPPED
[INFO] Apache CloudStack Plugin - Hypervisor Hyper-V ..... SKIPPED
[INFO] Apache CloudStack Plugin - Network Elastic Load Balancer  SKIPPED
[INFO] Apache CloudStack Plugin - Network Internal Load Balancer  SKIPPED
[INFO] Apache CloudStack Plugin - Network Juniper Contrail  SKIPPED
[INFO] Apache CloudStack Plugin - Palo Alto .............. SKIPPED
[INFO] Apache CloudStack Checkstyle Configuration ........ SKIPPED
[INFO] Apache CloudStack Plugin - Network Nicira NVP ..... SKIPPED
[INFO] Apache CloudStack Plugin - BigSwitch Virtual Network Segment  SKIPPED
[INFO] Apache CloudStack Plugin - Midokura Midonet ....... SKIPPED
[INFO] Apache Cloudstack Plugin - Stratosphere SSP ....... SKIPPED
[INFO] Apache CloudStack Plugin - Storage Allocator Random  SKIPPED
[INFO] Apache CloudStack Plugin - User Authenticator LDAP  SKIPPED
[INFO] Apache CloudStack Plugin - User Authenticator MD5 . SKIPPED
[INFO] Apache CloudStack Plugin - User Authenticator Plain Text  SKIPPED
[INFO] Apache CloudStack Plugin - User Authenticator SHA256 Salted  SKIPPED
[INFO] Apache CloudStack Plugin - Dns Notifier Example ... SKIPPED
[INFO] Apache CloudStack Plugin - Storage Image S3 ....... SKIPPED
[INFO] Apache CloudStack Plugin - Storage Image Swift provider  SKIPPED
[INFO] Apache CloudStack Plugin - Storage Image default provider  SKIPPED
[INFO] Apache CloudStack Plugin - Storage Image sample provider  SKIPPED
[INFO] Apache CloudStack Plugin - Storage Volume SolidFire Provider  SKIPPED
[INFO] Apache CloudStack Plugin - Storage Volume default provider  SKIPPED
[INFO] Apache CloudStack Plugin - Storage Volume sample provider  SKIPPED
[INFO] Apache CloudStack Plugin - SNMP Alerts ............ SKIPPED
[INFO] Apache CloudStack Plugin - Syslog Alerts .......... SKIPPED
[INFO] Apache CloudStack Plugin - Network VXLAN .......... SKIPPED
[INFO] Apache CloudStack Framework - Spring Life Cycle ... SKIPPED
[INFO] cloud-framework-spring-module ..................... SKIPPED
[INFO] Apache CloudStack Test ............................ SKIPPED
[INFO] Apache CloudStack Client UI ....................... SKIPPED
[INFO] Apache CloudStack Console Proxy - RDP Client ...... SKIPPED
[INFO] Apache CloudStack Console Proxy ................... SKIPPED
[INFO] Apache CloudStack Console Proxy - Server .......... SKIPPED
[INFO] Apache CloudStack Framework - QuickCloud .......... SKIPPED
[INFO] ------------------------------------------------------------------------
[INFO] BUILD FAILURE
[INFO] ------------------------------------------------------------------------
[INFO] Total time: 2:58.262s
[INFO] Finished at: Tue Sep 09 16:38:36 CEST 2014
[INFO] Final Memory: 45M/362M
[INFO] ------------------------------------------------------------------------
[ERROR] Failed to execute goal org.apache.maven.plugins:maven-compiler-plugin:2.5.1:compile
(default-compile) on project cloud-plugin-hypervisor-xen: Compilation failure: Compilation
failure:
[ERROR] <http://jenkins.buildacloud.org/job/cloudstack-4.3-maven-build/ws/plugins/hypervisors/xen/src/org/apache/cloudstack/hypervisor/xenserver/XenServerResourceNewBase.java>:[108,33]
cannot find symbol
[ERROR] symbol  : method properFrom(com.xensource.xenapi.Connection,java.util.Set<java.lang.String>,java.lang.String,java.lang.Double)
[ERROR] location: class com.xensource.xenapi.Event
[ERROR] <http://jenkins.buildacloud.org/job/cloudstack-4.3-maven-build/ws/plugins/hypervisors/xen/src/org/apache/cloudstack/hypervisor/xenserver/XenServerResourceNewBase.java>:[171,39]
cannot find symbol
[ERROR] symbol  : method properFrom(com.xensource.xenapi.Connection,java.util.Set<java.lang.String>,java.lang.String,java.lang.Double)
[ERROR] location: class com.xensource.xenapi.Event
[ERROR] <http://jenkins.buildacloud.org/job/cloudstack-4.3-maven-build/ws/plugins/hypervisors/xen/src/org/apache/cloudstack/hypervisor/xenserver/XenServerResourceNewBase.java>:[308,35]
cannot find symbol
[ERROR] symbol  : method properFrom(com.xensource.xenapi.Connection,java.util.Set<java.lang.String>,java.lang.String,java.lang.Double)
[ERROR] location: class com.xensource.xenapi.Event
[ERROR] <http://jenkins.buildacloud.org/job/cloudstack-4.3-maven-build/ws/plugins/hypervisors/xen/src/com/cloud/hypervisor/xen/resource/Xenserver625StorageProcessor.java>:[177,34]
cannot find symbol
[ERROR] symbol  : method copyAsync2(com.xensource.xenapi.Connection,com.xensource.xenapi.SR,<nulltype>,<nulltype>)
[ERROR] location: class com.xensource.xenapi.VDI
[ERROR] <http://jenkins.buildacloud.org/job/cloudstack-4.3-maven-build/ws/plugins/hypervisors/xen/src/com/cloud/hypervisor/xen/resource/Xenserver625StorageProcessor.java>:[236,34]
cannot find symbol
[ERROR] symbol  : method copyAsync2(com.xensource.xenapi.Connection,com.xensource.xenapi.SR,com.xensource.xenapi.VDI,<nulltype>)
[ERROR] location: class com.xensource.xenapi.VDI
[ERROR] <http://jenkins.buildacloud.org/job/cloudstack-4.3-maven-build/ws/plugins/hypervisors/xen/src/com/cloud/hypervisor/xen/resource/Xenserver625StorageProcessor.java>:[347,43]
cannot find symbol
[ERROR] symbol  : method copyAsync2(com.xensource.xenapi.Connection,com.xensource.xenapi.SR,<nulltype>,<nulltype>)
[ERROR] location: class com.xensource.xenapi.VDI
[ERROR] <http://jenkins.buildacloud.org/job/cloudstack-4.3-maven-build/ws/plugins/hypervisors/xen/src/com/cloud/hypervisor/xen/resource/Xenserver625StorageProcessor.java>:[465,27]
cannot find symbol
[ERROR] symbol  : method copyAsync2(com.xensource.xenapi.Connection,com.xensource.xenapi.SR,<nulltype>,<nulltype>)
[ERROR] location: class com.xensource.xenapi.VDI
[ERROR] <http://jenkins.buildacloud.org/job/cloudstack-4.3-maven-build/ws/plugins/hypervisors/xen/src/com/cloud/hypervisor/xen/resource/Xenserver625StorageProcessor.java>:[581,37]
cannot find symbol
[ERROR] symbol  : method copyAsync2(com.xensource.xenapi.Connection,<nulltype>,<nulltype>,com.xensource.xenapi.VDI)
[ERROR] location: class com.xensource.xenapi.VDI
[ERROR] <http://jenkins.buildacloud.org/job/cloudstack-4.3-maven-build/ws/plugins/hypervisors/xen/src/com/cloud/hypervisor/xen/resource/Xenserver625StorageProcessor.java>:[644,34]
cannot find symbol
[ERROR] symbol  : method copyAsync2(com.xensource.xenapi.Connection,com.xensource.xenapi.SR,<nulltype>,<nulltype>)
[ERROR] location: class com.xensource.xenapi.VDI
[ERROR] <http://jenkins.buildacloud.org/job/cloudstack-4.3-maven-build/ws/plugins/hypervisors/xen/src/com/cloud/hypervisor/xen/resource/Xenserver625StorageProcessor.java>:[696,34]
cannot find symbol
[ERROR] symbol  : method copyAsync2(com.xensource.xenapi.Connection,com.xensource.xenapi.SR,<nulltype>,<nulltype>)
[ERROR] location: class com.xensource.xenapi.VDI
[ERROR] <http://jenkins.buildacloud.org/job/cloudstack-4.3-maven-build/ws/plugins/hypervisors/xen/src/com/cloud/hypervisor/xen/resource/Xenserver625StorageProcessor.java>:[780,37]
cannot find symbol
[ERROR] symbol  : method copyAsync2(com.xensource.xenapi.Connection,<nulltype>,<nulltype>,com.xensource.xenapi.VDI)
[ERROR] location: class com.xensource.xenapi.VDI
[ERROR] -> [Help 1]
[ERROR] 
[ERROR] To see the full stack trace of the errors, re-run Maven with the -e switch.
[ERROR] Re-run Maven using the -X switch to enable full debug logging.
[ERROR] 
[ERROR] For more information about the errors and possible solutions, please read the following
articles:
[ERROR] [Help 1] http://cwiki.apache.org/confluence/display/MAVEN/MojoFailureException
[ERROR] 
[ERROR] After correcting the problems, you can resume the build with the command
[ERROR]   mvn <goals> -rf :cloud-plugin-hypervisor-xen
Build step 'Invoke top-level Maven targets' marked build as failure

Mime
View raw message