cloudstack-dev mailing list archives

Site index · List index
Message view « Date » · « Thread »
Top « Date » · « Thread »
From jenk...@cloudstack.org
Subject Build failed in Jenkins: build-master-noredist #3499
Date Wed, 10 Sep 2014 12:02:42 GMT
See <http://jenkins.buildacloud.org/job/build-master-noredist/3499/changes>

Changes:

[Rohit Yadav] CLOUDSTACK-6099 live migration is failing for vm deployed using dynaic compute
offerings with NPE

------------------------------------------
[...truncated 5058 lines...]
[INFO] --- maven-site-plugin:3.3:attach-descriptor (attach-descriptor) @ cloud-plugin-user-authenticator-md5
---
[INFO] 
[INFO] --- maven-install-plugin:2.3.1:install (default-install) @ cloud-plugin-user-authenticator-md5
---
[INFO] Installing <http://jenkins.buildacloud.org/job/build-master-noredist/ws/plugins/user-authenticators/md5/target/cloud-plugin-user-authenticator-md5-4.5.0-SNAPSHOT.jar>
to /jenkins/.m2/repository/org/apache/cloudstack/cloud-plugin-user-authenticator-md5/4.5.0-SNAPSHOT/cloud-plugin-user-authenticator-md5-4.5.0-SNAPSHOT.jar
[INFO] Installing <http://jenkins.buildacloud.org/job/build-master-noredist/ws/plugins/user-authenticators/md5/pom.xml>
to /jenkins/.m2/repository/org/apache/cloudstack/cloud-plugin-user-authenticator-md5/4.5.0-SNAPSHOT/cloud-plugin-user-authenticator-md5-4.5.0-SNAPSHOT.pom
[INFO]                                                                         
[INFO] ------------------------------------------------------------------------
[INFO] Building Apache CloudStack Plugin - User Authenticator Plain Text 4.5.0-SNAPSHOT
[INFO] ------------------------------------------------------------------------
[INFO] 
[INFO] --- maven-clean-plugin:2.5:clean (default-clean) @ cloud-plugin-user-authenticator-plaintext
---
[INFO] Deleting <http://jenkins.buildacloud.org/job/build-master-noredist/ws/plugins/user-authenticators/plain-text/target>
(includes = [**/*], excludes = [])
[INFO] Deleting <http://jenkins.buildacloud.org/job/build-master-noredist/ws/plugins/user-authenticators/plain-text>
(includes = [target, dist], excludes = [])
[INFO] 
[INFO] --- maven-checkstyle-plugin:2.11:check (cloudstack-checkstyle) @ cloud-plugin-user-authenticator-plaintext
---
[INFO] Starting audit...
Audit done.

[INFO] 
[INFO] --- maven-remote-resources-plugin:1.3:process (default) @ cloud-plugin-user-authenticator-plaintext
---
[INFO] 
[INFO] --- maven-resources-plugin:2.5:resources (default-resources) @ cloud-plugin-user-authenticator-plaintext
---
[debug] execute contextualize
[INFO] Using 'UTF-8' encoding to copy filtered resources.
[INFO] Copying 2 resources
[INFO] Copying 3 resources
[INFO] 
[INFO] --- maven-compiler-plugin:2.5.1:compile (default-compile) @ cloud-plugin-user-authenticator-plaintext
---
[INFO] Compiling 1 source file to <http://jenkins.buildacloud.org/job/build-master-noredist/ws/plugins/user-authenticators/plain-text/target/classes>
[INFO] 
[INFO] --- maven-resources-plugin:2.5:testResources (default-testResources) @ cloud-plugin-user-authenticator-plaintext
---
[debug] execute contextualize
[INFO] Using 'UTF-8' encoding to copy filtered resources.
[INFO] skip non existing resourceDirectory <http://jenkins.buildacloud.org/job/build-master-noredist/ws/plugins/user-authenticators/plain-text/test/resources>
[INFO] Copying 3 resources
[INFO] 
[INFO] --- maven-compiler-plugin:2.5.1:testCompile (default-testCompile) @ cloud-plugin-user-authenticator-plaintext
---
[INFO] No sources to compile
[INFO] 
[INFO] --- maven-surefire-plugin:2.12:test (default-test) @ cloud-plugin-user-authenticator-plaintext
---
[INFO] Surefire report directory: <http://jenkins.buildacloud.org/job/build-master-noredist/ws/plugins/user-authenticators/plain-text/target/surefire-reports>

-------------------------------------------------------
 T E S T S
-------------------------------------------------------

Results :

Tests run: 0, Failures: 0, Errors: 0, Skipped: 0

[INFO] 
[INFO] --- maven-jar-plugin:2.4:jar (default-jar) @ cloud-plugin-user-authenticator-plaintext
---
[INFO] Building jar: <http://jenkins.buildacloud.org/job/build-master-noredist/ws/plugins/user-authenticators/plain-text/target/cloud-plugin-user-authenticator-plaintext-4.5.0-SNAPSHOT.jar>
[INFO] 
[INFO] --- maven-site-plugin:3.3:attach-descriptor (attach-descriptor) @ cloud-plugin-user-authenticator-plaintext
---
[INFO] 
[INFO] --- maven-install-plugin:2.3.1:install (default-install) @ cloud-plugin-user-authenticator-plaintext
---
[INFO] Installing <http://jenkins.buildacloud.org/job/build-master-noredist/ws/plugins/user-authenticators/plain-text/target/cloud-plugin-user-authenticator-plaintext-4.5.0-SNAPSHOT.jar>
to /jenkins/.m2/repository/org/apache/cloudstack/cloud-plugin-user-authenticator-plaintext/4.5.0-SNAPSHOT/cloud-plugin-user-authenticator-plaintext-4.5.0-SNAPSHOT.jar
[INFO] Installing <http://jenkins.buildacloud.org/job/build-master-noredist/ws/plugins/user-authenticators/plain-text/pom.xml>
to /jenkins/.m2/repository/org/apache/cloudstack/cloud-plugin-user-authenticator-plaintext/4.5.0-SNAPSHOT/cloud-plugin-user-authenticator-plaintext-4.5.0-SNAPSHOT.pom
[INFO]                                                                         
[INFO] ------------------------------------------------------------------------
[INFO] Building Apache CloudStack Plugin - User Authenticator SAML2 4.5.0-SNAPSHOT
[INFO] ------------------------------------------------------------------------
[INFO] 
[INFO] --- maven-clean-plugin:2.5:clean (default-clean) @ cloud-plugin-user-authenticator-saml2
---
[INFO] Deleting <http://jenkins.buildacloud.org/job/build-master-noredist/ws/plugins/user-authenticators/saml2/target>
(includes = [**/*], excludes = [])
[INFO] Deleting <http://jenkins.buildacloud.org/job/build-master-noredist/ws/plugins/user-authenticators/saml2>
(includes = [target, dist], excludes = [])
[INFO] 
[INFO] --- maven-checkstyle-plugin:2.11:check (cloudstack-checkstyle) @ cloud-plugin-user-authenticator-saml2
---
[INFO] Starting audit...
Audit done.

[INFO] 
[INFO] --- maven-remote-resources-plugin:1.3:process (default) @ cloud-plugin-user-authenticator-saml2
---
[INFO] 
[INFO] --- maven-resources-plugin:2.5:resources (default-resources) @ cloud-plugin-user-authenticator-saml2
---
[debug] execute contextualize
[INFO] Using 'UTF-8' encoding to copy filtered resources.
[INFO] Copying 2 resources
[INFO] Copying 3 resources
[INFO] 
[INFO] --- maven-compiler-plugin:2.5.1:compile (default-compile) @ cloud-plugin-user-authenticator-saml2
---
[INFO] Compiling 7 source files to <http://jenkins.buildacloud.org/job/build-master-noredist/ws/plugins/user-authenticators/saml2/target/classes>
[INFO] 
[INFO] --- maven-resources-plugin:2.5:testResources (default-testResources) @ cloud-plugin-user-authenticator-saml2
---
[debug] execute contextualize
[INFO] Using 'UTF-8' encoding to copy filtered resources.
[INFO] skip non existing resourceDirectory <http://jenkins.buildacloud.org/job/build-master-noredist/ws/plugins/user-authenticators/saml2/test/resources>
[INFO] Copying 3 resources
[INFO] 
[INFO] --- maven-compiler-plugin:2.5.1:testCompile (default-testCompile) @ cloud-plugin-user-authenticator-saml2
---
[INFO] Compiling 4 source files to <http://jenkins.buildacloud.org/job/build-master-noredist/ws/plugins/user-authenticators/saml2/target/test-classes>
[INFO] 
[INFO] --- maven-surefire-plugin:2.12:test (default-test) @ cloud-plugin-user-authenticator-saml2
---
[INFO] Surefire report directory: <http://jenkins.buildacloud.org/job/build-master-noredist/ws/plugins/user-authenticators/saml2/target/surefire-reports>

-------------------------------------------------------
 T E S T S
-------------------------------------------------------
Running org.apache.cloudstack.SAML2UserAuthenticatorTest
log4j:WARN No appenders could be found for logger (org.apache.cloudstack.saml.SAML2UserAuthenticator).
log4j:WARN Please initialize the log4j system properly.
log4j:WARN See http://logging.apache.org/log4j/1.2/faq.html#noconfig for more info.
Tests run: 2, Failures: 1, Errors: 0, Skipped: 0, Time elapsed: 0.784 sec <<< FAILURE!
Running org.apache.cloudstack.api.command.SAML2LoginAPIAuthenticatorCmdTest
[Fatal Error] :-1:-1: Premature end of file.
Tests run: 2, Failures: 0, Errors: 0, Skipped: 0, Time elapsed: 4.694 sec
Running org.apache.cloudstack.api.command.SAML2LogoutAPIAuthenticatorCmdTest
Tests run: 2, Failures: 0, Errors: 0, Skipped: 0, Time elapsed: 0.574 sec
Running org.apache.cloudstack.api.command.GetServiceProviderMetaDataCmdTest
Tests run: 2, Failures: 0, Errors: 0, Skipped: 0, Time elapsed: 0.812 sec

Results :

Failed tests:   encode(org.apache.cloudstack.SAML2UserAuthenticatorTest)

Tests run: 8, Failures: 1, Errors: 0, Skipped: 0

[INFO] ------------------------------------------------------------------------
[INFO] Reactor Summary:
[INFO] 
[INFO] Apache CloudStack Developer Tools - Checkstyle Configuration  SUCCESS [0.910s]
[INFO] Apache CloudStack ................................. SUCCESS [1.529s]
[INFO] Apache CloudStack Maven Conventions Parent ........ SUCCESS [0.839s]
[INFO] Apache CloudStack Framework - Managed Context ..... SUCCESS [2.736s]
[INFO] Apache CloudStack Utils ........................... SUCCESS [11.324s]
[INFO] Apache CloudStack Framework ....................... SUCCESS [0.078s]
[INFO] Apache CloudStack Framework - Event Notification .. SUCCESS [6.245s]
[INFO] Apache CloudStack Framework - Configuration ....... SUCCESS [3.741s]
[INFO] Apache CloudStack API ............................. SUCCESS [13.755s]
[INFO] Apache CloudStack Framework - REST ................ SUCCESS [2.507s]
[INFO] Apache CloudStack Framework - IPC ................. SUCCESS [5.448s]
[INFO] Apache CloudStack Cloud Engine .................... SUCCESS [0.048s]
[INFO] Apache CloudStack Cloud Engine API ................ SUCCESS [4.291s]
[INFO] Apache CloudStack Framework - Security ............ SUCCESS [2.228s]
[INFO] Apache CloudStack Core ............................ SUCCESS [17.746s]
[INFO] Apache CloudStack Agents .......................... SUCCESS [5.556s]
[INFO] Apache CloudStack Framework - Clustering .......... SUCCESS [2.786s]
[INFO] Apache CloudStack Framework - Event Notification .. SUCCESS [1.706s]
[INFO] Apache CloudStack Cloud Engine Schema Component ... SUCCESS [12.434s]
[INFO] Apache CloudStack Framework - Jobs ................ SUCCESS [4.525s]
[INFO] Apache CloudStack Cloud Engine Internal Components API  SUCCESS [2.639s]
[INFO] Apache CloudStack Server .......................... SUCCESS [34.661s]
[INFO] Apache CloudStack Usage Server .................... SUCCESS [5.422s]
[INFO] Apache CloudStack Cloud Engine Orchestration Component  SUCCESS [7.381s]
[INFO] Apache CloudStack Cloud Services .................. SUCCESS [0.048s]
[INFO] Apache CloudStack Secondary Storage ............... SUCCESS [0.329s]
[INFO] Apache CloudStack Secondary Storage Service ....... SUCCESS [4.330s]
[INFO] Apache CloudStack Engine Storage Component ........ SUCCESS [5.709s]
[INFO] Apache CloudStack Engine Storage Volume Component . SUCCESS [3.768s]
[INFO] Apache CloudStack Engine Storage Image Component .. SUCCESS [2.499s]
[INFO] Apache CloudStack Engine Storage Data Motion Component  SUCCESS [2.234s]
[INFO] Apache CloudStack Engine Storage Cache Component .. SUCCESS [2.092s]
[INFO] Apache CloudStack Engine Storage Snapshot Component  SUCCESS [6.077s]
[INFO] Apache CloudStack Cloud Engine API ................ SUCCESS [1.778s]
[INFO] Apache CloudStack Cloud Engine Service ............ SUCCESS [4.859s]
[INFO] Apache CloudStack Plugin POM ...................... SUCCESS [0.390s]
[INFO] Apache CloudStack Plugin - API Rate Limit ......... SUCCESS [5.690s]
[INFO] Apache CloudStack Plugin - Storage Volume default provider  SUCCESS [2.137s]
[INFO] Apache CloudStack Plugin - Storage Volume SolidFire Provider  SUCCESS [3.982s]
[INFO] Apache CloudStack Plugin - API SolidFire .......... SUCCESS [2.153s]
[INFO] Apache CloudStack Plugin - API Discovery .......... SUCCESS [3.785s]
[INFO] Apache CloudStack Plugin - ACL Static Role Based .. SUCCESS [1.909s]
[INFO] Apache CloudStack Plugin - Host Anti-Affinity Processor  SUCCESS [1.960s]
[INFO] Apache CloudStack Plugin - Explicit Dedication Processor  SUCCESS [2.094s]
[INFO] Apache CloudStack Plugin - User Concentrated Pod Deployment Planner  SUCCESS [1.956s]
[INFO] Apache CloudStack Plugin - User Dispersing Deployment Planner  SUCCESS [2.105s]
[INFO] Apache CloudStack Plugin - Implicit Dedication Planner  SUCCESS [5.767s]
[INFO] Apache CloudStack Plugin - Skip Heurestics Planner  SUCCESS [1.909s]
[INFO] Apache CloudStack Plugin - Host Allocator Random .. SUCCESS [2.058s]
[INFO] Apache CloudStack Plugin - Dedicated Resources .... SUCCESS [5.700s]
[INFO] Apache CloudStack Plugin - Hypervisor OracleVM .... SUCCESS [2.889s]
[INFO] Apache CloudStack Plugin - Open vSwitch ........... SUCCESS [3.044s]
[INFO] Apache CloudStack Plugin - Hypervisor XenServer ... SUCCESS [7.750s]
[INFO] Apache CloudStack Plugin - Hypervisor KVM ......... SUCCESS [7.811s]
[INFO] Apache CloudStack Plugin - RabbitMQ Event Bus ..... SUCCESS [2.208s]
[INFO] Apache CloudStack Plugin - In Memory Event Bus .... SUCCESS [3.733s]
[INFO] Apache CloudStack Plugin - Hypervisor Baremetal ... SUCCESS [4.249s]
[INFO] Apache CloudStack Plugin - Hypervisor UCS ......... SUCCESS [2.436s]
[INFO] Apache CloudStack Plugin - Hypervisor Hyper-V ..... SUCCESS [4.844s]
[INFO] Apache CloudStack Plugin - Network Elastic Load Balancer  SUCCESS [4.836s]
[INFO] Apache CloudStack Plugin - Network Internal Load Balancer  SUCCESS [7.752s]
[INFO] Apache CloudStack Framework - Spring Life Cycle ... SUCCESS [1.957s]
[INFO] Apache CloudStack Plugin - Network Juniper Contrail  SUCCESS [12.054s]
[INFO] Apache CloudStack Plugin - Palo Alto .............. SUCCESS [6.840s]
[INFO] Apache CloudStack Plugin - Network Netscaler ...... SUCCESS [4.689s]
[INFO] Apache CloudStack Plugin - Network Nicira NVP ..... SUCCESS [10.465s]
[INFO] Apache CloudStack Plugin - BigSwitch Virtual Network Segment  SUCCESS [5.703s]
[INFO] Apache CloudStack Plugin - Network Brocade VCS .... SUCCESS [8.296s]
[INFO] Apache CloudStack Plugin - Midokura Midonet ....... SUCCESS [6.349s]
[INFO] Apache CloudStack Plugin - Stratosphere SSP ....... SUCCESS [6.271s]
[INFO] Apache CloudStack Plugin - Network Opendaylight ... SUCCESS [5.418s]
[INFO] Apache CloudStack Plugin - Storage Allocator Random  SUCCESS [2.142s]
[INFO] Apache CloudStack Plugin - User Authenticator LDAP  SUCCESS [3.473s]
[INFO] Apache CloudStack Plugin - User Authenticator MD5 . SUCCESS [3.965s]
[INFO] Apache CloudStack Plugin - User Authenticator Plain Text  SUCCESS [2.183s]
[INFO] Apache CloudStack Plugin - User Authenticator SAML2  FAILURE [11.304s]
[INFO] Apache CloudStack Plugin - User Authenticator SHA256 Salted  SKIPPED
[INFO] Apache CloudStack Plugin - Dns Notifier Example ... SKIPPED
[INFO] Apache CloudStack Plugin - Storage Image S3 ....... SKIPPED
[INFO] Apache CloudStack Plugin - Storage Image Swift provider  SKIPPED
[INFO] Apache CloudStack Plugin - Storage Image default provider  SKIPPED
[INFO] Apache CloudStack Plugin - Storage Image sample provider  SKIPPED
[INFO] Apache CloudStack Plugin - Storage Volume Nexenta Provider  SKIPPED
[INFO] Apache CloudStack Plugin - Storage Volume CloudByte Provider  SKIPPED
[INFO] Apache CloudStack Plugin - Storage Volume sample provider  SKIPPED
[INFO] Apache CloudStack Plugin - SNMP Alerts ............ SKIPPED
[INFO] Apache CloudStack Plugin - Syslog Alerts .......... SKIPPED
[INFO] Apache CloudStack Plugin - Network VXLAN .......... SKIPPED
[INFO] Apache CloudStack Plugin - GloboDNS ............... SKIPPED
[INFO] Apache CloudStack Plugin - NetApp File System ..... SKIPPED
[INFO] Apache CloudStack Plugin - F5 ..................... SKIPPED
[INFO] Apache CloudStack Plugin - Juniper SRX ............ SKIPPED
[INFO] Apache CloudStack Plugin - Nuage VSP .............. SKIPPED
[INFO] Apache CloudStack VMware Base ..................... SKIPPED
[INFO] Apache CloudStack Plugin - Hypervisor VMware ...... SKIPPED
[INFO] Apache CloudStack Plugin - Cisco VNMC ............. SKIPPED
[INFO] Apache CloudStack Plugin - MySQL HA Strategy ...... SKIPPED
[INFO] Apache CloudStack Framework - Spring Module ....... SKIPPED
[INFO] Apache CloudStack Secondary Storage Controller .... SKIPPED
[INFO] Apache CloudStack Console Proxy - RDP Client ...... SKIPPED
[INFO] Apache CloudStack Console Proxy ................... SKIPPED
[INFO] Apache CloudStack Console Proxy - Server .......... SKIPPED
[INFO] Apache CloudStack System VM ....................... SKIPPED
[INFO] Apache CloudStack Client UI ....................... SKIPPED
[INFO] Apache CloudStack Framework - QuickCloud .......... SKIPPED
[INFO] Apache CloudStack AWS API Bridge .................. SKIPPED
[INFO] ------------------------------------------------------------------------
[INFO] BUILD FAILURE
[INFO] ------------------------------------------------------------------------
[INFO] Total time: 6:13.235s
[INFO] Finished at: Wed Sep 10 13:54:42 CEST 2014
[INFO] Final Memory: 88M/401M
[INFO] ------------------------------------------------------------------------
[ERROR] Failed to execute goal org.apache.maven.plugins:maven-surefire-plugin:2.12:test (default-test)
on project cloud-plugin-user-authenticator-saml2: There are test failures.
[ERROR] 
[ERROR] Please refer to <http://jenkins.buildacloud.org/job/build-master-noredist/ws/plugins/user-authenticators/saml2/target/surefire-reports>
for the individual test results.
[ERROR] -> [Help 1]
[ERROR] 
[ERROR] To see the full stack trace of the errors, re-run Maven with the -e switch.
[ERROR] Re-run Maven using the -X switch to enable full debug logging.
[ERROR] 
[ERROR] For more information about the errors and possible solutions, please read the following
articles:
[ERROR] [Help 1] http://cwiki.apache.org/confluence/display/MAVEN/MojoFailureException
[ERROR] 
[ERROR] After correcting the problems, you can resume the build with the command
[ERROR]   mvn <goals> -rf :cloud-plugin-user-authenticator-saml2
Build step 'Invoke top-level Maven targets' marked build as failure
Archiving artifacts

Mime
View raw message