cloudstack-dev mailing list archives

Site index · List index
Message view « Date » · « Thread »
Top « Date » · « Thread »
From jenk...@cloudstack.org
Subject Build failed in Jenkins: build-master #1521
Date Tue, 02 Sep 2014 10:51:21 GMT
See <http://jenkins.buildacloud.org/job/build-master/1521/changes>

Changes:

[rajanikaruturi] CLOUDSTACK-7463: UI: Domain Admin UI shows 'Add LDAP Users' button (should
not be shown)

------------------------------------------
[...truncated 3885 lines...]
[INFO] skip non existing resourceDirectory <http://jenkins.buildacloud.org/job/build-master/ws/plugins/user-authenticators/md5/test/resources>
[INFO] Copying 3 resources
[INFO] 
[INFO] --- maven-compiler-plugin:2.5.1:testCompile (default-testCompile) @ cloud-plugin-user-authenticator-md5
---
[INFO] Compiling 1 source file to <http://jenkins.buildacloud.org/job/build-master/ws/plugins/user-authenticators/md5/target/test-classes>
[INFO] 
[INFO] --- maven-surefire-plugin:2.12:test (default-test) @ cloud-plugin-user-authenticator-md5
---
[INFO] Surefire report directory: <http://jenkins.buildacloud.org/job/build-master/ws/plugins/user-authenticators/md5/target/surefire-reports>

-------------------------------------------------------
 T E S T S
-------------------------------------------------------
Running com.cloud.server.auth.MD5UserAuthenticatorTest
log4j:WARN No appenders could be found for logger (com.cloud.server.auth.MD5UserAuthenticator).
log4j:WARN Please initialize the log4j system properly.
log4j:WARN See http://logging.apache.org/log4j/1.2/faq.html#noconfig for more info.
Tests run: 4, Failures: 0, Errors: 0, Skipped: 0, Time elapsed: 0.578 sec

Results :

Tests run: 4, Failures: 0, Errors: 0, Skipped: 0

[INFO]                                                                         
[INFO] ------------------------------------------------------------------------
[INFO] Building Apache CloudStack Plugin - User Authenticator Plain Text 4.5.0-SNAPSHOT
[INFO] ------------------------------------------------------------------------
[INFO] 
[INFO] --- maven-clean-plugin:2.5:clean (default-clean) @ cloud-plugin-user-authenticator-plaintext
---
[INFO] Deleting <http://jenkins.buildacloud.org/job/build-master/ws/plugins/user-authenticators/plain-text/target>
(includes = [**/*], excludes = [])
[INFO] Deleting <http://jenkins.buildacloud.org/job/build-master/ws/plugins/user-authenticators/plain-text>
(includes = [target, dist], excludes = [])
[INFO] 
[INFO] --- maven-checkstyle-plugin:2.11:check (cloudstack-checkstyle) @ cloud-plugin-user-authenticator-plaintext
---
[INFO] Starting audit...
Audit done.

[INFO] 
[INFO] --- maven-remote-resources-plugin:1.3:process (default) @ cloud-plugin-user-authenticator-plaintext
---
[INFO] 
[INFO] --- maven-resources-plugin:2.5:resources (default-resources) @ cloud-plugin-user-authenticator-plaintext
---
[debug] execute contextualize
[INFO] Using 'UTF-8' encoding to copy filtered resources.
[INFO] Copying 2 resources
[INFO] Copying 3 resources
[INFO] 
[INFO] --- maven-compiler-plugin:2.5.1:compile (default-compile) @ cloud-plugin-user-authenticator-plaintext
---
[INFO] Compiling 1 source file to <http://jenkins.buildacloud.org/job/build-master/ws/plugins/user-authenticators/plain-text/target/classes>
[INFO] 
[INFO] --- maven-resources-plugin:2.5:testResources (default-testResources) @ cloud-plugin-user-authenticator-plaintext
---
[debug] execute contextualize
[INFO] Using 'UTF-8' encoding to copy filtered resources.
[INFO] skip non existing resourceDirectory <http://jenkins.buildacloud.org/job/build-master/ws/plugins/user-authenticators/plain-text/test/resources>
[INFO] Copying 3 resources
[INFO] 
[INFO] --- maven-compiler-plugin:2.5.1:testCompile (default-testCompile) @ cloud-plugin-user-authenticator-plaintext
---
[INFO] No sources to compile
[INFO] 
[INFO] --- maven-surefire-plugin:2.12:test (default-test) @ cloud-plugin-user-authenticator-plaintext
---
[INFO] Surefire report directory: <http://jenkins.buildacloud.org/job/build-master/ws/plugins/user-authenticators/plain-text/target/surefire-reports>

-------------------------------------------------------
 T E S T S
-------------------------------------------------------

Results :

Tests run: 0, Failures: 0, Errors: 0, Skipped: 0

[INFO]                                                                         
[INFO] ------------------------------------------------------------------------
[INFO] Building Apache CloudStack Plugin - User Authenticator SAML2 4.5.0-SNAPSHOT
[INFO] ------------------------------------------------------------------------
[INFO] 
[INFO] --- maven-clean-plugin:2.5:clean (default-clean) @ cloud-plugin-user-authenticator-saml2
---
[INFO] Deleting <http://jenkins.buildacloud.org/job/build-master/ws/plugins/user-authenticators/saml2/target>
(includes = [**/*], excludes = [])
[INFO] Deleting <http://jenkins.buildacloud.org/job/build-master/ws/plugins/user-authenticators/saml2>
(includes = [target, dist], excludes = [])
[INFO] 
[INFO] --- maven-checkstyle-plugin:2.11:check (cloudstack-checkstyle) @ cloud-plugin-user-authenticator-saml2
---
[INFO] Starting audit...
Audit done.

[INFO] 
[INFO] --- maven-remote-resources-plugin:1.3:process (default) @ cloud-plugin-user-authenticator-saml2
---
[INFO] 
[INFO] --- maven-resources-plugin:2.5:resources (default-resources) @ cloud-plugin-user-authenticator-saml2
---
[debug] execute contextualize
[INFO] Using 'UTF-8' encoding to copy filtered resources.
[INFO] Copying 2 resources
[INFO] Copying 3 resources
[INFO] 
[INFO] --- maven-compiler-plugin:2.5.1:compile (default-compile) @ cloud-plugin-user-authenticator-saml2
---
[INFO] Compiling 7 source files to <http://jenkins.buildacloud.org/job/build-master/ws/plugins/user-authenticators/saml2/target/classes>
[INFO] 
[INFO] --- maven-resources-plugin:2.5:testResources (default-testResources) @ cloud-plugin-user-authenticator-saml2
---
[debug] execute contextualize
[INFO] Using 'UTF-8' encoding to copy filtered resources.
[INFO] skip non existing resourceDirectory <http://jenkins.buildacloud.org/job/build-master/ws/plugins/user-authenticators/saml2/test/resources>
[INFO] Copying 3 resources
[INFO] 
[INFO] --- maven-compiler-plugin:2.5.1:testCompile (default-testCompile) @ cloud-plugin-user-authenticator-saml2
---
[INFO] Compiling 4 source files to <http://jenkins.buildacloud.org/job/build-master/ws/plugins/user-authenticators/saml2/target/test-classes>
[INFO] 
[INFO] --- maven-surefire-plugin:2.12:test (default-test) @ cloud-plugin-user-authenticator-saml2
---
[INFO] Surefire report directory: <http://jenkins.buildacloud.org/job/build-master/ws/plugins/user-authenticators/saml2/target/surefire-reports>

-------------------------------------------------------
 T E S T S
-------------------------------------------------------
Running org.apache.cloudstack.SAML2UserAuthenticatorTest
log4j:WARN No appenders could be found for logger (org.apache.cloudstack.saml.SAML2UserAuthenticator).
log4j:WARN Please initialize the log4j system properly.
log4j:WARN See http://logging.apache.org/log4j/1.2/faq.html#noconfig for more info.
Tests run: 2, Failures: 1, Errors: 0, Skipped: 0, Time elapsed: 0.73 sec <<< FAILURE!
Running org.apache.cloudstack.api.command.SAML2LoginAPIAuthenticatorCmdTest
[Fatal Error] :-1:-1: Premature end of file.
Tests run: 2, Failures: 0, Errors: 0, Skipped: 0, Time elapsed: 3.155 sec
Running org.apache.cloudstack.api.command.SAML2LogoutAPIAuthenticatorCmdTest
Tests run: 2, Failures: 0, Errors: 0, Skipped: 0, Time elapsed: 0.771 sec
Running org.apache.cloudstack.api.command.GetServiceProviderMetaDataCmdTest
Tests run: 2, Failures: 0, Errors: 0, Skipped: 0, Time elapsed: 0.922 sec

Results :

Failed tests:   encode(org.apache.cloudstack.SAML2UserAuthenticatorTest)

Tests run: 8, Failures: 1, Errors: 0, Skipped: 0

[INFO] ------------------------------------------------------------------------
[INFO] Reactor Summary:
[INFO] 
[INFO] Apache CloudStack Developer Tools - Checkstyle Configuration  SUCCESS [0.556s]
[INFO] Apache CloudStack ................................. SUCCESS [0.510s]
[INFO] Apache CloudStack Maven Conventions Parent ........ SUCCESS [0.890s]
[INFO] Apache CloudStack Framework - Managed Context ..... SUCCESS [2.452s]
[INFO] Apache CloudStack Utils ........................... SUCCESS [9.918s]
[INFO] Apache CloudStack Framework ....................... SUCCESS [0.039s]
[INFO] Apache CloudStack Framework - Event Notification .. SUCCESS [5.609s]
[INFO] Apache CloudStack Framework - Configuration ....... SUCCESS [3.449s]
[INFO] Apache CloudStack API ............................. SUCCESS [10.624s]
[INFO] Apache CloudStack Framework - REST ................ SUCCESS [2.149s]
[INFO] Apache CloudStack Framework - IPC ................. SUCCESS [4.993s]
[INFO] Apache CloudStack Cloud Engine .................... SUCCESS [0.033s]
[INFO] Apache CloudStack Cloud Engine API ................ SUCCESS [3.666s]
[INFO] Apache CloudStack Framework - Security ............ SUCCESS [1.919s]
[INFO] Apache CloudStack Core ............................ SUCCESS [7.661s]
[INFO] Apache CloudStack Agents .......................... SUCCESS [4.328s]
[INFO] Apache CloudStack Framework - Clustering .......... SUCCESS [2.676s]
[INFO] Apache CloudStack Framework - Event Notification .. SUCCESS [1.612s]
[INFO] Apache CloudStack Cloud Engine Schema Component ... SUCCESS [13.255s]
[INFO] Apache CloudStack Framework - Jobs ................ SUCCESS [5.116s]
[INFO] Apache CloudStack Cloud Engine Internal Components API  SUCCESS [2.643s]
[INFO] Apache CloudStack Server .......................... SUCCESS [36.323s]
[INFO] Apache CloudStack Usage Server .................... SUCCESS [5.761s]
[INFO] Apache CloudStack Cloud Engine Orchestration Component  SUCCESS [8.241s]
[INFO] Apache CloudStack Cloud Services .................. SUCCESS [0.032s]
[INFO] Apache CloudStack Secondary Storage ............... SUCCESS [0.258s]
[INFO] Apache CloudStack Secondary Storage Service ....... SUCCESS [4.731s]
[INFO] Apache CloudStack Engine Storage Component ........ SUCCESS [6.465s]
[INFO] Apache CloudStack Engine Storage Volume Component . SUCCESS [3.846s]
[INFO] Apache CloudStack Engine Storage Image Component .. SUCCESS [3.066s]
[INFO] Apache CloudStack Engine Storage Data Motion Component  SUCCESS [2.823s]
[INFO] Apache CloudStack Engine Storage Cache Component .. SUCCESS [2.366s]
[INFO] Apache CloudStack Engine Storage Snapshot Component  SUCCESS [7.065s]
[INFO] Apache CloudStack Cloud Engine API ................ SUCCESS [1.909s]
[INFO] Apache CloudStack Cloud Engine Service ............ SUCCESS [0.772s]
[INFO] Apache CloudStack Plugin POM ...................... SUCCESS [0.263s]
[INFO] Apache CloudStack Plugin - API Rate Limit ......... SUCCESS [6.102s]
[INFO] Apache CloudStack Plugin - Storage Volume default provider  SUCCESS [2.314s]
[INFO] Apache CloudStack Plugin - Storage Volume SolidFire Provider  SUCCESS [4.691s]
[INFO] Apache CloudStack Plugin - API SolidFire .......... SUCCESS [2.466s]
[INFO] Apache CloudStack Plugin - API Discovery .......... SUCCESS [4.518s]
[INFO] Apache CloudStack Plugin - ACL Static Role Based .. SUCCESS [2.059s]
[INFO] Apache CloudStack Plugin - Host Anti-Affinity Processor  SUCCESS [2.491s]
[INFO] Apache CloudStack Plugin - Explicit Dedication Processor  SUCCESS [2.374s]
[INFO] Apache CloudStack Plugin - User Concentrated Pod Deployment Planner  SUCCESS [2.140s]
[INFO] Apache CloudStack Plugin - User Dispersing Deployment Planner  SUCCESS [2.317s]
[INFO] Apache CloudStack Plugin - Implicit Dedication Planner  SUCCESS [7.051s]
[INFO] Apache CloudStack Plugin - Skip Heurestics Planner  SUCCESS [2.064s]
[INFO] Apache CloudStack Plugin - Host Allocator Random .. SUCCESS [2.162s]
[INFO] Apache CloudStack Plugin - Dedicated Resources .... SUCCESS [6.799s]
[INFO] Apache CloudStack Plugin - Hypervisor OracleVM .... SUCCESS [3.068s]
[INFO] Apache CloudStack Plugin - Open vSwitch ........... SUCCESS [3.119s]
[INFO] Apache CloudStack Plugin - Hypervisor XenServer ... SUCCESS [8.112s]
[INFO] Apache CloudStack Plugin - Hypervisor KVM ......... SUCCESS [7.335s]
[INFO] Apache CloudStack Plugin - RabbitMQ Event Bus ..... SUCCESS [1.897s]
[INFO] Apache CloudStack Plugin - In Memory Event Bus .... SUCCESS [3.514s]
[INFO] Apache CloudStack Plugin - Hypervisor Baremetal ... SUCCESS [3.512s]
[INFO] Apache CloudStack Plugin - Hypervisor UCS ......... SUCCESS [2.352s]
[INFO] Apache CloudStack Plugin - Hypervisor Hyper-V ..... SUCCESS [4.639s]
[INFO] Apache CloudStack Plugin - Network Elastic Load Balancer  SUCCESS [4.595s]
[INFO] Apache CloudStack Plugin - Network Internal Load Balancer  SUCCESS [7.167s]
[INFO] Apache CloudStack Framework - Spring Life Cycle ... SUCCESS [1.761s]
[INFO] Apache CloudStack Plugin - Network Juniper Contrail  SUCCESS [10.458s]
[INFO] Apache CloudStack Plugin - Palo Alto .............. SUCCESS [5.845s]
[INFO] Apache CloudStack Plugin - Network Netscaler ...... SUCCESS [3.277s]
[INFO] Apache CloudStack Plugin - Network Nicira NVP ..... SUCCESS [6.640s]
[INFO] Apache CloudStack Plugin - BigSwitch Virtual Network Segment  SUCCESS [4.860s]
[INFO] Apache CloudStack Plugin - Network Brocade VCS .... SUCCESS [6.800s]
[INFO] Apache CloudStack Plugin - Midokura Midonet ....... SUCCESS [5.389s]
[INFO] Apache CloudStack Plugin - Stratosphere SSP ....... SUCCESS [4.943s]
[INFO] Apache CloudStack Plugin - Network Opendaylight ... SUCCESS [4.553s]
[INFO] Apache CloudStack Plugin - Storage Allocator Random  SUCCESS [1.856s]
[INFO] Apache CloudStack Plugin - User Authenticator LDAP  SUCCESS [2.792s]
[INFO] Apache CloudStack Plugin - User Authenticator MD5 . SUCCESS [3.656s]
[INFO] Apache CloudStack Plugin - User Authenticator Plain Text  SUCCESS [1.828s]
[INFO] Apache CloudStack Plugin - User Authenticator SAML2  FAILURE [9.217s]
[INFO] Apache CloudStack Plugin - User Authenticator SHA256 Salted  SKIPPED
[INFO] Apache CloudStack Plugin - Dns Notifier Example ... SKIPPED
[INFO] Apache CloudStack Plugin - Storage Image S3 ....... SKIPPED
[INFO] Apache CloudStack Plugin - Storage Image Swift provider  SKIPPED
[INFO] Apache CloudStack Plugin - Storage Image default provider  SKIPPED
[INFO] Apache CloudStack Plugin - Storage Image sample provider  SKIPPED
[INFO] Apache CloudStack Plugin - Storage Volume Nexenta Provider  SKIPPED
[INFO] Apache CloudStack Plugin - Storage Volume CloudByte Provider  SKIPPED
[INFO] Apache CloudStack Plugin - Storage Volume sample provider  SKIPPED
[INFO] Apache CloudStack Plugin - SNMP Alerts ............ SKIPPED
[INFO] Apache CloudStack Plugin - Syslog Alerts .......... SKIPPED
[INFO] Apache CloudStack Plugin - Network VXLAN .......... SKIPPED
[INFO] Apache CloudStack Plugin - GloboDNS ............... SKIPPED
[INFO] Apache CloudStack Framework - Spring Module ....... SKIPPED
[INFO] Apache CloudStack Secondary Storage Controller .... SKIPPED
[INFO] Apache CloudStack Console Proxy - RDP Client ...... SKIPPED
[INFO] Apache CloudStack Console Proxy ................... SKIPPED
[INFO] Apache CloudStack Console Proxy - Server .......... SKIPPED
[INFO] Apache CloudStack System VM ....................... SKIPPED
[INFO] Apache CloudStack Client UI ....................... SKIPPED
[INFO] Apache CloudStack Framework - QuickCloud .......... SKIPPED
[INFO] Apache CloudStack AWS API Bridge .................. SKIPPED
[INFO] ------------------------------------------------------------------------
[INFO] BUILD FAILURE
[INFO] ------------------------------------------------------------------------
[INFO] Total time: 5:42.719s
[INFO] Finished at: Tue Sep 02 12:50:37 CEST 2014
[INFO] Final Memory: 75M/412M
[INFO] ------------------------------------------------------------------------
[ERROR] Failed to execute goal org.apache.maven.plugins:maven-surefire-plugin:2.12:test (default-test)
on project cloud-plugin-user-authenticator-saml2: There are test failures.
[ERROR] 
[ERROR] Please refer to <http://jenkins.buildacloud.org/job/build-master/ws/plugins/user-authenticators/saml2/target/surefire-reports>
for the individual test results.
[ERROR] -> [Help 1]
[ERROR] 
[ERROR] To see the full stack trace of the errors, re-run Maven with the -e switch.
[ERROR] Re-run Maven using the -X switch to enable full debug logging.
[ERROR] 
[ERROR] For more information about the errors and possible solutions, please read the following
articles:
[ERROR] [Help 1] http://cwiki.apache.org/confluence/display/MAVEN/MojoFailureException
[ERROR] 
[ERROR] After correcting the problems, you can resume the build with the command
[ERROR]   mvn <goals> -rf :cloud-plugin-user-authenticator-saml2
Build step 'Invoke top-level Maven targets' marked build as failure
Recording test results

Mime
View raw message