cloudstack-dev mailing list archives

Site index · List index
Message view « Date » · « Thread »
Top « Date » · « Thread »
From jenk...@cloudstack.org
Subject Build failed in Jenkins: cloudstack-4.3-maven-build #584
Date Tue, 09 Sep 2014 12:18:28 GMT
See <http://jenkins.buildacloud.org/job/cloudstack-4.3-maven-build/584/changes>

Changes:

[runseb] Update CHANGES file with 6224

------------------------------------------
[...truncated 2431 lines...]
215/419 KB   
219/419 KB   
223/419 KB   
227/419 KB   
231/419 KB   
235/419 KB   
239/419 KB   
243/419 KB   
247/419 KB   
249/419 KB   
252/419 KB   
256/419 KB   
260/419 KB   
264/419 KB   
268/419 KB   
272/419 KB   
276/419 KB   
280/419 KB   
284/419 KB   
288/419 KB   
292/419 KB   
296/419 KB   
300/419 KB   
304/419 KB   
308/419 KB   
312/419 KB   
316/419 KB   
320/419 KB   
324/419 KB   
328/419 KB   
332/419 KB   
336/419 KB   
340/419 KB   
344/419 KB   
348/419 KB   
351/419 KB   
355/419 KB   
359/419 KB   
363/419 KB   
367/419 KB   
371/419 KB   
375/419 KB   
379/419 KB   
383/419 KB   
387/419 KB   
391/419 KB   
395/419 KB   
399/419 KB   
403/419 KB   
407/419 KB   
411/419 KB   
415/419 KB   
419/419 KB   
419/419 KB   
             
Downloaded: http://repo.maven.apache.org/maven2/org/apache/httpcomponents/httpclient/4.2.2/httpclient-4.2.2.jar
(419 KB at 4498.0 KB/sec)
[INFO] 
[INFO] --- maven-clean-plugin:2.5:clean (default-clean) @ cloud-plugin-hypervisor-xen ---
[INFO] Deleting <http://jenkins.buildacloud.org/job/cloudstack-4.3-maven-build/ws/plugins/hypervisors/xen>
(includes = [target, dist], excludes = [])
[INFO] 
[INFO] --- maven-remote-resources-plugin:1.3:process (default) @ cloud-plugin-hypervisor-xen
---
[INFO] 
[INFO] --- maven-resources-plugin:2.5:resources (default-resources) @ cloud-plugin-hypervisor-xen
---
[debug] execute contextualize
[INFO] Using 'UTF-8' encoding to copy filtered resources.
[INFO] Copying 4 resources
[INFO] Copying 3 resources
[INFO] 
[INFO] --- maven-compiler-plugin:2.5.1:compile (default-compile) @ cloud-plugin-hypervisor-xen
---
[INFO] Compiling 22 source files to <http://jenkins.buildacloud.org/job/cloudstack-4.3-maven-build/ws/plugins/hypervisors/xen/target/classes>
[INFO] -------------------------------------------------------------
[ERROR] COMPILATION ERROR : 
[INFO] -------------------------------------------------------------
[ERROR] <http://jenkins.buildacloud.org/job/cloudstack-4.3-maven-build/ws/plugins/hypervisors/xen/src/org/apache/cloudstack/hypervisor/xenserver/XenServerResourceNewBase.java>:[108,33]
cannot find symbol
symbol  : method properFrom(com.xensource.xenapi.Connection,java.util.Set<java.lang.String>,java.lang.String,java.lang.Double)
location: class com.xensource.xenapi.Event
[ERROR] <http://jenkins.buildacloud.org/job/cloudstack-4.3-maven-build/ws/plugins/hypervisors/xen/src/org/apache/cloudstack/hypervisor/xenserver/XenServerResourceNewBase.java>:[171,39]
cannot find symbol
symbol  : method properFrom(com.xensource.xenapi.Connection,java.util.Set<java.lang.String>,java.lang.String,java.lang.Double)
location: class com.xensource.xenapi.Event
[ERROR] <http://jenkins.buildacloud.org/job/cloudstack-4.3-maven-build/ws/plugins/hypervisors/xen/src/org/apache/cloudstack/hypervisor/xenserver/XenServerResourceNewBase.java>:[308,35]
cannot find symbol
symbol  : method properFrom(com.xensource.xenapi.Connection,java.util.Set<java.lang.String>,java.lang.String,java.lang.Double)
location: class com.xensource.xenapi.Event
[ERROR] <http://jenkins.buildacloud.org/job/cloudstack-4.3-maven-build/ws/plugins/hypervisors/xen/src/com/cloud/hypervisor/xen/resource/Xenserver625StorageProcessor.java>:[177,34]
cannot find symbol
symbol  : method copyAsync2(com.xensource.xenapi.Connection,com.xensource.xenapi.SR,<nulltype>,<nulltype>)
location: class com.xensource.xenapi.VDI
[ERROR] <http://jenkins.buildacloud.org/job/cloudstack-4.3-maven-build/ws/plugins/hypervisors/xen/src/com/cloud/hypervisor/xen/resource/Xenserver625StorageProcessor.java>:[236,34]
cannot find symbol
symbol  : method copyAsync2(com.xensource.xenapi.Connection,com.xensource.xenapi.SR,com.xensource.xenapi.VDI,<nulltype>)
location: class com.xensource.xenapi.VDI
[ERROR] <http://jenkins.buildacloud.org/job/cloudstack-4.3-maven-build/ws/plugins/hypervisors/xen/src/com/cloud/hypervisor/xen/resource/Xenserver625StorageProcessor.java>:[347,43]
cannot find symbol
symbol  : method copyAsync2(com.xensource.xenapi.Connection,com.xensource.xenapi.SR,<nulltype>,<nulltype>)
location: class com.xensource.xenapi.VDI
[ERROR] <http://jenkins.buildacloud.org/job/cloudstack-4.3-maven-build/ws/plugins/hypervisors/xen/src/com/cloud/hypervisor/xen/resource/Xenserver625StorageProcessor.java>:[465,27]
cannot find symbol
symbol  : method copyAsync2(com.xensource.xenapi.Connection,com.xensource.xenapi.SR,<nulltype>,<nulltype>)
location: class com.xensource.xenapi.VDI
[ERROR] <http://jenkins.buildacloud.org/job/cloudstack-4.3-maven-build/ws/plugins/hypervisors/xen/src/com/cloud/hypervisor/xen/resource/Xenserver625StorageProcessor.java>:[581,37]
cannot find symbol
symbol  : method copyAsync2(com.xensource.xenapi.Connection,<nulltype>,<nulltype>,com.xensource.xenapi.VDI)
location: class com.xensource.xenapi.VDI
[ERROR] <http://jenkins.buildacloud.org/job/cloudstack-4.3-maven-build/ws/plugins/hypervisors/xen/src/com/cloud/hypervisor/xen/resource/Xenserver625StorageProcessor.java>:[644,34]
cannot find symbol
symbol  : method copyAsync2(com.xensource.xenapi.Connection,com.xensource.xenapi.SR,<nulltype>,<nulltype>)
location: class com.xensource.xenapi.VDI
[ERROR] <http://jenkins.buildacloud.org/job/cloudstack-4.3-maven-build/ws/plugins/hypervisors/xen/src/com/cloud/hypervisor/xen/resource/Xenserver625StorageProcessor.java>:[696,34]
cannot find symbol
symbol  : method copyAsync2(com.xensource.xenapi.Connection,com.xensource.xenapi.SR,<nulltype>,<nulltype>)
location: class com.xensource.xenapi.VDI
[ERROR] <http://jenkins.buildacloud.org/job/cloudstack-4.3-maven-build/ws/plugins/hypervisors/xen/src/com/cloud/hypervisor/xen/resource/Xenserver625StorageProcessor.java>:[780,37]
cannot find symbol
symbol  : method copyAsync2(com.xensource.xenapi.Connection,<nulltype>,<nulltype>,com.xensource.xenapi.VDI)
location: class com.xensource.xenapi.VDI
[INFO] 11 errors 
[INFO] -------------------------------------------------------------
[INFO] ------------------------------------------------------------------------
[INFO] Reactor Summary:
[INFO] 
[INFO] Apache CloudStack ................................. SUCCESS [1.260s]
[INFO] Apache CloudStack Maven Conventions Parent ........ SUCCESS [0.030s]
[INFO] Apache CloudStack Framework - Managed Context ..... SUCCESS [2.562s]
[INFO] Apache CloudStack Utils ........................... SUCCESS [7.489s]
[INFO] Apache CloudStack Framework ....................... SUCCESS [0.033s]
[INFO] Apache CloudStack Framework - Event Notification .. SUCCESS [4.102s]
[INFO] Apache CloudStack Framework - Configuration ....... SUCCESS [3.313s]
[INFO] Apache CloudStack API ............................. SUCCESS [7.481s]
[INFO] Apache CloudStack Framework - REST ................ SUCCESS [2.552s]
[INFO] Apache CloudStack Framework - IPC ................. SUCCESS [4.648s]
[INFO] Apache CloudStack Cloud Engine .................... SUCCESS [0.028s]
[INFO] Apache CloudStack Cloud Engine API ................ SUCCESS [3.650s]
[INFO] Apache CloudStack Core ............................ SUCCESS [5.884s]
[INFO] Apache CloudStack Agents .......................... SUCCESS [4.180s]
[INFO] Apache CloudStack Framework - Clustering .......... SUCCESS [2.334s]
[INFO] Apache CloudStack Framework - Jobs ................ SUCCESS [2.602s]
[INFO] Apache CloudStack Cloud Engine Schema Component ... SUCCESS [6.081s]
[INFO] Apache CloudStack Framework - Event Notification .. SUCCESS [1.509s]
[INFO] Apache CloudStack Cloud Engine Internal Components API  SUCCESS [2.370s]
[INFO] Apache CloudStack Server .......................... SUCCESS [28.419s]
[INFO] Apache CloudStack Usage Server .................... SUCCESS [5.221s]
[INFO] Apache XenSource XAPI ............................. SUCCESS [3.484s]
[INFO] Apache CloudStack Cloud Engine Orchestration Component  SUCCESS [5.369s]
[INFO] Apache CloudStack Cloud Services .................. SUCCESS [0.027s]
[INFO] Apache CloudStack Secondary Storage Service ....... SUCCESS [3.777s]
[INFO] Apache CloudStack Engine Storage Component ........ SUCCESS [4.982s]
[INFO] Apache CloudStack Engine Storage Volume Component . SUCCESS [3.392s]
[INFO] Apache CloudStack Engine Storage Image Component .. SUCCESS [2.364s]
[INFO] Apache CloudStack Engine Storage Data Motion Component  SUCCESS [2.302s]
[INFO] Apache CloudStack Engine Storage Cache Component .. SUCCESS [2.165s]
[INFO] Apache CloudStack Engine Storage Snapshot Component  SUCCESS [5.697s]
[INFO] Apache CloudStack Cloud Engine API ................ SUCCESS [1.800s]
[INFO] Apache CloudStack Cloud Engine Service ............ SUCCESS [0.840s]
[INFO] Apache CloudStack Plugin POM ...................... SUCCESS [0.351s]
[INFO] Apache CloudStack Plugin - API Rate Limit ......... SUCCESS [5.666s]
[INFO] Apache CloudStack Plugin - API Discovery .......... SUCCESS [3.782s]
[INFO] Apache CloudStack Plugin - ACL Static Role Based .. SUCCESS [1.898s]
[INFO] Apache CloudStack Plugin - Host Anti-Affinity Processor  SUCCESS [2.041s]
[INFO] Apache CloudStack Plugin - Explicit Dedication Processor  SUCCESS [2.067s]
[INFO] Apache CloudStack Plugin - User Concentrated Pod Deployment Planner  SUCCESS [1.954s]
[INFO] Apache CloudStack Plugin - User Dispersing Deployment Planner  SUCCESS [1.950s]
[INFO] Apache CloudStack Plugin - Implicit Dedication Planner  SUCCESS [5.822s]
[INFO] Apache CloudStack Plugin - Skip Heurestics Planner  SUCCESS [1.877s]
[INFO] Apache CloudStack Plugin - Host Allocator Random .. SUCCESS [1.960s]
[INFO] Apache CloudStack Plugin - Dedicated Resources .... SUCCESS [5.444s]
[INFO] Apache CloudStack Plugin - Hypervisor OracleVM .... SUCCESS [7.124s]
[INFO] Apache CloudStack Plugin - Open vSwitch ........... SUCCESS [2.401s]
[INFO] Apache CloudStack Plugin - Hypervisor Xen ......... FAILURE [3.840s]
[INFO] Apache CloudStack Plugin - Hypervisor KVM ......... SKIPPED
[INFO] Apache CloudStack Plugin - RabbitMQ Event Bus ..... SKIPPED
[INFO] Apache CloudStack Plugin - Hypervisor Baremetal ... SKIPPED
[INFO] Apache CloudStack Plugin - Hypervisor UCS ......... SKIPPED
[INFO] Apache CloudStack Plugin - Hypervisor Hyper-V ..... SKIPPED
[INFO] Apache CloudStack Plugin - Network Elastic Load Balancer  SKIPPED
[INFO] Apache CloudStack Plugin - Network Internal Load Balancer  SKIPPED
[INFO] Apache CloudStack Plugin - Network Juniper Contrail  SKIPPED
[INFO] Apache CloudStack Plugin - Palo Alto .............. SKIPPED
[INFO] Apache CloudStack Checkstyle Configuration ........ SKIPPED
[INFO] Apache CloudStack Plugin - Network Nicira NVP ..... SKIPPED
[INFO] Apache CloudStack Plugin - BigSwitch Virtual Network Segment  SKIPPED
[INFO] Apache CloudStack Plugin - Midokura Midonet ....... SKIPPED
[INFO] Apache Cloudstack Plugin - Stratosphere SSP ....... SKIPPED
[INFO] Apache CloudStack Plugin - Storage Allocator Random  SKIPPED
[INFO] Apache CloudStack Plugin - User Authenticator LDAP  SKIPPED
[INFO] Apache CloudStack Plugin - User Authenticator MD5 . SKIPPED
[INFO] Apache CloudStack Plugin - User Authenticator Plain Text  SKIPPED
[INFO] Apache CloudStack Plugin - User Authenticator SHA256 Salted  SKIPPED
[INFO] Apache CloudStack Plugin - Dns Notifier Example ... SKIPPED
[INFO] Apache CloudStack Plugin - Storage Image S3 ....... SKIPPED
[INFO] Apache CloudStack Plugin - Storage Image Swift provider  SKIPPED
[INFO] Apache CloudStack Plugin - Storage Image default provider  SKIPPED
[INFO] Apache CloudStack Plugin - Storage Image sample provider  SKIPPED
[INFO] Apache CloudStack Plugin - Storage Volume SolidFire Provider  SKIPPED
[INFO] Apache CloudStack Plugin - Storage Volume default provider  SKIPPED
[INFO] Apache CloudStack Plugin - Storage Volume sample provider  SKIPPED
[INFO] Apache CloudStack Plugin - SNMP Alerts ............ SKIPPED
[INFO] Apache CloudStack Plugin - Syslog Alerts .......... SKIPPED
[INFO] Apache CloudStack Plugin - Network VXLAN .......... SKIPPED
[INFO] Apache CloudStack Framework - Spring Life Cycle ... SKIPPED
[INFO] cloud-framework-spring-module ..................... SKIPPED
[INFO] Apache CloudStack Test ............................ SKIPPED
[INFO] Apache CloudStack Client UI ....................... SKIPPED
[INFO] Apache CloudStack Console Proxy - RDP Client ...... SKIPPED
[INFO] Apache CloudStack Console Proxy ................... SKIPPED
[INFO] Apache CloudStack Console Proxy - Server .......... SKIPPED
[INFO] Apache CloudStack Framework - QuickCloud .......... SKIPPED
[INFO] ------------------------------------------------------------------------
[INFO] BUILD FAILURE
[INFO] ------------------------------------------------------------------------
[INFO] Total time: 3:01.871s
[INFO] Finished at: Tue Sep 09 14:18:26 CEST 2014
[INFO] Final Memory: 45M/300M
[INFO] ------------------------------------------------------------------------
[ERROR] Failed to execute goal org.apache.maven.plugins:maven-compiler-plugin:2.5.1:compile
(default-compile) on project cloud-plugin-hypervisor-xen: Compilation failure: Compilation
failure:
[ERROR] <http://jenkins.buildacloud.org/job/cloudstack-4.3-maven-build/ws/plugins/hypervisors/xen/src/org/apache/cloudstack/hypervisor/xenserver/XenServerResourceNewBase.java>:[108,33]
cannot find symbol
[ERROR] symbol  : method properFrom(com.xensource.xenapi.Connection,java.util.Set<java.lang.String>,java.lang.String,java.lang.Double)
[ERROR] location: class com.xensource.xenapi.Event
[ERROR] <http://jenkins.buildacloud.org/job/cloudstack-4.3-maven-build/ws/plugins/hypervisors/xen/src/org/apache/cloudstack/hypervisor/xenserver/XenServerResourceNewBase.java>:[171,39]
cannot find symbol
[ERROR] symbol  : method properFrom(com.xensource.xenapi.Connection,java.util.Set<java.lang.String>,java.lang.String,java.lang.Double)
[ERROR] location: class com.xensource.xenapi.Event
[ERROR] <http://jenkins.buildacloud.org/job/cloudstack-4.3-maven-build/ws/plugins/hypervisors/xen/src/org/apache/cloudstack/hypervisor/xenserver/XenServerResourceNewBase.java>:[308,35]
cannot find symbol
[ERROR] symbol  : method properFrom(com.xensource.xenapi.Connection,java.util.Set<java.lang.String>,java.lang.String,java.lang.Double)
[ERROR] location: class com.xensource.xenapi.Event
[ERROR] <http://jenkins.buildacloud.org/job/cloudstack-4.3-maven-build/ws/plugins/hypervisors/xen/src/com/cloud/hypervisor/xen/resource/Xenserver625StorageProcessor.java>:[177,34]
cannot find symbol
[ERROR] symbol  : method copyAsync2(com.xensource.xenapi.Connection,com.xensource.xenapi.SR,<nulltype>,<nulltype>)
[ERROR] location: class com.xensource.xenapi.VDI
[ERROR] <http://jenkins.buildacloud.org/job/cloudstack-4.3-maven-build/ws/plugins/hypervisors/xen/src/com/cloud/hypervisor/xen/resource/Xenserver625StorageProcessor.java>:[236,34]
cannot find symbol
[ERROR] symbol  : method copyAsync2(com.xensource.xenapi.Connection,com.xensource.xenapi.SR,com.xensource.xenapi.VDI,<nulltype>)
[ERROR] location: class com.xensource.xenapi.VDI
[ERROR] <http://jenkins.buildacloud.org/job/cloudstack-4.3-maven-build/ws/plugins/hypervisors/xen/src/com/cloud/hypervisor/xen/resource/Xenserver625StorageProcessor.java>:[347,43]
cannot find symbol
[ERROR] symbol  : method copyAsync2(com.xensource.xenapi.Connection,com.xensource.xenapi.SR,<nulltype>,<nulltype>)
[ERROR] location: class com.xensource.xenapi.VDI
[ERROR] <http://jenkins.buildacloud.org/job/cloudstack-4.3-maven-build/ws/plugins/hypervisors/xen/src/com/cloud/hypervisor/xen/resource/Xenserver625StorageProcessor.java>:[465,27]
cannot find symbol
[ERROR] symbol  : method copyAsync2(com.xensource.xenapi.Connection,com.xensource.xenapi.SR,<nulltype>,<nulltype>)
[ERROR] location: class com.xensource.xenapi.VDI
[ERROR] <http://jenkins.buildacloud.org/job/cloudstack-4.3-maven-build/ws/plugins/hypervisors/xen/src/com/cloud/hypervisor/xen/resource/Xenserver625StorageProcessor.java>:[581,37]
cannot find symbol
[ERROR] symbol  : method copyAsync2(com.xensource.xenapi.Connection,<nulltype>,<nulltype>,com.xensource.xenapi.VDI)
[ERROR] location: class com.xensource.xenapi.VDI
[ERROR] <http://jenkins.buildacloud.org/job/cloudstack-4.3-maven-build/ws/plugins/hypervisors/xen/src/com/cloud/hypervisor/xen/resource/Xenserver625StorageProcessor.java>:[644,34]
cannot find symbol
[ERROR] symbol  : method copyAsync2(com.xensource.xenapi.Connection,com.xensource.xenapi.SR,<nulltype>,<nulltype>)
[ERROR] location: class com.xensource.xenapi.VDI
[ERROR] <http://jenkins.buildacloud.org/job/cloudstack-4.3-maven-build/ws/plugins/hypervisors/xen/src/com/cloud/hypervisor/xen/resource/Xenserver625StorageProcessor.java>:[696,34]
cannot find symbol
[ERROR] symbol  : method copyAsync2(com.xensource.xenapi.Connection,com.xensource.xenapi.SR,<nulltype>,<nulltype>)
[ERROR] location: class com.xensource.xenapi.VDI
[ERROR] <http://jenkins.buildacloud.org/job/cloudstack-4.3-maven-build/ws/plugins/hypervisors/xen/src/com/cloud/hypervisor/xen/resource/Xenserver625StorageProcessor.java>:[780,37]
cannot find symbol
[ERROR] symbol  : method copyAsync2(com.xensource.xenapi.Connection,<nulltype>,<nulltype>,com.xensource.xenapi.VDI)
[ERROR] location: class com.xensource.xenapi.VDI
[ERROR] -> [Help 1]
[ERROR] 
[ERROR] To see the full stack trace of the errors, re-run Maven with the -e switch.
[ERROR] Re-run Maven using the -X switch to enable full debug logging.
[ERROR] 
[ERROR] For more information about the errors and possible solutions, please read the following
articles:
[ERROR] [Help 1] http://cwiki.apache.org/confluence/display/MAVEN/MojoFailureException
[ERROR] 
[ERROR] After correcting the problems, you can resume the build with the command
[ERROR]   mvn <goals> -rf :cloud-plugin-hypervisor-xen
Build step 'Invoke top-level Maven targets' marked build as failure

Mime
View raw message