cloudstack-dev mailing list archives

Site index · List index
Message view « Date » · « Thread »
Top « Date » · « Thread »
From jenk...@cloudstack.org
Subject Build failed in Jenkins: cloudstack-4.3-maven-build #588
Date Tue, 09 Sep 2014 15:42:57 GMT
See <http://jenkins.buildacloud.org/job/cloudstack-4.3-maven-build/588/>

------------------------------------------
[...truncated 16530 lines...]
214/419 KB   
218/419 KB   
222/419 KB   
226/419 KB   
230/419 KB   
234/419 KB   
238/419 KB   
242/419 KB   
246/419 KB   
250/419 KB   
254/419 KB   
258/419 KB   
262/419 KB   
266/419 KB   
270/419 KB   
274/419 KB   
278/419 KB   
282/419 KB   
286/419 KB   
290/419 KB   
294/419 KB   
298/419 KB   
302/419 KB   
306/419 KB   
310/419 KB   
314/419 KB   
318/419 KB   
322/419 KB   
326/419 KB   
330/419 KB   
334/419 KB   
338/419 KB   
342/419 KB   
346/419 KB   
350/419 KB   
354/419 KB   
358/419 KB   
362/419 KB   
366/419 KB   
370/419 KB   
374/419 KB   
378/419 KB   
382/419 KB   
386/419 KB   
390/419 KB   
394/419 KB   
398/419 KB   
402/419 KB   
406/419 KB   
410/419 KB   
414/419 KB   
418/419 KB   
419/419 KB   
             
Downloaded: http://repo.maven.apache.org/maven2/org/apache/httpcomponents/httpclient/4.2.2/httpclient-4.2.2.jar
(419 KB at 12303.3 KB/sec)
[INFO] 
[INFO] --- maven-clean-plugin:2.5:clean (default-clean) @ cloud-plugin-hypervisor-xen ---
[INFO] Deleting <http://jenkins.buildacloud.org/job/cloudstack-4.3-maven-build/ws/plugins/hypervisors/xen/target>
(includes = [**/*], excludes = [])
[INFO] Deleting <http://jenkins.buildacloud.org/job/cloudstack-4.3-maven-build/ws/plugins/hypervisors/xen>
(includes = [target, dist], excludes = [])
[INFO] 
[INFO] --- maven-remote-resources-plugin:1.3:process (default) @ cloud-plugin-hypervisor-xen
---
[INFO] 
[INFO] --- maven-resources-plugin:2.5:resources (default-resources) @ cloud-plugin-hypervisor-xen
---
[debug] execute contextualize
[INFO] Using 'UTF-8' encoding to copy filtered resources.
[INFO] Copying 4 resources
[INFO] Copying 3 resources
[INFO] 
[INFO] --- maven-compiler-plugin:2.5.1:compile (default-compile) @ cloud-plugin-hypervisor-xen
---
[INFO] Compiling 22 source files to <http://jenkins.buildacloud.org/job/cloudstack-4.3-maven-build/ws/plugins/hypervisors/xen/target/classes>
[INFO] -------------------------------------------------------------
[ERROR] COMPILATION ERROR : 
[INFO] -------------------------------------------------------------
[ERROR] <http://jenkins.buildacloud.org/job/cloudstack-4.3-maven-build/ws/plugins/hypervisors/xen/src/org/apache/cloudstack/hypervisor/xenserver/XenServerResourceNewBase.java>:[108,33]
cannot find symbol
symbol  : method properFrom(com.xensource.xenapi.Connection,java.util.Set<java.lang.String>,java.lang.String,java.lang.Double)
location: class com.xensource.xenapi.Event
[ERROR] <http://jenkins.buildacloud.org/job/cloudstack-4.3-maven-build/ws/plugins/hypervisors/xen/src/org/apache/cloudstack/hypervisor/xenserver/XenServerResourceNewBase.java>:[171,39]
cannot find symbol
symbol  : method properFrom(com.xensource.xenapi.Connection,java.util.Set<java.lang.String>,java.lang.String,java.lang.Double)
location: class com.xensource.xenapi.Event
[ERROR] <http://jenkins.buildacloud.org/job/cloudstack-4.3-maven-build/ws/plugins/hypervisors/xen/src/org/apache/cloudstack/hypervisor/xenserver/XenServerResourceNewBase.java>:[308,35]
cannot find symbol
symbol  : method properFrom(com.xensource.xenapi.Connection,java.util.Set<java.lang.String>,java.lang.String,java.lang.Double)
location: class com.xensource.xenapi.Event
[ERROR] <http://jenkins.buildacloud.org/job/cloudstack-4.3-maven-build/ws/plugins/hypervisors/xen/src/com/cloud/hypervisor/xen/resource/Xenserver625StorageProcessor.java>:[177,34]
cannot find symbol
symbol  : method copyAsync2(com.xensource.xenapi.Connection,com.xensource.xenapi.SR,<nulltype>,<nulltype>)
location: class com.xensource.xenapi.VDI
[ERROR] <http://jenkins.buildacloud.org/job/cloudstack-4.3-maven-build/ws/plugins/hypervisors/xen/src/com/cloud/hypervisor/xen/resource/Xenserver625StorageProcessor.java>:[236,34]
cannot find symbol
symbol  : method copyAsync2(com.xensource.xenapi.Connection,com.xensource.xenapi.SR,com.xensource.xenapi.VDI,<nulltype>)
location: class com.xensource.xenapi.VDI
[ERROR] <http://jenkins.buildacloud.org/job/cloudstack-4.3-maven-build/ws/plugins/hypervisors/xen/src/com/cloud/hypervisor/xen/resource/Xenserver625StorageProcessor.java>:[347,43]
cannot find symbol
symbol  : method copyAsync2(com.xensource.xenapi.Connection,com.xensource.xenapi.SR,<nulltype>,<nulltype>)
location: class com.xensource.xenapi.VDI
[ERROR] <http://jenkins.buildacloud.org/job/cloudstack-4.3-maven-build/ws/plugins/hypervisors/xen/src/com/cloud/hypervisor/xen/resource/Xenserver625StorageProcessor.java>:[465,27]
cannot find symbol
symbol  : method copyAsync2(com.xensource.xenapi.Connection,com.xensource.xenapi.SR,<nulltype>,<nulltype>)
location: class com.xensource.xenapi.VDI
[ERROR] <http://jenkins.buildacloud.org/job/cloudstack-4.3-maven-build/ws/plugins/hypervisors/xen/src/com/cloud/hypervisor/xen/resource/Xenserver625StorageProcessor.java>:[581,37]
cannot find symbol
symbol  : method copyAsync2(com.xensource.xenapi.Connection,<nulltype>,<nulltype>,com.xensource.xenapi.VDI)
location: class com.xensource.xenapi.VDI
[ERROR] <http://jenkins.buildacloud.org/job/cloudstack-4.3-maven-build/ws/plugins/hypervisors/xen/src/com/cloud/hypervisor/xen/resource/Xenserver625StorageProcessor.java>:[644,34]
cannot find symbol
symbol  : method copyAsync2(com.xensource.xenapi.Connection,com.xensource.xenapi.SR,<nulltype>,<nulltype>)
location: class com.xensource.xenapi.VDI
[ERROR] <http://jenkins.buildacloud.org/job/cloudstack-4.3-maven-build/ws/plugins/hypervisors/xen/src/com/cloud/hypervisor/xen/resource/Xenserver625StorageProcessor.java>:[696,34]
cannot find symbol
symbol  : method copyAsync2(com.xensource.xenapi.Connection,com.xensource.xenapi.SR,<nulltype>,<nulltype>)
location: class com.xensource.xenapi.VDI
[ERROR] <http://jenkins.buildacloud.org/job/cloudstack-4.3-maven-build/ws/plugins/hypervisors/xen/src/com/cloud/hypervisor/xen/resource/Xenserver625StorageProcessor.java>:[780,37]
cannot find symbol
symbol  : method copyAsync2(com.xensource.xenapi.Connection,<nulltype>,<nulltype>,com.xensource.xenapi.VDI)
location: class com.xensource.xenapi.VDI
[INFO] 11 errors 
[INFO] -------------------------------------------------------------
[INFO] ------------------------------------------------------------------------
[INFO] Reactor Summary:
[INFO] 
[INFO] Apache CloudStack ................................. SUCCESS [4.744s]
[INFO] Apache CloudStack Maven Conventions Parent ........ SUCCESS [0.028s]
[INFO] Apache CloudStack Framework - Managed Context ..... SUCCESS [4.232s]
[INFO] Apache CloudStack Utils ........................... SUCCESS [10.528s]
[INFO] Apache CloudStack Framework ....................... SUCCESS [0.033s]
[INFO] Apache CloudStack Framework - Event Notification .. SUCCESS [4.683s]
[INFO] Apache CloudStack Framework - Configuration ....... SUCCESS [3.425s]
[INFO] Apache CloudStack API ............................. SUCCESS [7.646s]
[INFO] Apache CloudStack Framework - REST ................ SUCCESS [4.446s]
[INFO] Apache CloudStack Framework - IPC ................. SUCCESS [4.841s]
[INFO] Apache CloudStack Cloud Engine .................... SUCCESS [0.033s]
[INFO] Apache CloudStack Cloud Engine API ................ SUCCESS [3.742s]
[INFO] Apache CloudStack Core ............................ SUCCESS [5.974s]
[INFO] Apache CloudStack Agents .......................... SUCCESS [4.917s]
[INFO] Apache CloudStack Framework - Clustering .......... SUCCESS [2.375s]
[INFO] Apache CloudStack Framework - Jobs ................ SUCCESS [2.601s]
[INFO] Apache CloudStack Cloud Engine Schema Component ... SUCCESS [6.205s]
[INFO] Apache CloudStack Framework - Event Notification .. SUCCESS [1.609s]
[INFO] Apache CloudStack Cloud Engine Internal Components API  SUCCESS [2.455s]
[INFO] Apache CloudStack Server .......................... SUCCESS [28.477s]
[INFO] Apache CloudStack Usage Server .................... SUCCESS [4.323s]
[INFO] Apache XenSource XAPI ............................. SUCCESS [3.796s]
[INFO] Apache CloudStack Cloud Engine Orchestration Component  SUCCESS [5.496s]
[INFO] Apache CloudStack Cloud Services .................. SUCCESS [0.028s]
[INFO] Apache CloudStack Secondary Storage Service ....... SUCCESS [3.931s]
[INFO] Apache CloudStack Engine Storage Component ........ SUCCESS [5.039s]
[INFO] Apache CloudStack Engine Storage Volume Component . SUCCESS [3.464s]
[INFO] Apache CloudStack Engine Storage Image Component .. SUCCESS [2.474s]
[INFO] Apache CloudStack Engine Storage Data Motion Component  SUCCESS [2.324s]
[INFO] Apache CloudStack Engine Storage Cache Component .. SUCCESS [2.154s]
[INFO] Apache CloudStack Engine Storage Snapshot Component  SUCCESS [5.848s]
[INFO] Apache CloudStack Cloud Engine API ................ SUCCESS [1.795s]
[INFO] Apache CloudStack Cloud Engine Service ............ SUCCESS [1.114s]
[INFO] Apache CloudStack Plugin POM ...................... SUCCESS [0.335s]
[INFO] Apache CloudStack Plugin - API Rate Limit ......... SUCCESS [5.808s]
[INFO] Apache CloudStack Plugin - API Discovery .......... SUCCESS [3.853s]
[INFO] Apache CloudStack Plugin - ACL Static Role Based .. SUCCESS [2.009s]
[INFO] Apache CloudStack Plugin - Host Anti-Affinity Processor  SUCCESS [2.087s]
[INFO] Apache CloudStack Plugin - Explicit Dedication Processor  SUCCESS [2.108s]
[INFO] Apache CloudStack Plugin - User Concentrated Pod Deployment Planner  SUCCESS [2.011s]
[INFO] Apache CloudStack Plugin - User Dispersing Deployment Planner  SUCCESS [2.124s]
[INFO] Apache CloudStack Plugin - Implicit Dedication Planner  SUCCESS [5.938s]
[INFO] Apache CloudStack Plugin - Skip Heurestics Planner  SUCCESS [1.958s]
[INFO] Apache CloudStack Plugin - Host Allocator Random .. SUCCESS [2.119s]
[INFO] Apache CloudStack Plugin - Dedicated Resources .... SUCCESS [5.547s]
[INFO] Apache CloudStack Plugin - Hypervisor OracleVM .... SUCCESS [6.266s]
[INFO] Apache CloudStack Plugin - Open vSwitch ........... SUCCESS [2.450s]
[INFO] Apache CloudStack Plugin - Hypervisor Xen ......... FAILURE [3.771s]
[INFO] Apache CloudStack Plugin - Hypervisor KVM ......... SKIPPED
[INFO] Apache CloudStack Plugin - RabbitMQ Event Bus ..... SKIPPED
[INFO] Apache CloudStack Plugin - Hypervisor Baremetal ... SKIPPED
[INFO] Apache CloudStack Plugin - Hypervisor UCS ......... SKIPPED
[INFO] Apache CloudStack Plugin - Hypervisor Hyper-V ..... SKIPPED
[INFO] Apache CloudStack Plugin - Network Elastic Load Balancer  SKIPPED
[INFO] Apache CloudStack Plugin - Network Internal Load Balancer  SKIPPED
[INFO] Apache CloudStack Plugin - Network Juniper Contrail  SKIPPED
[INFO] Apache CloudStack Plugin - Palo Alto .............. SKIPPED
[INFO] Apache CloudStack Checkstyle Configuration ........ SKIPPED
[INFO] Apache CloudStack Plugin - Network Nicira NVP ..... SKIPPED
[INFO] Apache CloudStack Plugin - BigSwitch Virtual Network Segment  SKIPPED
[INFO] Apache CloudStack Plugin - Midokura Midonet ....... SKIPPED
[INFO] Apache Cloudstack Plugin - Stratosphere SSP ....... SKIPPED
[INFO] Apache CloudStack Plugin - Storage Allocator Random  SKIPPED
[INFO] Apache CloudStack Plugin - User Authenticator LDAP  SKIPPED
[INFO] Apache CloudStack Plugin - User Authenticator MD5 . SKIPPED
[INFO] Apache CloudStack Plugin - User Authenticator Plain Text  SKIPPED
[INFO] Apache CloudStack Plugin - User Authenticator SHA256 Salted  SKIPPED
[INFO] Apache CloudStack Plugin - Dns Notifier Example ... SKIPPED
[INFO] Apache CloudStack Plugin - Storage Image S3 ....... SKIPPED
[INFO] Apache CloudStack Plugin - Storage Image Swift provider  SKIPPED
[INFO] Apache CloudStack Plugin - Storage Image default provider  SKIPPED
[INFO] Apache CloudStack Plugin - Storage Image sample provider  SKIPPED
[INFO] Apache CloudStack Plugin - Storage Volume SolidFire Provider  SKIPPED
[INFO] Apache CloudStack Plugin - Storage Volume default provider  SKIPPED
[INFO] Apache CloudStack Plugin - Storage Volume sample provider  SKIPPED
[INFO] Apache CloudStack Plugin - SNMP Alerts ............ SKIPPED
[INFO] Apache CloudStack Plugin - Syslog Alerts .......... SKIPPED
[INFO] Apache CloudStack Plugin - Network VXLAN .......... SKIPPED
[INFO] Apache CloudStack Framework - Spring Life Cycle ... SKIPPED
[INFO] cloud-framework-spring-module ..................... SKIPPED
[INFO] Apache CloudStack Test ............................ SKIPPED
[INFO] Apache CloudStack Client UI ....................... SKIPPED
[INFO] Apache CloudStack Console Proxy - RDP Client ...... SKIPPED
[INFO] Apache CloudStack Console Proxy ................... SKIPPED
[INFO] Apache CloudStack Console Proxy - Server .......... SKIPPED
[INFO] Apache CloudStack Framework - QuickCloud .......... SKIPPED
[INFO] ------------------------------------------------------------------------
[INFO] BUILD FAILURE
[INFO] ------------------------------------------------------------------------
[INFO] Total time: 3:14.828s
[INFO] Finished at: Tue Sep 09 17:42:56 CEST 2014
[INFO] Final Memory: 40M/341M
[INFO] ------------------------------------------------------------------------
[ERROR] Failed to execute goal org.apache.maven.plugins:maven-compiler-plugin:2.5.1:compile
(default-compile) on project cloud-plugin-hypervisor-xen: Compilation failure: Compilation
failure:
[ERROR] <http://jenkins.buildacloud.org/job/cloudstack-4.3-maven-build/ws/plugins/hypervisors/xen/src/org/apache/cloudstack/hypervisor/xenserver/XenServerResourceNewBase.java>:[108,33]
cannot find symbol
[ERROR] symbol  : method properFrom(com.xensource.xenapi.Connection,java.util.Set<java.lang.String>,java.lang.String,java.lang.Double)
[ERROR] location: class com.xensource.xenapi.Event
[ERROR] <http://jenkins.buildacloud.org/job/cloudstack-4.3-maven-build/ws/plugins/hypervisors/xen/src/org/apache/cloudstack/hypervisor/xenserver/XenServerResourceNewBase.java>:[171,39]
cannot find symbol
[ERROR] symbol  : method properFrom(com.xensource.xenapi.Connection,java.util.Set<java.lang.String>,java.lang.String,java.lang.Double)
[ERROR] location: class com.xensource.xenapi.Event
[ERROR] <http://jenkins.buildacloud.org/job/cloudstack-4.3-maven-build/ws/plugins/hypervisors/xen/src/org/apache/cloudstack/hypervisor/xenserver/XenServerResourceNewBase.java>:[308,35]
cannot find symbol
[ERROR] symbol  : method properFrom(com.xensource.xenapi.Connection,java.util.Set<java.lang.String>,java.lang.String,java.lang.Double)
[ERROR] location: class com.xensource.xenapi.Event
[ERROR] <http://jenkins.buildacloud.org/job/cloudstack-4.3-maven-build/ws/plugins/hypervisors/xen/src/com/cloud/hypervisor/xen/resource/Xenserver625StorageProcessor.java>:[177,34]
cannot find symbol
[ERROR] symbol  : method copyAsync2(com.xensource.xenapi.Connection,com.xensource.xenapi.SR,<nulltype>,<nulltype>)
[ERROR] location: class com.xensource.xenapi.VDI
[ERROR] <http://jenkins.buildacloud.org/job/cloudstack-4.3-maven-build/ws/plugins/hypervisors/xen/src/com/cloud/hypervisor/xen/resource/Xenserver625StorageProcessor.java>:[236,34]
cannot find symbol
[ERROR] symbol  : method copyAsync2(com.xensource.xenapi.Connection,com.xensource.xenapi.SR,com.xensource.xenapi.VDI,<nulltype>)
[ERROR] location: class com.xensource.xenapi.VDI
[ERROR] <http://jenkins.buildacloud.org/job/cloudstack-4.3-maven-build/ws/plugins/hypervisors/xen/src/com/cloud/hypervisor/xen/resource/Xenserver625StorageProcessor.java>:[347,43]
cannot find symbol
[ERROR] symbol  : method copyAsync2(com.xensource.xenapi.Connection,com.xensource.xenapi.SR,<nulltype>,<nulltype>)
[ERROR] location: class com.xensource.xenapi.VDI
[ERROR] <http://jenkins.buildacloud.org/job/cloudstack-4.3-maven-build/ws/plugins/hypervisors/xen/src/com/cloud/hypervisor/xen/resource/Xenserver625StorageProcessor.java>:[465,27]
cannot find symbol
[ERROR] symbol  : method copyAsync2(com.xensource.xenapi.Connection,com.xensource.xenapi.SR,<nulltype>,<nulltype>)
[ERROR] location: class com.xensource.xenapi.VDI
[ERROR] <http://jenkins.buildacloud.org/job/cloudstack-4.3-maven-build/ws/plugins/hypervisors/xen/src/com/cloud/hypervisor/xen/resource/Xenserver625StorageProcessor.java>:[581,37]
cannot find symbol
[ERROR] symbol  : method copyAsync2(com.xensource.xenapi.Connection,<nulltype>,<nulltype>,com.xensource.xenapi.VDI)
[ERROR] location: class com.xensource.xenapi.VDI
[ERROR] <http://jenkins.buildacloud.org/job/cloudstack-4.3-maven-build/ws/plugins/hypervisors/xen/src/com/cloud/hypervisor/xen/resource/Xenserver625StorageProcessor.java>:[644,34]
cannot find symbol
[ERROR] symbol  : method copyAsync2(com.xensource.xenapi.Connection,com.xensource.xenapi.SR,<nulltype>,<nulltype>)
[ERROR] location: class com.xensource.xenapi.VDI
[ERROR] <http://jenkins.buildacloud.org/job/cloudstack-4.3-maven-build/ws/plugins/hypervisors/xen/src/com/cloud/hypervisor/xen/resource/Xenserver625StorageProcessor.java>:[696,34]
cannot find symbol
[ERROR] symbol  : method copyAsync2(com.xensource.xenapi.Connection,com.xensource.xenapi.SR,<nulltype>,<nulltype>)
[ERROR] location: class com.xensource.xenapi.VDI
[ERROR] <http://jenkins.buildacloud.org/job/cloudstack-4.3-maven-build/ws/plugins/hypervisors/xen/src/com/cloud/hypervisor/xen/resource/Xenserver625StorageProcessor.java>:[780,37]
cannot find symbol
[ERROR] symbol  : method copyAsync2(com.xensource.xenapi.Connection,<nulltype>,<nulltype>,com.xensource.xenapi.VDI)
[ERROR] location: class com.xensource.xenapi.VDI
[ERROR] -> [Help 1]
[ERROR] 
[ERROR] To see the full stack trace of the errors, re-run Maven with the -e switch.
[ERROR] Re-run Maven using the -X switch to enable full debug logging.
[ERROR] 
[ERROR] For more information about the errors and possible solutions, please read the following
articles:
[ERROR] [Help 1] http://cwiki.apache.org/confluence/display/MAVEN/MojoFailureException
[ERROR] 
[ERROR] After correcting the problems, you can resume the build with the command
[ERROR]   mvn <goals> -rf :cloud-plugin-hypervisor-xen
Build step 'Invoke top-level Maven targets' marked build as failure

Mime
View raw message