cloudstack-dev mailing list archives

Site index · List index
Message view « Date » · « Thread »
Top « Date » · « Thread »
From jenk...@cloudstack.org
Subject Build failed in Jenkins: build-master-noredist #3456
Date Thu, 04 Sep 2014 10:46:11 GMT
See <http://jenkins.buildacloud.org/job/build-master-noredist/3456/changes>

Changes:

[sailaja.mada] vGPU Service offering test automation after including review comments

------------------------------------------
[...truncated 2885 lines...]
[INFO] Using 'UTF-8' encoding to copy filtered resources.
[INFO] skip non existing resourceDirectory <http://jenkins.buildacloud.org/job/build-master-noredist/ws/plugins/api/solidfire-intg-test/test/resources>
[INFO] Copying 3 resources
[INFO] 
[INFO] --- maven-compiler-plugin:2.5.1:testCompile (default-testCompile) @ cloud-plugin-api-solidfire-intg-test
---
[INFO] No sources to compile
[INFO] 
[INFO] --- maven-surefire-plugin:2.12:test (default-test) @ cloud-plugin-api-solidfire-intg-test
---
[INFO] Surefire report directory: <http://jenkins.buildacloud.org/job/build-master-noredist/ws/plugins/api/solidfire-intg-test/target/surefire-reports>

-------------------------------------------------------
 T E S T S
-------------------------------------------------------

Results :

Tests run: 0, Failures: 0, Errors: 0, Skipped: 0

[INFO] 
[INFO] --- maven-jar-plugin:2.4:jar (default-jar) @ cloud-plugin-api-solidfire-intg-test ---
[INFO] Building jar: <http://jenkins.buildacloud.org/job/build-master-noredist/ws/plugins/api/solidfire-intg-test/target/cloud-plugin-api-solidfire-intg-test-4.5.0-SNAPSHOT.jar>
[INFO] 
[INFO] --- maven-site-plugin:3.3:attach-descriptor (attach-descriptor) @ cloud-plugin-api-solidfire-intg-test
---
[INFO] 
[INFO] --- maven-install-plugin:2.3.1:install (default-install) @ cloud-plugin-api-solidfire-intg-test
---
[INFO] Installing <http://jenkins.buildacloud.org/job/build-master-noredist/ws/plugins/api/solidfire-intg-test/target/cloud-plugin-api-solidfire-intg-test-4.5.0-SNAPSHOT.jar>
to /jenkins/.m2/repository/org/apache/cloudstack/cloud-plugin-api-solidfire-intg-test/4.5.0-SNAPSHOT/cloud-plugin-api-solidfire-intg-test-4.5.0-SNAPSHOT.jar
[INFO] Installing <http://jenkins.buildacloud.org/job/build-master-noredist/ws/plugins/api/solidfire-intg-test/pom.xml>
to /jenkins/.m2/repository/org/apache/cloudstack/cloud-plugin-api-solidfire-intg-test/4.5.0-SNAPSHOT/cloud-plugin-api-solidfire-intg-test-4.5.0-SNAPSHOT.pom
[INFO]                                                                         
[INFO] ------------------------------------------------------------------------
[INFO] Building Apache CloudStack Plugin - API Discovery 4.5.0-SNAPSHOT
[INFO] ------------------------------------------------------------------------
[INFO] 
[INFO] --- maven-clean-plugin:2.5:clean (default-clean) @ cloud-plugin-api-discovery ---
[INFO] Deleting <http://jenkins.buildacloud.org/job/build-master-noredist/ws/plugins/api/discovery/target>
(includes = [**/*], excludes = [])
[INFO] Deleting <http://jenkins.buildacloud.org/job/build-master-noredist/ws/plugins/api/discovery>
(includes = [target, dist], excludes = [])
[INFO] 
[INFO] --- maven-checkstyle-plugin:2.11:check (cloudstack-checkstyle) @ cloud-plugin-api-discovery
---
[INFO] Starting audit...
Audit done.

[INFO] 
[INFO] --- maven-remote-resources-plugin:1.3:process (default) @ cloud-plugin-api-discovery
---
[INFO] 
[INFO] --- maven-resources-plugin:2.5:resources (default-resources) @ cloud-plugin-api-discovery
---
[debug] execute contextualize
[INFO] Using 'UTF-8' encoding to copy filtered resources.
[INFO] skip non existing resourceDirectory <http://jenkins.buildacloud.org/job/build-master-noredist/ws/plugins/api/discovery/resources>
[INFO] Copying 3 resources
[INFO] 
[INFO] --- maven-compiler-plugin:2.5.1:compile (default-compile) @ cloud-plugin-api-discovery
---
[INFO] Compiling 6 source files to <http://jenkins.buildacloud.org/job/build-master-noredist/ws/plugins/api/discovery/target/classes>
[INFO] 
[INFO] --- maven-resources-plugin:2.5:testResources (default-testResources) @ cloud-plugin-api-discovery
---
[debug] execute contextualize
[INFO] Using 'UTF-8' encoding to copy filtered resources.
[INFO] skip non existing resourceDirectory <http://jenkins.buildacloud.org/job/build-master-noredist/ws/plugins/api/discovery/test/resources>
[INFO] Copying 3 resources
[INFO] 
[INFO] --- maven-compiler-plugin:2.5.1:testCompile (default-testCompile) @ cloud-plugin-api-discovery
---
[INFO] Compiling 1 source file to <http://jenkins.buildacloud.org/job/build-master-noredist/ws/plugins/api/discovery/target/test-classes>
[INFO] 
[INFO] --- maven-surefire-plugin:2.12:test (default-test) @ cloud-plugin-api-discovery ---
[INFO] Surefire report directory: <http://jenkins.buildacloud.org/job/build-master-noredist/ws/plugins/api/discovery/target/surefire-reports>

-------------------------------------------------------
 T E S T S
-------------------------------------------------------
Running org.apache.cloudstack.discovery.ApiDiscoveryTest
log4j:WARN No appenders could be found for logger (org.apache.cloudstack.discovery.ApiDiscoveryServiceImpl).
log4j:WARN Please initialize the log4j system properly.
log4j:WARN See http://logging.apache.org/log4j/1.2/faq.html#noconfig for more info.
Tests run: 2, Failures: 0, Errors: 0, Skipped: 0, Time elapsed: 0.458 sec

Results :

Tests run: 2, Failures: 0, Errors: 0, Skipped: 0

[INFO] 
[INFO] --- maven-jar-plugin:2.4:jar (default-jar) @ cloud-plugin-api-discovery ---
[INFO] Building jar: <http://jenkins.buildacloud.org/job/build-master-noredist/ws/plugins/api/discovery/target/cloud-plugin-api-discovery-4.5.0-SNAPSHOT.jar>
[INFO] 
[INFO] --- maven-site-plugin:3.3:attach-descriptor (attach-descriptor) @ cloud-plugin-api-discovery
---
[INFO] 
[INFO] --- maven-install-plugin:2.3.1:install (default-install) @ cloud-plugin-api-discovery
---
[INFO] Installing <http://jenkins.buildacloud.org/job/build-master-noredist/ws/plugins/api/discovery/target/cloud-plugin-api-discovery-4.5.0-SNAPSHOT.jar>
to /jenkins/.m2/repository/org/apache/cloudstack/cloud-plugin-api-discovery/4.5.0-SNAPSHOT/cloud-plugin-api-discovery-4.5.0-SNAPSHOT.jar
[INFO] Installing <http://jenkins.buildacloud.org/job/build-master-noredist/ws/plugins/api/discovery/pom.xml>
to /jenkins/.m2/repository/org/apache/cloudstack/cloud-plugin-api-discovery/4.5.0-SNAPSHOT/cloud-plugin-api-discovery-4.5.0-SNAPSHOT.pom
[INFO]                                                                         
[INFO] ------------------------------------------------------------------------
[INFO] Building Apache CloudStack Plugin - ACL Static Role Based 4.5.0-SNAPSHOT
[INFO] ------------------------------------------------------------------------
[INFO] 
[INFO] --- maven-clean-plugin:2.5:clean (default-clean) @ cloud-plugin-acl-static-role-based
---
[INFO] Deleting <http://jenkins.buildacloud.org/job/build-master-noredist/ws/plugins/acl/static-role-based/target>
(includes = [**/*], excludes = [])
[INFO] Deleting <http://jenkins.buildacloud.org/job/build-master-noredist/ws/plugins/acl/static-role-based>
(includes = [target, dist], excludes = [])
[INFO] 
[INFO] --- maven-checkstyle-plugin:2.11:check (cloudstack-checkstyle) @ cloud-plugin-acl-static-role-based
---
[INFO] Starting audit...
Audit done.

[INFO] 
[INFO] --- maven-remote-resources-plugin:1.3:process (default) @ cloud-plugin-acl-static-role-based
---
[INFO] 
[INFO] --- maven-resources-plugin:2.5:resources (default-resources) @ cloud-plugin-acl-static-role-based
---
[debug] execute contextualize
[INFO] Using 'UTF-8' encoding to copy filtered resources.
[INFO] Copying 2 resources
[INFO] Copying 3 resources
[INFO] 
[INFO] --- maven-compiler-plugin:2.5.1:compile (default-compile) @ cloud-plugin-acl-static-role-based
---
[INFO] Compiling 1 source file to <http://jenkins.buildacloud.org/job/build-master-noredist/ws/plugins/acl/static-role-based/target/classes>
[INFO] -------------------------------------------------------------
[ERROR] COMPILATION ERROR : 
[INFO] -------------------------------------------------------------
[ERROR] Failure executing javac,  but could not parse the error:
/bin/sh: line 1: 20248 Aborted                 /usr/lib/jvm/java-1.7.0-openjdk-1.7.0.25.x86_64/jre/../bin/javac
@/tmp/org.codehaus.plexus.compiler.javac.JavacCompiler7551746008281276042arguments -J-Xmx512m
-J-Xms128m

[INFO] 1 error
[INFO] -------------------------------------------------------------
[INFO] ------------------------------------------------------------------------
[INFO] Reactor Summary:
[INFO] 
[INFO] Apache CloudStack Developer Tools - Checkstyle Configuration  SUCCESS [1.331s]
[INFO] Apache CloudStack ................................. SUCCESS [2.203s]
[INFO] Apache CloudStack Maven Conventions Parent ........ SUCCESS [0.887s]
[INFO] Apache CloudStack Framework - Managed Context ..... SUCCESS [3.464s]
[INFO] Apache CloudStack Utils ........................... SUCCESS [14.564s]
[INFO] Apache CloudStack Framework ....................... SUCCESS [0.058s]
[INFO] Apache CloudStack Framework - Event Notification .. SUCCESS [7.793s]
[INFO] Apache CloudStack Framework - Configuration ....... SUCCESS [4.371s]
[INFO] Apache CloudStack API ............................. SUCCESS [18.325s]
[INFO] Apache CloudStack Framework - REST ................ SUCCESS [2.741s]
[INFO] Apache CloudStack Framework - IPC ................. SUCCESS [6.261s]
[INFO] Apache CloudStack Cloud Engine .................... SUCCESS [0.087s]
[INFO] Apache CloudStack Cloud Engine API ................ SUCCESS [5.603s]
[INFO] Apache CloudStack Framework - Security ............ SUCCESS [3.125s]
[INFO] Apache CloudStack Core ............................ SUCCESS [24.414s]
[INFO] Apache CloudStack Agents .......................... SUCCESS [6.501s]
[INFO] Apache CloudStack Framework - Clustering .......... SUCCESS [3.366s]
[INFO] Apache CloudStack Framework - Event Notification .. SUCCESS [2.200s]
[INFO] Apache CloudStack Cloud Engine Schema Component ... SUCCESS [16.172s]
[INFO] Apache CloudStack Framework - Jobs ................ SUCCESS [5.972s]
[INFO] Apache CloudStack Cloud Engine Internal Components API  SUCCESS [3.200s]
[INFO] Apache CloudStack Server .......................... SUCCESS [45.529s]
[INFO] Apache CloudStack Usage Server .................... SUCCESS [6.440s]
[INFO] Apache CloudStack Cloud Engine Orchestration Component  SUCCESS [9.872s]
[INFO] Apache CloudStack Cloud Services .................. SUCCESS [0.093s]
[INFO] Apache CloudStack Secondary Storage ............... SUCCESS [0.351s]
[INFO] Apache CloudStack Secondary Storage Service ....... SUCCESS [5.519s]
[INFO] Apache CloudStack Engine Storage Component ........ SUCCESS [6.799s]
[INFO] Apache CloudStack Engine Storage Volume Component . SUCCESS [5.047s]
[INFO] Apache CloudStack Engine Storage Image Component .. SUCCESS [3.337s]
[INFO] Apache CloudStack Engine Storage Data Motion Component  SUCCESS [2.749s]
[INFO] Apache CloudStack Engine Storage Cache Component .. SUCCESS [2.349s]
[INFO] Apache CloudStack Engine Storage Snapshot Component  SUCCESS [6.848s]
[INFO] Apache CloudStack Cloud Engine API ................ SUCCESS [2.441s]
[INFO] Apache CloudStack Cloud Engine Service ............ SUCCESS [5.109s]
[INFO] Apache CloudStack Plugin POM ...................... SUCCESS [0.329s]
[INFO] Apache CloudStack Plugin - API Rate Limit ......... SUCCESS [5.831s]
[INFO] Apache CloudStack Plugin - Storage Volume default provider  SUCCESS [2.176s]
[INFO] Apache CloudStack Plugin - Storage Volume SolidFire Provider  SUCCESS [4.654s]
[INFO] Apache CloudStack Plugin - API SolidFire .......... SUCCESS [2.937s]
[INFO] Apache CloudStack Plugin - API Discovery .......... SUCCESS [4.832s]
[INFO] Apache CloudStack Plugin - ACL Static Role Based .. FAILURE [0.684s]
[INFO] Apache CloudStack Plugin - Host Anti-Affinity Processor  SKIPPED
[INFO] Apache CloudStack Plugin - Explicit Dedication Processor  SKIPPED
[INFO] Apache CloudStack Plugin - User Concentrated Pod Deployment Planner  SKIPPED
[INFO] Apache CloudStack Plugin - User Dispersing Deployment Planner  SKIPPED
[INFO] Apache CloudStack Plugin - Implicit Dedication Planner  SKIPPED
[INFO] Apache CloudStack Plugin - Skip Heurestics Planner  SKIPPED
[INFO] Apache CloudStack Plugin - Host Allocator Random .. SKIPPED
[INFO] Apache CloudStack Plugin - Dedicated Resources .... SKIPPED
[INFO] Apache CloudStack Plugin - Hypervisor OracleVM .... SKIPPED
[INFO] Apache CloudStack Plugin - Open vSwitch ........... SKIPPED
[INFO] Apache CloudStack Plugin - Hypervisor XenServer ... SKIPPED
[INFO] Apache CloudStack Plugin - Hypervisor KVM ......... SKIPPED
[INFO] Apache CloudStack Plugin - RabbitMQ Event Bus ..... SKIPPED
[INFO] Apache CloudStack Plugin - In Memory Event Bus .... SKIPPED
[INFO] Apache CloudStack Plugin - Hypervisor Baremetal ... SKIPPED
[INFO] Apache CloudStack Plugin - Hypervisor UCS ......... SKIPPED
[INFO] Apache CloudStack Plugin - Hypervisor Hyper-V ..... SKIPPED
[INFO] Apache CloudStack Plugin - Network Elastic Load Balancer  SKIPPED
[INFO] Apache CloudStack Plugin - Network Internal Load Balancer  SKIPPED
[INFO] Apache CloudStack Framework - Spring Life Cycle ... SKIPPED
[INFO] Apache CloudStack Plugin - Network Juniper Contrail  SKIPPED
[INFO] Apache CloudStack Plugin - Palo Alto .............. SKIPPED
[INFO] Apache CloudStack Plugin - Network Netscaler ...... SKIPPED
[INFO] Apache CloudStack Plugin - Network Nicira NVP ..... SKIPPED
[INFO] Apache CloudStack Plugin - BigSwitch Virtual Network Segment  SKIPPED
[INFO] Apache CloudStack Plugin - Network Brocade VCS .... SKIPPED
[INFO] Apache CloudStack Plugin - Midokura Midonet ....... SKIPPED
[INFO] Apache CloudStack Plugin - Stratosphere SSP ....... SKIPPED
[INFO] Apache CloudStack Plugin - Network Opendaylight ... SKIPPED
[INFO] Apache CloudStack Plugin - Storage Allocator Random  SKIPPED
[INFO] Apache CloudStack Plugin - User Authenticator LDAP  SKIPPED
[INFO] Apache CloudStack Plugin - User Authenticator MD5 . SKIPPED
[INFO] Apache CloudStack Plugin - User Authenticator Plain Text  SKIPPED
[INFO] Apache CloudStack Plugin - User Authenticator SAML2  SKIPPED
[INFO] Apache CloudStack Plugin - User Authenticator SHA256 Salted  SKIPPED
[INFO] Apache CloudStack Plugin - Dns Notifier Example ... SKIPPED
[INFO] Apache CloudStack Plugin - Storage Image S3 ....... SKIPPED
[INFO] Apache CloudStack Plugin - Storage Image Swift provider  SKIPPED
[INFO] Apache CloudStack Plugin - Storage Image default provider  SKIPPED
[INFO] Apache CloudStack Plugin - Storage Image sample provider  SKIPPED
[INFO] Apache CloudStack Plugin - Storage Volume Nexenta Provider  SKIPPED
[INFO] Apache CloudStack Plugin - Storage Volume CloudByte Provider  SKIPPED
[INFO] Apache CloudStack Plugin - Storage Volume sample provider  SKIPPED
[INFO] Apache CloudStack Plugin - SNMP Alerts ............ SKIPPED
[INFO] Apache CloudStack Plugin - Syslog Alerts .......... SKIPPED
[INFO] Apache CloudStack Plugin - Network VXLAN .......... SKIPPED
[INFO] Apache CloudStack Plugin - GloboDNS ............... SKIPPED
[INFO] Apache CloudStack Plugin - NetApp File System ..... SKIPPED
[INFO] Apache CloudStack Plugin - F5 ..................... SKIPPED
[INFO] Apache CloudStack Plugin - Juniper SRX ............ SKIPPED
[INFO] Apache CloudStack Plugin - Nuage VSP .............. SKIPPED
[INFO] Apache CloudStack VMware Base ..................... SKIPPED
[INFO] Apache CloudStack Plugin - Hypervisor VMware ...... SKIPPED
[INFO] Apache CloudStack Plugin - Cisco VNMC ............. SKIPPED
[INFO] Apache CloudStack Plugin - MySQL HA Strategy ...... SKIPPED
[INFO] Apache CloudStack Framework - Spring Module ....... SKIPPED
[INFO] Apache CloudStack Secondary Storage Controller .... SKIPPED
[INFO] Apache CloudStack Console Proxy - RDP Client ...... SKIPPED
[INFO] Apache CloudStack Console Proxy ................... SKIPPED
[INFO] Apache CloudStack Console Proxy - Server .......... SKIPPED
[INFO] Apache CloudStack System VM ....................... SKIPPED
[INFO] Apache CloudStack Client UI ....................... SKIPPED
[INFO] Apache CloudStack Framework - QuickCloud .......... SKIPPED
[INFO] Apache CloudStack AWS API Bridge .................. SKIPPED
[INFO] ------------------------------------------------------------------------
[INFO] BUILD FAILURE
[INFO] ------------------------------------------------------------------------
[INFO] Total time: 4:20.099s
[INFO] Finished at: Thu Sep 04 12:38:31 CEST 2014
[INFO] Final Memory: 74M/412M
[INFO] ------------------------------------------------------------------------
[ERROR] Failed to execute goal org.apache.maven.plugins:maven-compiler-plugin:2.5.1:compile
(default-compile) on project cloud-plugin-acl-static-role-based: Compilation failure
[ERROR] Failure executing javac,  but could not parse the error:
[ERROR] /bin/sh: line 1: 20248 Aborted                 /usr/lib/jvm/java-1.7.0-openjdk-1.7.0.25.x86_64/jre/../bin/javac
@/tmp/org.codehaus.plexus.compiler.javac.JavacCompiler7551746008281276042arguments -J-Xmx512m
-J-Xms128m
[ERROR] -> [Help 1]
[ERROR] 
[ERROR] To see the full stack trace of the errors, re-run Maven with the -e switch.
[ERROR] Re-run Maven using the -X switch to enable full debug logging.
[ERROR] 
[ERROR] For more information about the errors and possible solutions, please read the following
articles:
[ERROR] [Help 1] http://cwiki.apache.org/confluence/display/MAVEN/MojoFailureException
[ERROR] 
[ERROR] After correcting the problems, you can resume the build with the command
[ERROR]   mvn <goals> -rf :cloud-plugin-acl-static-role-based
Build step 'Invoke top-level Maven targets' marked build as failure
Archiving artifacts

Mime
View raw message