cloudstack-dev mailing list archives

Site index · List index
Message view « Date » · « Thread »
Top « Date » · « Thread »
From jenk...@cloudstack.org
Subject Build failed in Jenkins: simulator-singlerun #290
Date Thu, 04 Sep 2014 16:03:30 GMT
See <http://jenkins.buildacloud.org/job/simulator-singlerun/290/changes>

Changes:

[kishan] CLOUDSTACK-7473: Vm migration is not supported for LXC. When host is put in maintenance
mode, stop the Vms instead of migrating

------------------------------------------
[...truncated 5007 lines...]
[INFO] 
[INFO] --- maven-compiler-plugin:2.5.1:testCompile (default-testCompile) @ cloud-plugin-user-authenticator-plaintext
---
[INFO] No sources to compile
[INFO] 
[INFO] --- maven-surefire-plugin:2.12:test (default-test) @ cloud-plugin-user-authenticator-plaintext
---
[INFO] Surefire report directory: <http://jenkins.buildacloud.org/job/simulator-singlerun/ws/plugins/user-authenticators/plain-text/target/surefire-reports>

-------------------------------------------------------
 T E S T S
-------------------------------------------------------

Results :

Tests run: 0, Failures: 0, Errors: 0, Skipped: 0

[INFO] 
[INFO] --- maven-jar-plugin:2.4:jar (default-jar) @ cloud-plugin-user-authenticator-plaintext
---
[INFO] Building jar: <http://jenkins.buildacloud.org/job/simulator-singlerun/ws/plugins/user-authenticators/plain-text/target/cloud-plugin-user-authenticator-plaintext-4.5.0-SNAPSHOT.jar>
[INFO] 
[INFO] --- maven-site-plugin:3.3:attach-descriptor (attach-descriptor) @ cloud-plugin-user-authenticator-plaintext
---
[INFO] 
[INFO] --- maven-install-plugin:2.3.1:install (default-install) @ cloud-plugin-user-authenticator-plaintext
---
[INFO] Installing <http://jenkins.buildacloud.org/job/simulator-singlerun/ws/plugins/user-authenticators/plain-text/target/cloud-plugin-user-authenticator-plaintext-4.5.0-SNAPSHOT.jar>
to /var/lib/jenkins/.m2/repository/org/apache/cloudstack/cloud-plugin-user-authenticator-plaintext/4.5.0-SNAPSHOT/cloud-plugin-user-authenticator-plaintext-4.5.0-SNAPSHOT.jar
[INFO] Installing <http://jenkins.buildacloud.org/job/simulator-singlerun/ws/plugins/user-authenticators/plain-text/pom.xml>
to /var/lib/jenkins/.m2/repository/org/apache/cloudstack/cloud-plugin-user-authenticator-plaintext/4.5.0-SNAPSHOT/cloud-plugin-user-authenticator-plaintext-4.5.0-SNAPSHOT.pom
[INFO]                                                                         
[INFO] ------------------------------------------------------------------------
[INFO] Building Apache CloudStack Plugin - User Authenticator SAML2 4.5.0-SNAPSHOT
[INFO] ------------------------------------------------------------------------
[INFO] 
[INFO] --- maven-clean-plugin:2.5:clean (default-clean) @ cloud-plugin-user-authenticator-saml2
---
[INFO] Deleting <http://jenkins.buildacloud.org/job/simulator-singlerun/ws/plugins/user-authenticators/saml2/target>
(includes = [**/*], excludes = [])
[INFO] Deleting <http://jenkins.buildacloud.org/job/simulator-singlerun/ws/plugins/user-authenticators/saml2>
(includes = [target, dist], excludes = [])
[INFO] 
[INFO] --- maven-checkstyle-plugin:2.11:check (cloudstack-checkstyle) @ cloud-plugin-user-authenticator-saml2
---
[INFO] Starting audit...
Audit done.

[INFO] 
[INFO] --- maven-remote-resources-plugin:1.3:process (default) @ cloud-plugin-user-authenticator-saml2
---
[INFO] 
[INFO] --- maven-resources-plugin:2.5:resources (default-resources) @ cloud-plugin-user-authenticator-saml2
---
[debug] execute contextualize
[INFO] Using 'UTF-8' encoding to copy filtered resources.
[INFO] Copying 2 resources
[INFO] Copying 3 resources
[INFO] 
[INFO] --- maven-compiler-plugin:2.5.1:compile (default-compile) @ cloud-plugin-user-authenticator-saml2
---
[INFO] Compiling 7 source files to <http://jenkins.buildacloud.org/job/simulator-singlerun/ws/plugins/user-authenticators/saml2/target/classes>
[INFO] 
[INFO] --- maven-resources-plugin:2.5:testResources (default-testResources) @ cloud-plugin-user-authenticator-saml2
---
[debug] execute contextualize
[INFO] Using 'UTF-8' encoding to copy filtered resources.
[INFO] skip non existing resourceDirectory <http://jenkins.buildacloud.org/job/simulator-singlerun/ws/plugins/user-authenticators/saml2/test/resources>
[INFO] Copying 3 resources
[INFO] 
[INFO] --- maven-compiler-plugin:2.5.1:testCompile (default-testCompile) @ cloud-plugin-user-authenticator-saml2
---
[INFO] Compiling 4 source files to <http://jenkins.buildacloud.org/job/simulator-singlerun/ws/plugins/user-authenticators/saml2/target/test-classes>
[INFO] 
[INFO] --- maven-surefire-plugin:2.12:test (default-test) @ cloud-plugin-user-authenticator-saml2
---
[INFO] Surefire report directory: <http://jenkins.buildacloud.org/job/simulator-singlerun/ws/plugins/user-authenticators/saml2/target/surefire-reports>

-------------------------------------------------------
 T E S T S
-------------------------------------------------------
Running org.apache.cloudstack.SAML2UserAuthenticatorTest
log4j:WARN No appenders could be found for logger (org.apache.cloudstack.saml.SAML2UserAuthenticator).
log4j:WARN Please initialize the log4j system properly.
log4j:WARN See http://logging.apache.org/log4j/1.2/faq.html#noconfig for more info.
Tests run: 2, Failures: 1, Errors: 0, Skipped: 0, Time elapsed: 1.098 sec <<< FAILURE!
Running org.apache.cloudstack.api.command.SAML2LogoutAPIAuthenticatorCmdTest
Tests run: 2, Failures: 0, Errors: 0, Skipped: 0, Time elapsed: 5.037 sec
Running org.apache.cloudstack.api.command.GetServiceProviderMetaDataCmdTest
Tests run: 2, Failures: 0, Errors: 0, Skipped: 0, Time elapsed: 2.491 sec
Running org.apache.cloudstack.api.command.SAML2LoginAPIAuthenticatorCmdTest
[Fatal Error] :-1:-1: Premature end of file.
Tests run: 2, Failures: 0, Errors: 0, Skipped: 0, Time elapsed: 2.216 sec

Results :

Failed tests:   encode(org.apache.cloudstack.SAML2UserAuthenticatorTest)

Tests run: 8, Failures: 1, Errors: 0, Skipped: 0

[INFO] ------------------------------------------------------------------------
[INFO] Reactor Summary:
[INFO] 
[INFO] Apache CloudStack Developer Tools - Checkstyle Configuration  SUCCESS [5.523s]
[INFO] Apache CloudStack ................................. SUCCESS [6.494s]
[INFO] Apache CloudStack Maven Conventions Parent ........ SUCCESS [1.937s]
[INFO] Apache CloudStack Framework - Managed Context ..... SUCCESS [5.906s]
[INFO] Apache CloudStack Utils ........................... SUCCESS [23.860s]
[INFO] Apache CloudStack Framework ....................... SUCCESS [0.099s]
[INFO] Apache CloudStack Framework - Event Notification .. SUCCESS [12.117s]
[INFO] Apache CloudStack Framework - Configuration ....... SUCCESS [6.620s]
[INFO] Apache CloudStack API ............................. SUCCESS [26.780s]
[INFO] Apache CloudStack Framework - REST ................ SUCCESS [4.160s]
[INFO] Apache CloudStack Framework - IPC ................. SUCCESS [9.394s]
[INFO] Apache CloudStack Cloud Engine .................... SUCCESS [0.220s]
[INFO] Apache CloudStack Cloud Engine API ................ SUCCESS [7.413s]
[INFO] Apache CloudStack Framework - Security ............ SUCCESS [4.476s]
[INFO] Apache CloudStack Core ............................ SUCCESS [35.715s]
[INFO] Apache CloudStack Agents .......................... SUCCESS [14.094s]
[INFO] Apache CloudStack Framework - Clustering .......... SUCCESS [5.393s]
[INFO] Apache CloudStack Framework - Event Notification .. SUCCESS [2.810s]
[INFO] Apache CloudStack Cloud Engine Schema Component ... SUCCESS [25.938s]
[INFO] Apache CloudStack Framework - Jobs ................ SUCCESS [8.376s]
[INFO] Apache CloudStack Cloud Engine Internal Components API  SUCCESS [6.376s]
[INFO] Apache CloudStack Server .......................... SUCCESS [1:21.585s]
[INFO] Apache CloudStack Usage Server .................... SUCCESS [12.747s]
[INFO] Apache CloudStack Cloud Engine Orchestration Component  SUCCESS [15.505s]
[INFO] Apache CloudStack Cloud Services .................. SUCCESS [0.110s]
[INFO] Apache CloudStack Secondary Storage ............... SUCCESS [0.568s]
[INFO] Apache CloudStack Secondary Storage Service ....... SUCCESS [9.408s]
[INFO] Apache CloudStack Engine Storage Component ........ SUCCESS [14.195s]
[INFO] Apache CloudStack Engine Storage Volume Component . SUCCESS [8.550s]
[INFO] Apache CloudStack Engine Storage Image Component .. SUCCESS [4.390s]
[INFO] Apache CloudStack Engine Storage Data Motion Component  SUCCESS [3.816s]
[INFO] Apache CloudStack Engine Storage Cache Component .. SUCCESS [3.786s]
[INFO] Apache CloudStack Engine Storage Snapshot Component  SUCCESS [11.729s]
[INFO] Apache CloudStack Cloud Engine API ................ SUCCESS [3.063s]
[INFO] Apache CloudStack Cloud Engine Service ............ SUCCESS [8.920s]
[INFO] Apache CloudStack Plugin POM ...................... SUCCESS [0.645s]
[INFO] Apache CloudStack Plugin - API Rate Limit ......... SUCCESS [9.079s]
[INFO] Apache CloudStack Plugin - Storage Volume default provider  SUCCESS [4.151s]
[INFO] Apache CloudStack Plugin - Storage Volume SolidFire Provider  SUCCESS [7.970s]
[INFO] Apache CloudStack Plugin - API SolidFire .......... SUCCESS [4.709s]
[INFO] Apache CloudStack Plugin - API Discovery .......... SUCCESS [7.950s]
[INFO] Apache CloudStack Plugin - ACL Static Role Based .. SUCCESS [3.657s]
[INFO] Apache CloudStack Plugin - Host Anti-Affinity Processor  SUCCESS [3.859s]
[INFO] Apache CloudStack Plugin - Explicit Dedication Processor  SUCCESS [3.616s]
[INFO] Apache CloudStack Plugin - User Concentrated Pod Deployment Planner  SUCCESS [3.635s]
[INFO] Apache CloudStack Plugin - User Dispersing Deployment Planner  SUCCESS [3.750s]
[INFO] Apache CloudStack Plugin - Implicit Dedication Planner  SUCCESS [10.658s]
[INFO] Apache CloudStack Plugin - Skip Heurestics Planner  SUCCESS [3.559s]
[INFO] Apache CloudStack Plugin - Host Allocator Random .. SUCCESS [3.567s]
[INFO] Apache CloudStack Plugin - Dedicated Resources .... SUCCESS [10.924s]
[INFO] Apache CloudStack Plugin - Hypervisor OracleVM .... SUCCESS [5.126s]
[INFO] Apache CloudStack Plugin - Open vSwitch ........... SUCCESS [6.160s]
[INFO] Apache CloudStack Plugin - Hypervisor XenServer ... SUCCESS [16.878s]
[INFO] Apache CloudStack Plugin - Hypervisor KVM ......... SUCCESS [17.042s]
[INFO] Apache CloudStack Plugin - RabbitMQ Event Bus ..... SUCCESS [5.365s]
[INFO] Apache CloudStack Plugin - In Memory Event Bus .... SUCCESS [6.534s]
[INFO] Apache CloudStack Plugin - Hypervisor Baremetal ... SUCCESS [8.012s]
[INFO] Apache CloudStack Plugin - Hypervisor UCS ......... SUCCESS [4.528s]
[INFO] Apache CloudStack Plugin - Hypervisor Hyper-V ..... SUCCESS [9.521s]
[INFO] Apache CloudStack Plugin - Network Elastic Load Balancer  SUCCESS [8.112s]
[INFO] Apache CloudStack Plugin - Network Internal Load Balancer  SUCCESS [13.278s]
[INFO] Apache CloudStack Framework - Spring Life Cycle ... SUCCESS [3.957s]
[INFO] Apache CloudStack Plugin - Network Juniper Contrail  SUCCESS [22.619s]
[INFO] Apache CloudStack Plugin - Palo Alto .............. SUCCESS [12.394s]
[INFO] Apache CloudStack Plugin - Network Netscaler ...... SUCCESS [7.356s]
[INFO] Apache CloudStack Plugin - Network Nicira NVP ..... SUCCESS [19.814s]
[INFO] Apache CloudStack Plugin - BigSwitch Virtual Network Segment  SUCCESS [8.893s]
[INFO] Apache CloudStack Plugin - Network Brocade VCS .... SUCCESS [16.163s]
[INFO] Apache CloudStack Plugin - Midokura Midonet ....... SUCCESS [15.048s]
[INFO] Apache CloudStack Plugin - Stratosphere SSP ....... SUCCESS [9.630s]
[INFO] Apache CloudStack Plugin - Network Opendaylight ... SUCCESS [9.767s]
[INFO] Apache CloudStack Plugin - Storage Allocator Random  SUCCESS [5.140s]
[INFO] Apache CloudStack Plugin - User Authenticator LDAP  SUCCESS [8.135s]
[INFO] Apache CloudStack Plugin - User Authenticator MD5 . SUCCESS [6.983s]
[INFO] Apache CloudStack Plugin - User Authenticator Plain Text  SUCCESS [4.176s]
[INFO] Apache CloudStack Plugin - User Authenticator SAML2  FAILURE [20.518s]
[INFO] Apache CloudStack Plugin - User Authenticator SHA256 Salted  SKIPPED
[INFO] Apache CloudStack Plugin - Dns Notifier Example ... SKIPPED
[INFO] Apache CloudStack Plugin - Storage Image S3 ....... SKIPPED
[INFO] Apache CloudStack Plugin - Storage Image Swift provider  SKIPPED
[INFO] Apache CloudStack Plugin - Storage Image default provider  SKIPPED
[INFO] Apache CloudStack Plugin - Storage Image sample provider  SKIPPED
[INFO] Apache CloudStack Plugin - Storage Volume Nexenta Provider  SKIPPED
[INFO] Apache CloudStack Plugin - Storage Volume CloudByte Provider  SKIPPED
[INFO] Apache CloudStack Plugin - Storage Volume sample provider  SKIPPED
[INFO] Apache CloudStack Plugin - SNMP Alerts ............ SKIPPED
[INFO] Apache CloudStack Plugin - Syslog Alerts .......... SKIPPED
[INFO] Apache CloudStack Plugin - Network VXLAN .......... SKIPPED
[INFO] Apache CloudStack Plugin - GloboDNS ............... SKIPPED
[INFO] Apache CloudStack Plugin - Hypervisor Simulator ... SKIPPED
[INFO] Apache CloudStack Framework - Spring Module ....... SKIPPED
[INFO] Apache CloudStack Secondary Storage Controller .... SKIPPED
[INFO] Apache CloudStack Console Proxy - RDP Client ...... SKIPPED
[INFO] Apache CloudStack Console Proxy ................... SKIPPED
[INFO] Apache CloudStack Console Proxy - Server .......... SKIPPED
[INFO] Apache CloudStack System VM ....................... SKIPPED
[INFO] Apache CloudStack Client UI ....................... SKIPPED
[INFO] Apache CloudStack Framework - QuickCloud .......... SKIPPED
[INFO] Apache CloudStack Test ............................ SKIPPED
[INFO] Apache CloudStack Developer Mode .................. SKIPPED
[INFO] Apache CloudStack Developer Tools ................. SKIPPED
[INFO] Apache CloudStack apidocs ......................... SKIPPED
[INFO] Apache CloudStack marvin .......................... SKIPPED
[INFO] Apache CloudStack DevCloud ........................ SKIPPED
[INFO] Apache CloudStack DevCloud-KVM .................... SKIPPED
[INFO] ------------------------------------------------------------------------
[INFO] BUILD FAILURE
[INFO] ------------------------------------------------------------------------
[INFO] Total time: 12:29.773s
[INFO] Finished at: Thu Sep 04 12:03:28 EDT 2014
[INFO] Final Memory: 71M/301M
[INFO] ------------------------------------------------------------------------
[ERROR] Failed to execute goal org.apache.maven.plugins:maven-surefire-plugin:2.12:test (default-test)
on project cloud-plugin-user-authenticator-saml2: There are test failures.
[ERROR] 
[ERROR] Please refer to <http://jenkins.buildacloud.org/job/simulator-singlerun/ws/plugins/user-authenticators/saml2/target/surefire-reports>
for the individual test results.
[ERROR] -> [Help 1]
[ERROR] 
[ERROR] To see the full stack trace of the errors, re-run Maven with the -e switch.
[ERROR] Re-run Maven using the -X switch to enable full debug logging.
[ERROR] 
[ERROR] For more information about the errors and possible solutions, please read the following
articles:
[ERROR] [Help 1] http://cwiki.apache.org/confluence/display/MAVEN/MojoFailureException
[ERROR] 
[ERROR] After correcting the problems, you can resume the build with the command
[ERROR]   mvn <goals> -rf :cloud-plugin-user-authenticator-saml2
Build step 'Invoke top-level Maven targets' marked build as failure
[xUnit] [INFO] - Starting to record.
[xUnit] [INFO] - Processing JUnit
[xUnit] [INFO] - [JUnit] - 1 test report file(s) were found with the pattern 'xunit.xml' relative
to '<http://jenkins.buildacloud.org/job/simulator-singlerun/ws/'> for the testing framework
'JUnit'.
[xUnit] [ERROR] - Test reports were found but not all of them are new. Did all the tests run?
  * <http://jenkins.buildacloud.org/job/simulator-singlerun/ws/xunit.xml> is 1 hr 46
min old

ERROR: Publisher org.jenkinsci.plugins.xunit.XUnitPublisher aborted due to exception
java.lang.InterruptedException: org.jenkinsci.plugins.xunit.OldTestReportException
	at hudson.FilePath.act(FilePath.java:905)
	at hudson.FilePath.act(FilePath.java:887)
	at org.jenkinsci.plugins.xunit.XUnitProcessor.performTests(XUnitProcessor.java:111)
	at org.jenkinsci.plugins.xunit.XUnitProcessor.performXUnit(XUnitProcessor.java:54)
	at org.jenkinsci.plugins.xunit.XUnitPublisher.perform(XUnitPublisher.java:88)
	at hudson.tasks.BuildStepMonitor$1.perform(BuildStepMonitor.java:20)
	at hudson.model.AbstractBuild$AbstractBuildExecution.perform(AbstractBuild.java:742)
	at hudson.model.AbstractBuild$AbstractBuildExecution.performAllBuildSteps(AbstractBuild.java:714)
	at hudson.model.Build$BuildExecution.post2(Build.java:183)
	at hudson.model.AbstractBuild$AbstractBuildExecution.post(AbstractBuild.java:663)
	at hudson.model.Run.execute(Run.java:1713)
	at hudson.model.FreeStyleBuild.run(FreeStyleBuild.java:43)
	at hudson.model.ResourceController.execute(ResourceController.java:88)
	at hudson.model.Executor.run(Executor.java:231)
Caused by: hudson.FilePath$TunneledInterruptedException: org.jenkinsci.plugins.xunit.OldTestReportException
	at hudson.FilePath$FileCallableWrapper.call(FilePath.java:2464)
	at hudson.remoting.UserRequest.perform(UserRequest.java:118)
	at hudson.remoting.UserRequest.perform(UserRequest.java:48)
	at hudson.remoting.Request$2.run(Request.java:328)
	at hudson.remoting.InterceptingExecutorService$1.call(InterceptingExecutorService.java:72)
	at java.util.concurrent.FutureTask.run(FutureTask.java:262)
	at java.util.concurrent.ThreadPoolExecutor.runWorker(ThreadPoolExecutor.java:1145)
	at java.util.concurrent.ThreadPoolExecutor$Worker.run(ThreadPoolExecutor.java:615)
	at java.lang.Thread.run(Thread.java:744)
Caused by: org.jenkinsci.plugins.xunit.OldTestReportException
	at org.jenkinsci.plugins.xunit.service.XUnitTransformer.invoke(XUnitTransformer.java:146)
	at org.jenkinsci.plugins.xunit.service.XUnitTransformer.invoke(XUnitTransformer.java:17)
	at hudson.FilePath$FileCallableWrapper.call(FilePath.java:2462)
	... 8 more

Mime
View raw message