cloudstack-dev mailing list archives

Site index · List index
Message view « Date » · « Thread »
Top « Date » · « Thread »
From jenk...@cloudstack.org
Subject Build failed in Jenkins: cloudstack-4.3-maven-build #583
Date Mon, 08 Sep 2014 09:07:36 GMT
See <http://jenkins.buildacloud.org/job/cloudstack-4.3-maven-build/583/changes>

Changes:

[Rohit Yadav] appliance: fix build.sh for vmware systemvm building and exporting

[Rohit Yadav] CLOUDSTACK-6624: set specifyIpRanges to true if specifyVlan is set to true

------------------------------------------
[...truncated 2421 lines...]
219/419 KB   
223/419 KB   
227/419 KB   
231/419 KB   
232/419 KB   
235/419 KB   
239/419 KB   
243/419 KB   
247/419 KB   
251/419 KB   
255/419 KB   
259/419 KB   
263/419 KB   
267/419 KB   
271/419 KB   
275/419 KB   
279/419 KB   
281/419 KB   
284/419 KB   
288/419 KB   
292/419 KB   
296/419 KB   
300/419 KB   
304/419 KB   
308/419 KB   
312/419 KB   
316/419 KB   
320/419 KB   
324/419 KB   
328/419 KB   
332/419 KB   
336/419 KB   
340/419 KB   
344/419 KB   
348/419 KB   
352/419 KB   
356/419 KB   
360/419 KB   
364/419 KB   
368/419 KB   
372/419 KB   
373/419 KB   
377/419 KB   
381/419 KB   
385/419 KB   
389/419 KB   
393/419 KB   
397/419 KB   
401/419 KB   
405/419 KB   
409/419 KB   
413/419 KB   
417/419 KB   
419/419 KB   
             
Downloaded: http://repo.maven.apache.org/maven2/org/apache/httpcomponents/httpclient/4.2.2/httpclient-4.2.2.jar
(419 KB at 3946.4 KB/sec)
[INFO] 
[INFO] --- maven-clean-plugin:2.5:clean (default-clean) @ cloud-plugin-hypervisor-xen ---
[INFO] Deleting <http://jenkins.buildacloud.org/job/cloudstack-4.3-maven-build/ws/plugins/hypervisors/xen>
(includes = [target, dist], excludes = [])
[INFO] 
[INFO] --- maven-remote-resources-plugin:1.3:process (default) @ cloud-plugin-hypervisor-xen
---
[INFO] 
[INFO] --- maven-resources-plugin:2.5:resources (default-resources) @ cloud-plugin-hypervisor-xen
---
[debug] execute contextualize
[INFO] Using 'UTF-8' encoding to copy filtered resources.
[INFO] Copying 4 resources
[INFO] Copying 3 resources
[INFO] 
[INFO] --- maven-compiler-plugin:2.5.1:compile (default-compile) @ cloud-plugin-hypervisor-xen
---
[INFO] Compiling 22 source files to <http://jenkins.buildacloud.org/job/cloudstack-4.3-maven-build/ws/plugins/hypervisors/xen/target/classes>
[INFO] -------------------------------------------------------------
[ERROR] COMPILATION ERROR : 
[INFO] -------------------------------------------------------------
[ERROR] <http://jenkins.buildacloud.org/job/cloudstack-4.3-maven-build/ws/plugins/hypervisors/xen/src/org/apache/cloudstack/hypervisor/xenserver/XenServerResourceNewBase.java>:[108,33]
cannot find symbol
symbol  : method properFrom(com.xensource.xenapi.Connection,java.util.Set<java.lang.String>,java.lang.String,java.lang.Double)
location: class com.xensource.xenapi.Event
[ERROR] <http://jenkins.buildacloud.org/job/cloudstack-4.3-maven-build/ws/plugins/hypervisors/xen/src/org/apache/cloudstack/hypervisor/xenserver/XenServerResourceNewBase.java>:[171,39]
cannot find symbol
symbol  : method properFrom(com.xensource.xenapi.Connection,java.util.Set<java.lang.String>,java.lang.String,java.lang.Double)
location: class com.xensource.xenapi.Event
[ERROR] <http://jenkins.buildacloud.org/job/cloudstack-4.3-maven-build/ws/plugins/hypervisors/xen/src/org/apache/cloudstack/hypervisor/xenserver/XenServerResourceNewBase.java>:[308,35]
cannot find symbol
symbol  : method properFrom(com.xensource.xenapi.Connection,java.util.Set<java.lang.String>,java.lang.String,java.lang.Double)
location: class com.xensource.xenapi.Event
[ERROR] <http://jenkins.buildacloud.org/job/cloudstack-4.3-maven-build/ws/plugins/hypervisors/xen/src/com/cloud/hypervisor/xen/resource/Xenserver625StorageProcessor.java>:[177,34]
cannot find symbol
symbol  : method copyAsync2(com.xensource.xenapi.Connection,com.xensource.xenapi.SR,<nulltype>,<nulltype>)
location: class com.xensource.xenapi.VDI
[ERROR] <http://jenkins.buildacloud.org/job/cloudstack-4.3-maven-build/ws/plugins/hypervisors/xen/src/com/cloud/hypervisor/xen/resource/Xenserver625StorageProcessor.java>:[236,34]
cannot find symbol
symbol  : method copyAsync2(com.xensource.xenapi.Connection,com.xensource.xenapi.SR,com.xensource.xenapi.VDI,<nulltype>)
location: class com.xensource.xenapi.VDI
[ERROR] <http://jenkins.buildacloud.org/job/cloudstack-4.3-maven-build/ws/plugins/hypervisors/xen/src/com/cloud/hypervisor/xen/resource/Xenserver625StorageProcessor.java>:[347,43]
cannot find symbol
symbol  : method copyAsync2(com.xensource.xenapi.Connection,com.xensource.xenapi.SR,<nulltype>,<nulltype>)
location: class com.xensource.xenapi.VDI
[ERROR] <http://jenkins.buildacloud.org/job/cloudstack-4.3-maven-build/ws/plugins/hypervisors/xen/src/com/cloud/hypervisor/xen/resource/Xenserver625StorageProcessor.java>:[465,27]
cannot find symbol
symbol  : method copyAsync2(com.xensource.xenapi.Connection,com.xensource.xenapi.SR,<nulltype>,<nulltype>)
location: class com.xensource.xenapi.VDI
[ERROR] <http://jenkins.buildacloud.org/job/cloudstack-4.3-maven-build/ws/plugins/hypervisors/xen/src/com/cloud/hypervisor/xen/resource/Xenserver625StorageProcessor.java>:[581,37]
cannot find symbol
symbol  : method copyAsync2(com.xensource.xenapi.Connection,<nulltype>,<nulltype>,com.xensource.xenapi.VDI)
location: class com.xensource.xenapi.VDI
[ERROR] <http://jenkins.buildacloud.org/job/cloudstack-4.3-maven-build/ws/plugins/hypervisors/xen/src/com/cloud/hypervisor/xen/resource/Xenserver625StorageProcessor.java>:[644,34]
cannot find symbol
symbol  : method copyAsync2(com.xensource.xenapi.Connection,com.xensource.xenapi.SR,<nulltype>,<nulltype>)
location: class com.xensource.xenapi.VDI
[ERROR] <http://jenkins.buildacloud.org/job/cloudstack-4.3-maven-build/ws/plugins/hypervisors/xen/src/com/cloud/hypervisor/xen/resource/Xenserver625StorageProcessor.java>:[696,34]
cannot find symbol
symbol  : method copyAsync2(com.xensource.xenapi.Connection,com.xensource.xenapi.SR,<nulltype>,<nulltype>)
location: class com.xensource.xenapi.VDI
[ERROR] <http://jenkins.buildacloud.org/job/cloudstack-4.3-maven-build/ws/plugins/hypervisors/xen/src/com/cloud/hypervisor/xen/resource/Xenserver625StorageProcessor.java>:[780,37]
cannot find symbol
symbol  : method copyAsync2(com.xensource.xenapi.Connection,<nulltype>,<nulltype>,com.xensource.xenapi.VDI)
location: class com.xensource.xenapi.VDI
[INFO] 11 errors 
[INFO] -------------------------------------------------------------
[INFO] ------------------------------------------------------------------------
[INFO] Reactor Summary:
[INFO] 
[INFO] Apache CloudStack ................................. SUCCESS [1.985s]
[INFO] Apache CloudStack Maven Conventions Parent ........ SUCCESS [0.032s]
[INFO] Apache CloudStack Framework - Managed Context ..... SUCCESS [3.045s]
[INFO] Apache CloudStack Utils ........................... SUCCESS [7.720s]
[INFO] Apache CloudStack Framework ....................... SUCCESS [0.032s]
[INFO] Apache CloudStack Framework - Event Notification .. SUCCESS [4.089s]
[INFO] Apache CloudStack Framework - Configuration ....... SUCCESS [3.362s]
[INFO] Apache CloudStack API ............................. SUCCESS [7.383s]
[INFO] Apache CloudStack Framework - REST ................ SUCCESS [2.409s]
[INFO] Apache CloudStack Framework - IPC ................. SUCCESS [4.604s]
[INFO] Apache CloudStack Cloud Engine .................... SUCCESS [0.028s]
[INFO] Apache CloudStack Cloud Engine API ................ SUCCESS [3.438s]
[INFO] Apache CloudStack Core ............................ SUCCESS [5.709s]
[INFO] Apache CloudStack Agents .......................... SUCCESS [4.187s]
[INFO] Apache CloudStack Framework - Clustering .......... SUCCESS [2.262s]
[INFO] Apache CloudStack Framework - Jobs ................ SUCCESS [2.506s]
[INFO] Apache CloudStack Cloud Engine Schema Component ... SUCCESS [5.996s]
[INFO] Apache CloudStack Framework - Event Notification .. SUCCESS [1.531s]
[INFO] Apache CloudStack Cloud Engine Internal Components API  SUCCESS [2.320s]
[INFO] Apache CloudStack Server .......................... SUCCESS [27.517s]
[INFO] Apache CloudStack Usage Server .................... SUCCESS [4.251s]
[INFO] Apache XenSource XAPI ............................. SUCCESS [3.507s]
[INFO] Apache CloudStack Cloud Engine Orchestration Component  SUCCESS [5.164s]
[INFO] Apache CloudStack Cloud Services .................. SUCCESS [0.025s]
[INFO] Apache CloudStack Secondary Storage Service ....... SUCCESS [3.757s]
[INFO] Apache CloudStack Engine Storage Component ........ SUCCESS [5.063s]
[INFO] Apache CloudStack Engine Storage Volume Component . SUCCESS [3.369s]
[INFO] Apache CloudStack Engine Storage Image Component .. SUCCESS [2.342s]
[INFO] Apache CloudStack Engine Storage Data Motion Component  SUCCESS [2.184s]
[INFO] Apache CloudStack Engine Storage Cache Component .. SUCCESS [2.125s]
[INFO] Apache CloudStack Engine Storage Snapshot Component  SUCCESS [5.712s]
[INFO] Apache CloudStack Cloud Engine API ................ SUCCESS [1.730s]
[INFO] Apache CloudStack Cloud Engine Service ............ SUCCESS [0.831s]
[INFO] Apache CloudStack Plugin POM ...................... SUCCESS [0.309s]
[INFO] Apache CloudStack Plugin - API Rate Limit ......... SUCCESS [5.736s]
[INFO] Apache CloudStack Plugin - API Discovery .......... SUCCESS [3.723s]
[INFO] Apache CloudStack Plugin - ACL Static Role Based .. SUCCESS [1.884s]
[INFO] Apache CloudStack Plugin - Host Anti-Affinity Processor  SUCCESS [2.012s]
[INFO] Apache CloudStack Plugin - Explicit Dedication Processor  SUCCESS [2.037s]
[INFO] Apache CloudStack Plugin - User Concentrated Pod Deployment Planner  SUCCESS [1.945s]
[INFO] Apache CloudStack Plugin - User Dispersing Deployment Planner  SUCCESS [1.982s]
[INFO] Apache CloudStack Plugin - Implicit Dedication Planner  SUCCESS [5.787s]
[INFO] Apache CloudStack Plugin - Skip Heurestics Planner  SUCCESS [1.911s]
[INFO] Apache CloudStack Plugin - Host Allocator Random .. SUCCESS [1.979s]
[INFO] Apache CloudStack Plugin - Dedicated Resources .... SUCCESS [5.453s]
[INFO] Apache CloudStack Plugin - Hypervisor OracleVM .... SUCCESS [6.067s]
[INFO] Apache CloudStack Plugin - Open vSwitch ........... SUCCESS [2.374s]
[INFO] Apache CloudStack Plugin - Hypervisor Xen ......... FAILURE [3.872s]
[INFO] Apache CloudStack Plugin - Hypervisor KVM ......... SKIPPED
[INFO] Apache CloudStack Plugin - RabbitMQ Event Bus ..... SKIPPED
[INFO] Apache CloudStack Plugin - Hypervisor Baremetal ... SKIPPED
[INFO] Apache CloudStack Plugin - Hypervisor UCS ......... SKIPPED
[INFO] Apache CloudStack Plugin - Hypervisor Hyper-V ..... SKIPPED
[INFO] Apache CloudStack Plugin - Network Elastic Load Balancer  SKIPPED
[INFO] Apache CloudStack Plugin - Network Internal Load Balancer  SKIPPED
[INFO] Apache CloudStack Plugin - Network Juniper Contrail  SKIPPED
[INFO] Apache CloudStack Plugin - Palo Alto .............. SKIPPED
[INFO] Apache CloudStack Checkstyle Configuration ........ SKIPPED
[INFO] Apache CloudStack Plugin - Network Nicira NVP ..... SKIPPED
[INFO] Apache CloudStack Plugin - BigSwitch Virtual Network Segment  SKIPPED
[INFO] Apache CloudStack Plugin - Midokura Midonet ....... SKIPPED
[INFO] Apache Cloudstack Plugin - Stratosphere SSP ....... SKIPPED
[INFO] Apache CloudStack Plugin - Storage Allocator Random  SKIPPED
[INFO] Apache CloudStack Plugin - User Authenticator LDAP  SKIPPED
[INFO] Apache CloudStack Plugin - User Authenticator MD5 . SKIPPED
[INFO] Apache CloudStack Plugin - User Authenticator Plain Text  SKIPPED
[INFO] Apache CloudStack Plugin - User Authenticator SHA256 Salted  SKIPPED
[INFO] Apache CloudStack Plugin - Dns Notifier Example ... SKIPPED
[INFO] Apache CloudStack Plugin - Storage Image S3 ....... SKIPPED
[INFO] Apache CloudStack Plugin - Storage Image Swift provider  SKIPPED
[INFO] Apache CloudStack Plugin - Storage Image default provider  SKIPPED
[INFO] Apache CloudStack Plugin - Storage Image sample provider  SKIPPED
[INFO] Apache CloudStack Plugin - Storage Volume SolidFire Provider  SKIPPED
[INFO] Apache CloudStack Plugin - Storage Volume default provider  SKIPPED
[INFO] Apache CloudStack Plugin - Storage Volume sample provider  SKIPPED
[INFO] Apache CloudStack Plugin - SNMP Alerts ............ SKIPPED
[INFO] Apache CloudStack Plugin - Syslog Alerts .......... SKIPPED
[INFO] Apache CloudStack Plugin - Network VXLAN .......... SKIPPED
[INFO] Apache CloudStack Framework - Spring Life Cycle ... SKIPPED
[INFO] cloud-framework-spring-module ..................... SKIPPED
[INFO] Apache CloudStack Test ............................ SKIPPED
[INFO] Apache CloudStack Client UI ....................... SKIPPED
[INFO] Apache CloudStack Console Proxy - RDP Client ...... SKIPPED
[INFO] Apache CloudStack Console Proxy ................... SKIPPED
[INFO] Apache CloudStack Console Proxy - Server .......... SKIPPED
[INFO] Apache CloudStack Framework - QuickCloud .......... SKIPPED
[INFO] ------------------------------------------------------------------------
[INFO] BUILD FAILURE
[INFO] ------------------------------------------------------------------------
[INFO] Total time: 2:58.808s
[INFO] Finished at: Mon Sep 08 11:07:35 CEST 2014
[INFO] Final Memory: 47M/333M
[INFO] ------------------------------------------------------------------------
[ERROR] Failed to execute goal org.apache.maven.plugins:maven-compiler-plugin:2.5.1:compile
(default-compile) on project cloud-plugin-hypervisor-xen: Compilation failure: Compilation
failure:
[ERROR] <http://jenkins.buildacloud.org/job/cloudstack-4.3-maven-build/ws/plugins/hypervisors/xen/src/org/apache/cloudstack/hypervisor/xenserver/XenServerResourceNewBase.java>:[108,33]
cannot find symbol
[ERROR] symbol  : method properFrom(com.xensource.xenapi.Connection,java.util.Set<java.lang.String>,java.lang.String,java.lang.Double)
[ERROR] location: class com.xensource.xenapi.Event
[ERROR] <http://jenkins.buildacloud.org/job/cloudstack-4.3-maven-build/ws/plugins/hypervisors/xen/src/org/apache/cloudstack/hypervisor/xenserver/XenServerResourceNewBase.java>:[171,39]
cannot find symbol
[ERROR] symbol  : method properFrom(com.xensource.xenapi.Connection,java.util.Set<java.lang.String>,java.lang.String,java.lang.Double)
[ERROR] location: class com.xensource.xenapi.Event
[ERROR] <http://jenkins.buildacloud.org/job/cloudstack-4.3-maven-build/ws/plugins/hypervisors/xen/src/org/apache/cloudstack/hypervisor/xenserver/XenServerResourceNewBase.java>:[308,35]
cannot find symbol
[ERROR] symbol  : method properFrom(com.xensource.xenapi.Connection,java.util.Set<java.lang.String>,java.lang.String,java.lang.Double)
[ERROR] location: class com.xensource.xenapi.Event
[ERROR] <http://jenkins.buildacloud.org/job/cloudstack-4.3-maven-build/ws/plugins/hypervisors/xen/src/com/cloud/hypervisor/xen/resource/Xenserver625StorageProcessor.java>:[177,34]
cannot find symbol
[ERROR] symbol  : method copyAsync2(com.xensource.xenapi.Connection,com.xensource.xenapi.SR,<nulltype>,<nulltype>)
[ERROR] location: class com.xensource.xenapi.VDI
[ERROR] <http://jenkins.buildacloud.org/job/cloudstack-4.3-maven-build/ws/plugins/hypervisors/xen/src/com/cloud/hypervisor/xen/resource/Xenserver625StorageProcessor.java>:[236,34]
cannot find symbol
[ERROR] symbol  : method copyAsync2(com.xensource.xenapi.Connection,com.xensource.xenapi.SR,com.xensource.xenapi.VDI,<nulltype>)
[ERROR] location: class com.xensource.xenapi.VDI
[ERROR] <http://jenkins.buildacloud.org/job/cloudstack-4.3-maven-build/ws/plugins/hypervisors/xen/src/com/cloud/hypervisor/xen/resource/Xenserver625StorageProcessor.java>:[347,43]
cannot find symbol
[ERROR] symbol  : method copyAsync2(com.xensource.xenapi.Connection,com.xensource.xenapi.SR,<nulltype>,<nulltype>)
[ERROR] location: class com.xensource.xenapi.VDI
[ERROR] <http://jenkins.buildacloud.org/job/cloudstack-4.3-maven-build/ws/plugins/hypervisors/xen/src/com/cloud/hypervisor/xen/resource/Xenserver625StorageProcessor.java>:[465,27]
cannot find symbol
[ERROR] symbol  : method copyAsync2(com.xensource.xenapi.Connection,com.xensource.xenapi.SR,<nulltype>,<nulltype>)
[ERROR] location: class com.xensource.xenapi.VDI
[ERROR] <http://jenkins.buildacloud.org/job/cloudstack-4.3-maven-build/ws/plugins/hypervisors/xen/src/com/cloud/hypervisor/xen/resource/Xenserver625StorageProcessor.java>:[581,37]
cannot find symbol
[ERROR] symbol  : method copyAsync2(com.xensource.xenapi.Connection,<nulltype>,<nulltype>,com.xensource.xenapi.VDI)
[ERROR] location: class com.xensource.xenapi.VDI
[ERROR] <http://jenkins.buildacloud.org/job/cloudstack-4.3-maven-build/ws/plugins/hypervisors/xen/src/com/cloud/hypervisor/xen/resource/Xenserver625StorageProcessor.java>:[644,34]
cannot find symbol
[ERROR] symbol  : method copyAsync2(com.xensource.xenapi.Connection,com.xensource.xenapi.SR,<nulltype>,<nulltype>)
[ERROR] location: class com.xensource.xenapi.VDI
[ERROR] <http://jenkins.buildacloud.org/job/cloudstack-4.3-maven-build/ws/plugins/hypervisors/xen/src/com/cloud/hypervisor/xen/resource/Xenserver625StorageProcessor.java>:[696,34]
cannot find symbol
[ERROR] symbol  : method copyAsync2(com.xensource.xenapi.Connection,com.xensource.xenapi.SR,<nulltype>,<nulltype>)
[ERROR] location: class com.xensource.xenapi.VDI
[ERROR] <http://jenkins.buildacloud.org/job/cloudstack-4.3-maven-build/ws/plugins/hypervisors/xen/src/com/cloud/hypervisor/xen/resource/Xenserver625StorageProcessor.java>:[780,37]
cannot find symbol
[ERROR] symbol  : method copyAsync2(com.xensource.xenapi.Connection,<nulltype>,<nulltype>,com.xensource.xenapi.VDI)
[ERROR] location: class com.xensource.xenapi.VDI
[ERROR] -> [Help 1]
[ERROR] 
[ERROR] To see the full stack trace of the errors, re-run Maven with the -e switch.
[ERROR] Re-run Maven using the -X switch to enable full debug logging.
[ERROR] 
[ERROR] For more information about the errors and possible solutions, please read the following
articles:
[ERROR] [Help 1] http://cwiki.apache.org/confluence/display/MAVEN/MojoFailureException
[ERROR] 
[ERROR] After correcting the problems, you can resume the build with the command
[ERROR]   mvn <goals> -rf :cloud-plugin-hypervisor-xen
Build step 'Invoke top-level Maven targets' marked build as failure

Mime
View raw message