cloudstack-dev mailing list archives

Site index · List index
Message view « Date » · « Thread »
Top « Date » · « Thread »
From jenk...@cloudstack.org
Subject Build failed in Jenkins: build-master #1577
Date Wed, 10 Sep 2014 06:31:15 GMT
See <http://jenkins.buildacloud.org/job/build-master/1577/changes>

Changes:

[Devdeep Singh] CLOUDSTACK-6898: [Hyper-V] fixed rdp console freezing during reboot.

[Devdeep Singh] CLOUDSTACK-7503: Fixed few coverity issues

------------------------------------------
[...truncated 3885 lines...]
[INFO] skip non existing resourceDirectory <http://jenkins.buildacloud.org/job/build-master/ws/plugins/user-authenticators/md5/test/resources>
[INFO] Copying 3 resources
[INFO] 
[INFO] --- maven-compiler-plugin:2.5.1:testCompile (default-testCompile) @ cloud-plugin-user-authenticator-md5
---
[INFO] Compiling 1 source file to <http://jenkins.buildacloud.org/job/build-master/ws/plugins/user-authenticators/md5/target/test-classes>
[INFO] 
[INFO] --- maven-surefire-plugin:2.12:test (default-test) @ cloud-plugin-user-authenticator-md5
---
[INFO] Surefire report directory: <http://jenkins.buildacloud.org/job/build-master/ws/plugins/user-authenticators/md5/target/surefire-reports>

-------------------------------------------------------
 T E S T S
-------------------------------------------------------
Running com.cloud.server.auth.MD5UserAuthenticatorTest
log4j:WARN No appenders could be found for logger (com.cloud.server.auth.MD5UserAuthenticator).
log4j:WARN Please initialize the log4j system properly.
log4j:WARN See http://logging.apache.org/log4j/1.2/faq.html#noconfig for more info.
Tests run: 4, Failures: 0, Errors: 0, Skipped: 0, Time elapsed: 0.574 sec

Results :

Tests run: 4, Failures: 0, Errors: 0, Skipped: 0

[INFO]                                                                         
[INFO] ------------------------------------------------------------------------
[INFO] Building Apache CloudStack Plugin - User Authenticator Plain Text 4.5.0-SNAPSHOT
[INFO] ------------------------------------------------------------------------
[INFO] 
[INFO] --- maven-clean-plugin:2.5:clean (default-clean) @ cloud-plugin-user-authenticator-plaintext
---
[INFO] Deleting <http://jenkins.buildacloud.org/job/build-master/ws/plugins/user-authenticators/plain-text/target>
(includes = [**/*], excludes = [])
[INFO] Deleting <http://jenkins.buildacloud.org/job/build-master/ws/plugins/user-authenticators/plain-text>
(includes = [target, dist], excludes = [])
[INFO] 
[INFO] --- maven-checkstyle-plugin:2.11:check (cloudstack-checkstyle) @ cloud-plugin-user-authenticator-plaintext
---
[INFO] Starting audit...
Audit done.

[INFO] 
[INFO] --- maven-remote-resources-plugin:1.3:process (default) @ cloud-plugin-user-authenticator-plaintext
---
[INFO] 
[INFO] --- maven-resources-plugin:2.5:resources (default-resources) @ cloud-plugin-user-authenticator-plaintext
---
[debug] execute contextualize
[INFO] Using 'UTF-8' encoding to copy filtered resources.
[INFO] Copying 2 resources
[INFO] Copying 3 resources
[INFO] 
[INFO] --- maven-compiler-plugin:2.5.1:compile (default-compile) @ cloud-plugin-user-authenticator-plaintext
---
[INFO] Compiling 1 source file to <http://jenkins.buildacloud.org/job/build-master/ws/plugins/user-authenticators/plain-text/target/classes>
[INFO] 
[INFO] --- maven-resources-plugin:2.5:testResources (default-testResources) @ cloud-plugin-user-authenticator-plaintext
---
[debug] execute contextualize
[INFO] Using 'UTF-8' encoding to copy filtered resources.
[INFO] skip non existing resourceDirectory <http://jenkins.buildacloud.org/job/build-master/ws/plugins/user-authenticators/plain-text/test/resources>
[INFO] Copying 3 resources
[INFO] 
[INFO] --- maven-compiler-plugin:2.5.1:testCompile (default-testCompile) @ cloud-plugin-user-authenticator-plaintext
---
[INFO] No sources to compile
[INFO] 
[INFO] --- maven-surefire-plugin:2.12:test (default-test) @ cloud-plugin-user-authenticator-plaintext
---
[INFO] Surefire report directory: <http://jenkins.buildacloud.org/job/build-master/ws/plugins/user-authenticators/plain-text/target/surefire-reports>

-------------------------------------------------------
 T E S T S
-------------------------------------------------------

Results :

Tests run: 0, Failures: 0, Errors: 0, Skipped: 0

[INFO]                                                                         
[INFO] ------------------------------------------------------------------------
[INFO] Building Apache CloudStack Plugin - User Authenticator SAML2 4.5.0-SNAPSHOT
[INFO] ------------------------------------------------------------------------
[INFO] 
[INFO] --- maven-clean-plugin:2.5:clean (default-clean) @ cloud-plugin-user-authenticator-saml2
---
[INFO] Deleting <http://jenkins.buildacloud.org/job/build-master/ws/plugins/user-authenticators/saml2/target>
(includes = [**/*], excludes = [])
[INFO] Deleting <http://jenkins.buildacloud.org/job/build-master/ws/plugins/user-authenticators/saml2>
(includes = [target, dist], excludes = [])
[INFO] 
[INFO] --- maven-checkstyle-plugin:2.11:check (cloudstack-checkstyle) @ cloud-plugin-user-authenticator-saml2
---
[INFO] Starting audit...
Audit done.

[INFO] 
[INFO] --- maven-remote-resources-plugin:1.3:process (default) @ cloud-plugin-user-authenticator-saml2
---
[INFO] 
[INFO] --- maven-resources-plugin:2.5:resources (default-resources) @ cloud-plugin-user-authenticator-saml2
---
[debug] execute contextualize
[INFO] Using 'UTF-8' encoding to copy filtered resources.
[INFO] Copying 2 resources
[INFO] Copying 3 resources
[INFO] 
[INFO] --- maven-compiler-plugin:2.5.1:compile (default-compile) @ cloud-plugin-user-authenticator-saml2
---
[INFO] Compiling 7 source files to <http://jenkins.buildacloud.org/job/build-master/ws/plugins/user-authenticators/saml2/target/classes>
[INFO] 
[INFO] --- maven-resources-plugin:2.5:testResources (default-testResources) @ cloud-plugin-user-authenticator-saml2
---
[debug] execute contextualize
[INFO] Using 'UTF-8' encoding to copy filtered resources.
[INFO] skip non existing resourceDirectory <http://jenkins.buildacloud.org/job/build-master/ws/plugins/user-authenticators/saml2/test/resources>
[INFO] Copying 3 resources
[INFO] 
[INFO] --- maven-compiler-plugin:2.5.1:testCompile (default-testCompile) @ cloud-plugin-user-authenticator-saml2
---
[INFO] Compiling 4 source files to <http://jenkins.buildacloud.org/job/build-master/ws/plugins/user-authenticators/saml2/target/test-classes>
[INFO] 
[INFO] --- maven-surefire-plugin:2.12:test (default-test) @ cloud-plugin-user-authenticator-saml2
---
[INFO] Surefire report directory: <http://jenkins.buildacloud.org/job/build-master/ws/plugins/user-authenticators/saml2/target/surefire-reports>

-------------------------------------------------------
 T E S T S
-------------------------------------------------------
Running org.apache.cloudstack.SAML2UserAuthenticatorTest
log4j:WARN No appenders could be found for logger (org.apache.cloudstack.saml.SAML2UserAuthenticator).
log4j:WARN Please initialize the log4j system properly.
log4j:WARN See http://logging.apache.org/log4j/1.2/faq.html#noconfig for more info.
Tests run: 2, Failures: 1, Errors: 0, Skipped: 0, Time elapsed: 0.73 sec <<< FAILURE!
Running org.apache.cloudstack.api.command.SAML2LoginAPIAuthenticatorCmdTest
[Fatal Error] :-1:-1: Premature end of file.
Tests run: 2, Failures: 0, Errors: 0, Skipped: 0, Time elapsed: 3.67 sec
Running org.apache.cloudstack.api.command.SAML2LogoutAPIAuthenticatorCmdTest
Tests run: 2, Failures: 0, Errors: 0, Skipped: 0, Time elapsed: 1.893 sec
Running org.apache.cloudstack.api.command.GetServiceProviderMetaDataCmdTest
Tests run: 2, Failures: 0, Errors: 0, Skipped: 0, Time elapsed: 0.692 sec

Results :

Failed tests:   encode(org.apache.cloudstack.SAML2UserAuthenticatorTest)

Tests run: 8, Failures: 1, Errors: 0, Skipped: 0

[INFO] ------------------------------------------------------------------------
[INFO] Reactor Summary:
[INFO] 
[INFO] Apache CloudStack Developer Tools - Checkstyle Configuration  SUCCESS [0.570s]
[INFO] Apache CloudStack ................................. SUCCESS [0.521s]
[INFO] Apache CloudStack Maven Conventions Parent ........ SUCCESS [0.950s]
[INFO] Apache CloudStack Framework - Managed Context ..... SUCCESS [2.440s]
[INFO] Apache CloudStack Utils ........................... SUCCESS [9.943s]
[INFO] Apache CloudStack Framework ....................... SUCCESS [0.037s]
[INFO] Apache CloudStack Framework - Event Notification .. SUCCESS [5.603s]
[INFO] Apache CloudStack Framework - Configuration ....... SUCCESS [3.516s]
[INFO] Apache CloudStack API ............................. SUCCESS [10.455s]
[INFO] Apache CloudStack Framework - REST ................ SUCCESS [2.211s]
[INFO] Apache CloudStack Framework - IPC ................. SUCCESS [5.021s]
[INFO] Apache CloudStack Cloud Engine .................... SUCCESS [0.036s]
[INFO] Apache CloudStack Cloud Engine API ................ SUCCESS [3.707s]
[INFO] Apache CloudStack Framework - Security ............ SUCCESS [1.912s]
[INFO] Apache CloudStack Core ............................ SUCCESS [7.684s]
[INFO] Apache CloudStack Agents .......................... SUCCESS [5.519s]
[INFO] Apache CloudStack Framework - Clustering .......... SUCCESS [2.791s]
[INFO] Apache CloudStack Framework - Event Notification .. SUCCESS [1.783s]
[INFO] Apache CloudStack Cloud Engine Schema Component ... SUCCESS [11.902s]
[INFO] Apache CloudStack Framework - Jobs ................ SUCCESS [5.004s]
[INFO] Apache CloudStack Cloud Engine Internal Components API  SUCCESS [2.758s]
[INFO] Apache CloudStack Server .......................... SUCCESS [37.154s]
[INFO] Apache CloudStack Usage Server .................... SUCCESS [5.927s]
[INFO] Apache CloudStack Cloud Engine Orchestration Component  SUCCESS [8.609s]
[INFO] Apache CloudStack Cloud Services .................. SUCCESS [0.035s]
[INFO] Apache CloudStack Secondary Storage ............... SUCCESS [0.246s]
[INFO] Apache CloudStack Secondary Storage Service ....... SUCCESS [5.056s]
[INFO] Apache CloudStack Engine Storage Component ........ SUCCESS [6.477s]
[INFO] Apache CloudStack Engine Storage Volume Component . SUCCESS [4.148s]
[INFO] Apache CloudStack Engine Storage Image Component .. SUCCESS [2.606s]
[INFO] Apache CloudStack Engine Storage Data Motion Component  SUCCESS [2.204s]
[INFO] Apache CloudStack Engine Storage Cache Component .. SUCCESS [2.259s]
[INFO] Apache CloudStack Engine Storage Snapshot Component  SUCCESS [7.963s]
[INFO] Apache CloudStack Cloud Engine API ................ SUCCESS [1.809s]
[INFO] Apache CloudStack Cloud Engine Service ............ SUCCESS [0.884s]
[INFO] Apache CloudStack Plugin POM ...................... SUCCESS [0.348s]
[INFO] Apache CloudStack Plugin - API Rate Limit ......... SUCCESS [6.601s]
[INFO] Apache CloudStack Plugin - Storage Volume default provider  SUCCESS [2.412s]
[INFO] Apache CloudStack Plugin - Storage Volume SolidFire Provider  SUCCESS [4.801s]
[INFO] Apache CloudStack Plugin - API SolidFire .......... SUCCESS [2.509s]
[INFO] Apache CloudStack Plugin - API Discovery .......... SUCCESS [4.464s]
[INFO] Apache CloudStack Plugin - ACL Static Role Based .. SUCCESS [2.176s]
[INFO] Apache CloudStack Plugin - Host Anti-Affinity Processor  SUCCESS [2.065s]
[INFO] Apache CloudStack Plugin - Explicit Dedication Processor  SUCCESS [2.311s]
[INFO] Apache CloudStack Plugin - User Concentrated Pod Deployment Planner  SUCCESS [2.113s]
[INFO] Apache CloudStack Plugin - User Dispersing Deployment Planner  SUCCESS [2.079s]
[INFO] Apache CloudStack Plugin - Implicit Dedication Planner  SUCCESS [6.604s]
[INFO] Apache CloudStack Plugin - Skip Heurestics Planner  SUCCESS [1.984s]
[INFO] Apache CloudStack Plugin - Host Allocator Random .. SUCCESS [2.123s]
[INFO] Apache CloudStack Plugin - Dedicated Resources .... SUCCESS [6.760s]
[INFO] Apache CloudStack Plugin - Hypervisor OracleVM .... SUCCESS [2.749s]
[INFO] Apache CloudStack Plugin - Open vSwitch ........... SUCCESS [2.803s]
[INFO] Apache CloudStack Plugin - Hypervisor XenServer ... SUCCESS [7.147s]
[INFO] Apache CloudStack Plugin - Hypervisor KVM ......... SUCCESS [7.025s]
[INFO] Apache CloudStack Plugin - RabbitMQ Event Bus ..... SUCCESS [1.960s]
[INFO] Apache CloudStack Plugin - In Memory Event Bus .... SUCCESS [3.573s]
[INFO] Apache CloudStack Plugin - Hypervisor Baremetal ... SUCCESS [3.632s]
[INFO] Apache CloudStack Plugin - Hypervisor UCS ......... SUCCESS [2.284s]
[INFO] Apache CloudStack Plugin - Hypervisor Hyper-V ..... SUCCESS [4.616s]
[INFO] Apache CloudStack Plugin - Network Elastic Load Balancer  SUCCESS [4.583s]
[INFO] Apache CloudStack Plugin - Network Internal Load Balancer  SUCCESS [7.217s]
[INFO] Apache CloudStack Framework - Spring Life Cycle ... SUCCESS [1.762s]
[INFO] Apache CloudStack Plugin - Network Juniper Contrail  SUCCESS [10.492s]
[INFO] Apache CloudStack Plugin - Palo Alto .............. SUCCESS [5.860s]
[INFO] Apache CloudStack Plugin - Network Netscaler ...... SUCCESS [3.247s]
[INFO] Apache CloudStack Plugin - Network Nicira NVP ..... SUCCESS [6.824s]
[INFO] Apache CloudStack Plugin - BigSwitch Virtual Network Segment  SUCCESS [4.856s]
[INFO] Apache CloudStack Plugin - Network Brocade VCS .... SUCCESS [6.757s]
[INFO] Apache CloudStack Plugin - Midokura Midonet ....... SUCCESS [5.343s]
[INFO] Apache CloudStack Plugin - Stratosphere SSP ....... SUCCESS [4.947s]
[INFO] Apache CloudStack Plugin - Network Opendaylight ... SUCCESS [4.404s]
[INFO] Apache CloudStack Plugin - Storage Allocator Random  SUCCESS [1.893s]
[INFO] Apache CloudStack Plugin - User Authenticator LDAP  SUCCESS [2.690s]
[INFO] Apache CloudStack Plugin - User Authenticator MD5 . SUCCESS [3.609s]
[INFO] Apache CloudStack Plugin - User Authenticator Plain Text  SUCCESS [1.782s]
[INFO] Apache CloudStack Plugin - User Authenticator SAML2  FAILURE [10.581s]
[INFO] Apache CloudStack Plugin - User Authenticator SHA256 Salted  SKIPPED
[INFO] Apache CloudStack Plugin - Dns Notifier Example ... SKIPPED
[INFO] Apache CloudStack Plugin - Storage Image S3 ....... SKIPPED
[INFO] Apache CloudStack Plugin - Storage Image Swift provider  SKIPPED
[INFO] Apache CloudStack Plugin - Storage Image default provider  SKIPPED
[INFO] Apache CloudStack Plugin - Storage Image sample provider  SKIPPED
[INFO] Apache CloudStack Plugin - Storage Volume Nexenta Provider  SKIPPED
[INFO] Apache CloudStack Plugin - Storage Volume CloudByte Provider  SKIPPED
[INFO] Apache CloudStack Plugin - Storage Volume sample provider  SKIPPED
[INFO] Apache CloudStack Plugin - SNMP Alerts ............ SKIPPED
[INFO] Apache CloudStack Plugin - Syslog Alerts .......... SKIPPED
[INFO] Apache CloudStack Plugin - Network VXLAN .......... SKIPPED
[INFO] Apache CloudStack Plugin - GloboDNS ............... SKIPPED
[INFO] Apache CloudStack Framework - Spring Module ....... SKIPPED
[INFO] Apache CloudStack Secondary Storage Controller .... SKIPPED
[INFO] Apache CloudStack Console Proxy - RDP Client ...... SKIPPED
[INFO] Apache CloudStack Console Proxy ................... SKIPPED
[INFO] Apache CloudStack Console Proxy - Server .......... SKIPPED
[INFO] Apache CloudStack System VM ....................... SKIPPED
[INFO] Apache CloudStack Client UI ....................... SKIPPED
[INFO] Apache CloudStack Framework - QuickCloud .......... SKIPPED
[INFO] Apache CloudStack AWS API Bridge .................. SKIPPED
[INFO] ------------------------------------------------------------------------
[INFO] BUILD FAILURE
[INFO] ------------------------------------------------------------------------
[INFO] Total time: 5:43.622s
[INFO] Finished at: Wed Sep 10 08:30:37 CEST 2014
[INFO] Final Memory: 75M/400M
[INFO] ------------------------------------------------------------------------
[ERROR] Failed to execute goal org.apache.maven.plugins:maven-surefire-plugin:2.12:test (default-test)
on project cloud-plugin-user-authenticator-saml2: There are test failures.
[ERROR] 
[ERROR] Please refer to <http://jenkins.buildacloud.org/job/build-master/ws/plugins/user-authenticators/saml2/target/surefire-reports>
for the individual test results.
[ERROR] -> [Help 1]
[ERROR] 
[ERROR] To see the full stack trace of the errors, re-run Maven with the -e switch.
[ERROR] Re-run Maven using the -X switch to enable full debug logging.
[ERROR] 
[ERROR] For more information about the errors and possible solutions, please read the following
articles:
[ERROR] [Help 1] http://cwiki.apache.org/confluence/display/MAVEN/MojoFailureException
[ERROR] 
[ERROR] After correcting the problems, you can resume the build with the command
[ERROR]   mvn <goals> -rf :cloud-plugin-user-authenticator-saml2
Build step 'Invoke top-level Maven targets' marked build as failure
Recording test results

Mime
View raw message