cloudstack-dev mailing list archives

Site index · List index
Message view « Date » · « Thread »
Top « Date » · « Thread »
From jenk...@cloudstack.org
Subject Build failed in Jenkins: cloudstack-4.3-maven-build-noredist #454
Date Tue, 26 Aug 2014 09:14:49 GMT
See <http://jenkins.buildacloud.org/job/cloudstack-4.3-maven-build-noredist/454/changes>

Changes:

[runseb] CLOUDSTACK-7405: Allow all VR urls to be accessed without trailing slash

------------------------------------------
Started by upstream project "cloudstack-4.3-maven-build" build number 562
originally caused by:
 Started by an SCM change
[EnvInject] - Loading node environment variables.
Building remotely on cloudstack-buildslave-centos6-e8b (cloudstack-buildslave-centos6) in
workspace <http://jenkins.buildacloud.org/job/cloudstack-4.3-maven-build-noredist/ws/>
Fetching changes from the remote Git repository
Fetching upstream changes from git://git.apache.org/cloudstack.git
Checking out Revision b3bfe21cf1e3c73ebdc6b597f32558b63b2fe519 (origin/4.3)
[copy-to-slave] Copying 'cloudstack-nonoss-deps.tgz', excluding nothing, from 'file:/var/lib/jenkins/userContent/'
on the master to '<http://jenkins.buildacloud.org/job/cloudstack-4.3-maven-build-noredist/ws/'>
on 'cloudstack-buildslave-centos6-e8b'.
[cloudstack-4.3-maven-build-noredist] $ /jenkins/tools/hudson.tasks.Maven_MavenInstallation/maven-3.1.1/bin/mvn
clean
[INFO] Scanning for projects...
Downloading: http://repo.maven.apache.org/maven2/org/apache/cloudstack/cloudstack/4.3.0/cloudstack-4.3.0.pom

[ERROR] The build could not read 1 project -> [Help 1]
[ERROR]   
[ERROR]   The project org.apache.cloudstack:xapi:5.6.100-1-SNAPSHOT (<http://jenkins.buildacloud.org/job/cloudstack-4.3-maven-build-noredist/ws/deps/XenServerJava/pom.xml)>
has 1 error
[ERROR]     Non-resolvable parent POM: Could not find artifact org.apache.cloudstack:cloudstack:pom:4.3.0
in central (http://repo.maven.apache.org/maven2) and 'parent.relativePath' points at wrong
local POM @ line 21, column 11 -> [Help 2]
[ERROR] 
[ERROR] To see the full stack trace of the errors, re-run Maven with the -e switch.
[ERROR] Re-run Maven using the -X switch to enable full debug logging.
[ERROR] 
[ERROR] For more information about the errors and possible solutions, please read the following
articles:
[ERROR] [Help 1] http://cwiki.apache.org/confluence/display/MAVEN/ProjectBuildingException
[ERROR] [Help 2] http://cwiki.apache.org/confluence/display/MAVEN/UnresolvableModelException
Build step 'Invoke top-level Maven targets' marked build as failure
[FINDBUGS] Skipping publisher since build result is FAILURE
Archiving artifacts

Mime
View raw message