cloudstack-dev mailing list archives

Site index · List index
Message view « Date » · « Thread »
Top « Date » · « Thread »
From jenk...@cloudstack.org
Subject Build failed in Jenkins: build-master #1295
Date Fri, 01 Aug 2014 23:38:02 GMT
See <http://jenkins.buildacloud.org/job/build-master/1295/changes>

Changes:

[sudison] CLOUDSTACK-7226: in case lun number is not provided, addprimarystorage cmd should
report error instead of NPE

------------------------------------------
[...truncated 1977 lines...]
[INFO] --- maven-surefire-plugin:2.12:test (default-test) @ cloud-engine-network ---
[INFO] Surefire report directory: <http://jenkins.buildacloud.org/job/build-master/ws/engine/network/target/surefire-reports>

-------------------------------------------------------
 T E S T S
-------------------------------------------------------

Results :

Tests run: 0, Failures: 0, Errors: 0, Skipped: 0

[INFO]                                                                         
[INFO] ------------------------------------------------------------------------
[INFO] Building Apache CloudStack Cloud Engine Service 4.5.0-SNAPSHOT
[INFO] ------------------------------------------------------------------------
[INFO] 
[INFO] --- maven-clean-plugin:2.5:clean (default-clean) @ cloud-engine-service ---
[INFO] Deleting <http://jenkins.buildacloud.org/job/build-master/ws/engine/service/target>
(includes = [**/*], excludes = [])
[INFO] Deleting <http://jenkins.buildacloud.org/job/build-master/ws/engine/service>
(includes = [target, dist], excludes = [])
[INFO] 
[INFO] --- maven-checkstyle-plugin:2.11:check (cloudstack-checkstyle) @ cloud-engine-service
---
[INFO] Starting audit...
Audit done.

[INFO] 
[INFO] --- maven-remote-resources-plugin:1.3:process (default) @ cloud-engine-service ---
[INFO] 
[INFO] --- maven-resources-plugin:2.5:resources (default-resources) @ cloud-engine-service
---
[debug] execute contextualize
[INFO] Using 'UTF-8' encoding to copy filtered resources.
[INFO] skip non existing resourceDirectory <http://jenkins.buildacloud.org/job/build-master/ws/engine/service/resources>
[INFO] Copying 3 resources
[INFO] 
[INFO] --- maven-compiler-plugin:2.5.1:compile (default-compile) @ cloud-engine-service ---
[INFO] Nothing to compile - all classes are up to date
[INFO] 
[INFO] --- maven-resources-plugin:2.5:testResources (default-testResources) @ cloud-engine-service
---
[debug] execute contextualize
[INFO] Using 'UTF-8' encoding to copy filtered resources.
[INFO] skip non existing resourceDirectory <http://jenkins.buildacloud.org/job/build-master/ws/engine/service/test/resources>
[INFO] Copying 3 resources
[INFO] 
[INFO] --- maven-compiler-plugin:2.5.1:testCompile (default-testCompile) @ cloud-engine-service
---
[INFO] No sources to compile
[INFO] 
[INFO] --- maven-surefire-plugin:2.12:test (default-test) @ cloud-engine-service ---
[INFO] Surefire report directory: <http://jenkins.buildacloud.org/job/build-master/ws/engine/service/target/surefire-reports>

-------------------------------------------------------
 T E S T S
-------------------------------------------------------

Results :

Tests run: 0, Failures: 0, Errors: 0, Skipped: 0

[INFO]                                                                         
[INFO] ------------------------------------------------------------------------
[INFO] Building Apache CloudStack Plugin POM 4.5.0-SNAPSHOT
[INFO] ------------------------------------------------------------------------
[INFO] 
[INFO] --- maven-clean-plugin:2.5:clean (default-clean) @ cloudstack-plugins ---
[INFO] Deleting <http://jenkins.buildacloud.org/job/build-master/ws/plugins/target>
(includes = [**/*], excludes = [])
[INFO] Deleting <http://jenkins.buildacloud.org/job/build-master/ws/plugins> (includes
= [target, dist], excludes = [])
[INFO] 
[INFO] --- maven-remote-resources-plugin:1.3:process (default) @ cloudstack-plugins ---
[INFO]                                                                         
[INFO] ------------------------------------------------------------------------
[INFO] Building Apache CloudStack Plugin - API Rate Limit 4.5.0-SNAPSHOT
[INFO] ------------------------------------------------------------------------
[INFO] 
[INFO] --- maven-clean-plugin:2.5:clean (default-clean) @ cloud-plugin-api-limit-account-based
---
[INFO] Deleting <http://jenkins.buildacloud.org/job/build-master/ws/plugins/api/rate-limit/target>
(includes = [**/*], excludes = [])
[INFO] Deleting <http://jenkins.buildacloud.org/job/build-master/ws/plugins/api/rate-limit>
(includes = [target, dist], excludes = [])
[INFO] 
[INFO] --- maven-checkstyle-plugin:2.11:check (cloudstack-checkstyle) @ cloud-plugin-api-limit-account-based
---
[INFO] Starting audit...
Audit done.

[INFO] 
[INFO] --- maven-remote-resources-plugin:1.3:process (default) @ cloud-plugin-api-limit-account-based
---
[INFO] 
[INFO] --- maven-resources-plugin:2.5:resources (default-resources) @ cloud-plugin-api-limit-account-based
---
[debug] execute contextualize
[INFO] Using 'UTF-8' encoding to copy filtered resources.
[INFO] Copying 2 resources
[INFO] Copying 3 resources
[INFO] 
[INFO] --- maven-compiler-plugin:2.5.1:compile (default-compile) @ cloud-plugin-api-limit-account-based
---
[INFO] Compiling 9 source files to <http://jenkins.buildacloud.org/job/build-master/ws/plugins/api/rate-limit/target/classes>
[INFO] 
[INFO] --- maven-resources-plugin:2.5:testResources (default-testResources) @ cloud-plugin-api-limit-account-based
---
[debug] execute contextualize
[INFO] Using 'UTF-8' encoding to copy filtered resources.
[INFO] skip non existing resourceDirectory <http://jenkins.buildacloud.org/job/build-master/ws/plugins/api/rate-limit/test/resources>
[INFO] Copying 3 resources
[INFO] 
[INFO] --- maven-compiler-plugin:2.5.1:testCompile (default-testCompile) @ cloud-plugin-api-limit-account-based
---
[INFO] Compiling 4 source files to <http://jenkins.buildacloud.org/job/build-master/ws/plugins/api/rate-limit/target/test-classes>
[INFO] 
[INFO] --- maven-surefire-plugin:2.12:test (default-test) @ cloud-plugin-api-limit-account-based
---
[INFO] Surefire report directory: <http://jenkins.buildacloud.org/job/build-master/ws/plugins/api/rate-limit/target/surefire-reports>

-------------------------------------------------------
 T E S T S
-------------------------------------------------------
Running org.apache.cloudstack.ratelimit.ApiRateLimitTest
log4j:WARN No appenders could be found for logger (net.sf.ehcache.config.ConfigurationFactory).
log4j:WARN Please initialize the log4j system properly.
log4j:WARN See http://logging.apache.org/log4j/1.2/faq.html#noconfig for more info.
Tests run: 7, Failures: 0, Errors: 0, Skipped: 0, Time elapsed: 2.147 sec

Results :

Tests run: 7, Failures: 0, Errors: 0, Skipped: 0

[INFO]                                                                         
[INFO] ------------------------------------------------------------------------
[INFO] Building Apache CloudStack Plugin - Storage Volume default provider 4.5.0-SNAPSHOT
[INFO] ------------------------------------------------------------------------
[INFO] 
[INFO] --- maven-clean-plugin:2.5:clean (default-clean) @ cloud-plugin-storage-volume-default
---
[INFO] Deleting <http://jenkins.buildacloud.org/job/build-master/ws/plugins/storage/volume/default/target>
(includes = [**/*], excludes = [])
[INFO] Deleting <http://jenkins.buildacloud.org/job/build-master/ws/plugins/storage/volume/default>
(includes = [target, dist], excludes = [])
[INFO] 
[INFO] --- maven-checkstyle-plugin:2.11:check (cloudstack-checkstyle) @ cloud-plugin-storage-volume-default
---
[INFO] Starting audit...
<http://jenkins.buildacloud.org/job/build-master/ws/plugins/storage/volume/default/src/org/apache/cloudstack/storage/datastore/lifecycle/CloudStackPrimaryDataStoreLifeCycleImpl.java>:49:8:
Unused import - com.cloud.exception.DiscoveryException.
<http://jenkins.buildacloud.org/job/build-master/ws/plugins/storage/volume/default/src/org/apache/cloudstack/storage/datastore/lifecycle/CloudStackPrimaryDataStoreLifeCycleImpl.java>:62:8:
Unused import - com.cloud.storage.StoragePoolDiscoverer.
Audit done.

[INFO] ------------------------------------------------------------------------
[INFO] Reactor Summary:
[INFO] 
[INFO] Apache CloudStack Developer Tools - Checkstyle Configuration  SUCCESS [0.592s]
[INFO] Apache CloudStack ................................. SUCCESS [0.523s]
[INFO] Apache CloudStack Maven Conventions Parent ........ SUCCESS [1.079s]
[INFO] Apache CloudStack Framework - Managed Context ..... SUCCESS [2.638s]
[INFO] Apache CloudStack Utils ........................... SUCCESS [9.491s]
[INFO] Apache CloudStack Framework ....................... SUCCESS [0.043s]
[INFO] Apache CloudStack Framework - Event Notification .. SUCCESS [5.495s]
[INFO] Apache CloudStack Framework - Configuration ....... SUCCESS [3.323s]
[INFO] Apache CloudStack API ............................. SUCCESS [10.396s]
[INFO] Apache CloudStack Framework - REST ................ SUCCESS [2.181s]
[INFO] Apache CloudStack Framework - IPC ................. SUCCESS [4.838s]
[INFO] Apache CloudStack Cloud Engine .................... SUCCESS [0.033s]
[INFO] Apache CloudStack Cloud Engine API ................ SUCCESS [3.586s]
[INFO] Apache CloudStack Framework - Security ............ SUCCESS [1.832s]
[INFO] Apache CloudStack Core ............................ SUCCESS [7.609s]
[INFO] Apache CloudStack Agents .......................... SUCCESS [4.479s]
[INFO] Apache CloudStack Framework - Clustering .......... SUCCESS [2.375s]
[INFO] Apache CloudStack Framework - Event Notification .. SUCCESS [1.458s]
[INFO] Apache CloudStack Cloud Engine Schema Component ... SUCCESS [9.986s]
[INFO] Apache CloudStack Framework - Jobs ................ SUCCESS [3.926s]
[INFO] Apache CloudStack Cloud Engine Internal Components API  SUCCESS [2.447s]
[INFO] Apache CloudStack Server .......................... SUCCESS [31.049s]
[INFO] Apache CloudStack Usage Server .................... SUCCESS [4.822s]
[INFO] Apache CloudStack Cloud Engine Orchestration Component  SUCCESS [7.175s]
[INFO] Apache CloudStack Cloud Services .................. SUCCESS [0.029s]
[INFO] Apache CloudStack Secondary Storage ............... SUCCESS [0.244s]
[INFO] Apache CloudStack Secondary Storage Service ....... SUCCESS [3.907s]
[INFO] Apache CloudStack Engine Storage Component ........ SUCCESS [5.201s]
[INFO] Apache CloudStack Engine Storage Volume Component . SUCCESS [3.452s]
[INFO] Apache CloudStack Engine Storage Image Component .. SUCCESS [2.314s]
[INFO] Apache CloudStack Engine Storage Data Motion Component  SUCCESS [2.016s]
[INFO] Apache CloudStack Engine Storage Cache Component .. SUCCESS [1.909s]
[INFO] Apache CloudStack Engine Storage Snapshot Component  SUCCESS [5.738s]
[INFO] Apache CloudStack Cloud Engine API ................ SUCCESS [1.533s]
[INFO] Apache CloudStack Cloud Engine Service ............ SUCCESS [0.698s]
[INFO] Apache CloudStack Plugin POM ...................... SUCCESS [0.232s]
[INFO] Apache CloudStack Plugin - API Rate Limit ......... SUCCESS [5.586s]
[INFO] Apache CloudStack Plugin - Storage Volume default provider  FAILURE [0.161s]
[INFO] Apache CloudStack Plugin - Storage Volume SolidFire Provider  SKIPPED
[INFO] Apache CloudStack Plugin - API SolidFire .......... SKIPPED
[INFO] Apache CloudStack Plugin - API Discovery .......... SKIPPED
[INFO] Apache CloudStack Plugin - ACL Static Role Based .. SKIPPED
[INFO] Apache CloudStack Plugin - Host Anti-Affinity Processor  SKIPPED
[INFO] Apache CloudStack Plugin - Explicit Dedication Processor  SKIPPED
[INFO] Apache CloudStack Plugin - User Concentrated Pod Deployment Planner  SKIPPED
[INFO] Apache CloudStack Plugin - User Dispersing Deployment Planner  SKIPPED
[INFO] Apache CloudStack Plugin - Implicit Dedication Planner  SKIPPED
[INFO] Apache CloudStack Plugin - Skip Heurestics Planner  SKIPPED
[INFO] Apache CloudStack Plugin - Host Allocator Random .. SKIPPED
[INFO] Apache CloudStack Plugin - Dedicated Resources .... SKIPPED
[INFO] Apache CloudStack Plugin - Hypervisor OracleVM .... SKIPPED
[INFO] Apache CloudStack Plugin - Open vSwitch ........... SKIPPED
[INFO] Apache CloudStack Plugin - Hypervisor XenServer ... SKIPPED
[INFO] Apache CloudStack Plugin - Hypervisor KVM ......... SKIPPED
[INFO] Apache CloudStack Plugin - RabbitMQ Event Bus ..... SKIPPED
[INFO] Apache CloudStack Plugin - In Memory Event Bus .... SKIPPED
[INFO] Apache CloudStack Plugin - Hypervisor Baremetal ... SKIPPED
[INFO] Apache CloudStack Plugin - Hypervisor UCS ......... SKIPPED
[INFO] Apache CloudStack Plugin - Hypervisor Hyper-V ..... SKIPPED
[INFO] Apache CloudStack Plugin - Network Elastic Load Balancer  SKIPPED
[INFO] Apache CloudStack Plugin - Network Internal Load Balancer  SKIPPED
[INFO] Apache CloudStack Framework - Spring Life Cycle ... SKIPPED
[INFO] Apache CloudStack Plugin - Network Juniper Contrail  SKIPPED
[INFO] Apache CloudStack Plugin - Palo Alto .............. SKIPPED
[INFO] Apache CloudStack Plugin - Network Netscaler ...... SKIPPED
[INFO] Apache CloudStack Plugin - Network Nicira NVP ..... SKIPPED
[INFO] Apache CloudStack Plugin - BigSwitch Virtual Network Segment  SKIPPED
[INFO] Apache CloudStack Plugin - Network Brocade VCS .... SKIPPED
[INFO] Apache CloudStack Plugin - Midokura Midonet ....... SKIPPED
[INFO] Apache CloudStack Plugin - Stratosphere SSP ....... SKIPPED
[INFO] Apache CloudStack Plugin - Network Opendaylight ... SKIPPED
[INFO] Apache CloudStack Plugin - Storage Allocator Random  SKIPPED
[INFO] Apache CloudStack Plugin - User Authenticator LDAP  SKIPPED
[INFO] Apache CloudStack Plugin - User Authenticator MD5 . SKIPPED
[INFO] Apache CloudStack Plugin - User Authenticator Plain Text  SKIPPED
[INFO] Apache CloudStack Plugin - User Authenticator SHA256 Salted  SKIPPED
[INFO] Apache CloudStack Plugin - Dns Notifier Example ... SKIPPED
[INFO] Apache CloudStack Plugin - Storage Image S3 ....... SKIPPED
[INFO] Apache CloudStack Plugin - Storage Image Swift provider  SKIPPED
[INFO] Apache CloudStack Plugin - Storage Image default provider  SKIPPED
[INFO] Apache CloudStack Plugin - Storage Image sample provider  SKIPPED
[INFO] Apache CloudStack Plugin - Storage Volume Nexenta Provider  SKIPPED
[INFO] Apache CloudStack Plugin - Storage Volume CloudByte Provider  SKIPPED
[INFO] Apache CloudStack Plugin - Storage Volume sample provider  SKIPPED
[INFO] Apache CloudStack Plugin - SNMP Alerts ............ SKIPPED
[INFO] Apache CloudStack Plugin - Syslog Alerts .......... SKIPPED
[INFO] Apache CloudStack Plugin - Network VXLAN .......... SKIPPED
[INFO] Apache CloudStack Framework - Spring Module ....... SKIPPED
[INFO] Apache CloudStack Secondary Storage Controller .... SKIPPED
[INFO] Apache CloudStack Console Proxy - RDP Client ...... SKIPPED
[INFO] Apache CloudStack Console Proxy ................... SKIPPED
[INFO] Apache CloudStack Console Proxy - Server .......... SKIPPED
[INFO] Apache CloudStack System VM ....................... SKIPPED
[INFO] Apache CloudStack Client UI ....................... SKIPPED
[INFO] Apache CloudStack Framework - QuickCloud .......... SKIPPED
[INFO] Apache CloudStack AWS API Bridge .................. SKIPPED
[INFO] ------------------------------------------------------------------------
[INFO] BUILD FAILURE
[INFO] ------------------------------------------------------------------------
[INFO] Total time: 2:36.327s
[INFO] Finished at: Sat Aug 02 01:37:30 CEST 2014
[INFO] Final Memory: 57M/339M
[INFO] ------------------------------------------------------------------------
[ERROR] Failed to execute goal org.apache.maven.plugins:maven-checkstyle-plugin:2.11:check
(cloudstack-checkstyle) on project cloud-plugin-storage-volume-default: Failed during checkstyle
execution: There are 2 checkstyle errors. -> [Help 1]
[ERROR] 
[ERROR] To see the full stack trace of the errors, re-run Maven with the -e switch.
[ERROR] Re-run Maven using the -X switch to enable full debug logging.
[ERROR] 
[ERROR] For more information about the errors and possible solutions, please read the following
articles:
[ERROR] [Help 1] http://cwiki.apache.org/confluence/display/MAVEN/MojoExecutionException
[ERROR] 
[ERROR] After correcting the problems, you can resume the build with the command
[ERROR]   mvn <goals> -rf :cloud-plugin-storage-volume-default
Build step 'Invoke top-level Maven targets' marked build as failure
Recording test results

Mime
View raw message