cloudstack-dev mailing list archives

Site index · List index
Message view « Date » · « Thread »
Top « Date » · « Thread »
From jenk...@cloudstack.org
Subject Build failed in Jenkins: simulator-singlerun #188
Date Mon, 25 Aug 2014 04:21:47 GMT
See <http://jenkins.buildacloud.org/job/simulator-singlerun/188/changes>

Changes:

[girish] CLOUDSTACK-7413: Adding required_hardware tag to regression test cases so that the
test cases are picked up by simulator accordingly

------------------------------------------
[...truncated 7396 lines...]
-------------------------------------------------------
Running com.cloud.consoleproxy.ConsoleProxyRdpClientTest
Tests run: 3, Failures: 0, Errors: 0, Skipped: 0, Time elapsed: 0.168 sec

Results :

Tests run: 3, Failures: 0, Errors: 0, Skipped: 0

[INFO] 
[INFO] --- maven-jar-plugin:2.4:jar (default-jar) @ cloud-console-proxy ---
[INFO] Building jar: <http://jenkins.buildacloud.org/job/simulator-singlerun/ws/services/console-proxy/server/target/cloud-console-proxy-4.5.0-SNAPSHOT.jar>
[INFO] 
[INFO] --- maven-site-plugin:3.3:attach-descriptor (attach-descriptor) @ cloud-console-proxy
---
[INFO] 
[INFO] --- maven-install-plugin:2.3.1:install (default-install) @ cloud-console-proxy ---
[INFO] Installing <http://jenkins.buildacloud.org/job/simulator-singlerun/ws/services/console-proxy/server/target/cloud-console-proxy-4.5.0-SNAPSHOT.jar>
to /var/lib/jenkins/.m2/repository/org/apache/cloudstack/cloud-console-proxy/4.5.0-SNAPSHOT/cloud-console-proxy-4.5.0-SNAPSHOT.jar
[INFO] Installing <http://jenkins.buildacloud.org/job/simulator-singlerun/ws/services/console-proxy/server/pom.xml>
to /var/lib/jenkins/.m2/repository/org/apache/cloudstack/cloud-console-proxy/4.5.0-SNAPSHOT/cloud-console-proxy-4.5.0-SNAPSHOT.pom
[INFO]                                                                         
[INFO] ------------------------------------------------------------------------
[INFO] Building Apache CloudStack System VM 4.5.0-SNAPSHOT
[INFO] ------------------------------------------------------------------------
[INFO] 
[INFO] --- maven-clean-plugin:2.5:clean (default-clean) @ cloud-systemvm ---
[INFO] Deleting <http://jenkins.buildacloud.org/job/simulator-singlerun/ws/systemvm/target>
(includes = [**/*], excludes = [])
[INFO] Deleting <http://jenkins.buildacloud.org/job/simulator-singlerun/ws/systemvm/dist>
(includes = [**/*], excludes = [])
[INFO] Deleting <http://jenkins.buildacloud.org/job/simulator-singlerun/ws/systemvm>
(includes = [target, dist], excludes = [])
[INFO] 
[INFO] --- maven-checkstyle-plugin:2.11:check (cloudstack-checkstyle) @ cloud-systemvm ---
[INFO] Starting audit...
Audit done.

[INFO] 
[INFO] --- maven-antrun-plugin:1.7:run (build-cloud-scripts) @ cloud-systemvm ---
[INFO] Executing tasks

main:
    [mkdir] Created dir: <http://jenkins.buildacloud.org/job/simulator-singlerun/ws/systemvm/dist>
    [mkdir] Created dir: <http://jenkins.buildacloud.org/job/simulator-singlerun/ws/systemvm/target/build-patch>
    [mkdir] Created dir: <http://jenkins.buildacloud.org/job/simulator-singlerun/ws/systemvm/target/build-patch/usr/sbin>
     [copy] Copying 105 files to <http://jenkins.buildacloud.org/job/simulator-singlerun/ws/systemvm/target/build-patch>
     [copy] Copying 3 files to <http://jenkins.buildacloud.org/job/simulator-singlerun/ws/systemvm/target/build-patch/usr/sbin>
      [tar] Building tar: <http://jenkins.buildacloud.org/job/simulator-singlerun/ws/systemvm/target/patch.tar>
     [gzip] Building: <http://jenkins.buildacloud.org/job/simulator-singlerun/ws/systemvm/dist/cloud-scripts.tgz>
   [delete] Deleting directory <http://jenkins.buildacloud.org/job/simulator-singlerun/ws/systemvm/target/build-patch>
   [delete] Deleting: <http://jenkins.buildacloud.org/job/simulator-singlerun/ws/systemvm/target/patch.tar>
[INFO] Executed tasks
[INFO] 
[INFO] --- maven-remote-resources-plugin:1.3:process (default) @ cloud-systemvm ---
[INFO] 
[INFO] --- maven-site-plugin:3.3:attach-descriptor (attach-descriptor) @ cloud-systemvm ---
[INFO] 
[INFO] --- maven-assembly-plugin:2.2.1:single (make-systemvm) @ cloud-systemvm ---
[INFO] Reading assembly descriptor: systemvm-descriptor.xml
[WARNING] Cannot include project artifact: org.apache.cloudstack:cloud-systemvm:pom:4.5.0-SNAPSHOT;
it doesn't have an associated file or directory.
[INFO] Building zip: <http://jenkins.buildacloud.org/job/simulator-singlerun/ws/systemvm/target/systemvm.zip>
[INFO] 
[INFO] --- maven-resources-plugin:2.5:copy-resources (copy-resources) @ cloud-systemvm ---
[debug] execute contextualize
[INFO] Using 'UTF-8' encoding to copy filtered resources.
[INFO] Copying 1 resource
[INFO] Copying 1 resource
[INFO] 
[INFO] --- exec-maven-plugin:1.2.1:exec (default) @ cloud-systemvm ---
[INFO] 
[INFO] --- maven-install-plugin:2.3.1:install (default-install) @ cloud-systemvm ---
[INFO] Installing <http://jenkins.buildacloud.org/job/simulator-singlerun/ws/systemvm/pom.xml>
to /var/lib/jenkins/.m2/repository/org/apache/cloudstack/cloud-systemvm/4.5.0-SNAPSHOT/cloud-systemvm-4.5.0-SNAPSHOT.pom
[INFO] Installing <http://jenkins.buildacloud.org/job/simulator-singlerun/ws/systemvm/target/systemvm.zip>
to /var/lib/jenkins/.m2/repository/org/apache/cloudstack/cloud-systemvm/4.5.0-SNAPSHOT/cloud-systemvm-4.5.0-SNAPSHOT.zip
[INFO]                                                                         
[INFO] ------------------------------------------------------------------------
[INFO] Building Apache CloudStack Client UI 4.5.0-SNAPSHOT
[INFO] ------------------------------------------------------------------------
[WARNING] Failure to transfer net.juniper.contrail:juniper-contrail-api:1.0-SNAPSHOT/maven-metadata.xml
from http://repository.apache.org/snapshots was cached in the local repository, resolution
will not be reattempted until the update interval of apache.snapshots has elapsed or updates
are forced. Original error: Could not transfer metadata net.juniper.contrail:juniper-contrail-api:1.0-SNAPSHOT/maven-metadata.xml
from/to apache.snapshots (http://repository.apache.org/snapshots): Failed to transfer file:
http://repository.apache.org/snapshots/net/juniper/contrail/juniper-contrail-api/1.0-SNAPSHOT/maven-metadata.xml.
Return code is: 502 , ReasonPhrase:Proxy Error.
[INFO] 
[INFO] --- maven-clean-plugin:2.5:clean (default-clean) @ cloud-client-ui ---
[INFO] Deleting <http://jenkins.buildacloud.org/job/simulator-singlerun/ws/client/target>
(includes = [**/*], excludes = [])
[INFO] Deleting <http://jenkins.buildacloud.org/job/simulator-singlerun/ws/client> (includes
= [target, dist], excludes = [])
[INFO] 
[INFO] --- maven-remote-resources-plugin:1.3:process (default) @ cloud-client-ui ---
[WARNING] Failure to transfer net.juniper.contrail:juniper-contrail-api:1.0-SNAPSHOT/maven-metadata.xml
from http://repository.apache.org/snapshots was cached in the local repository, resolution
will not be reattempted until the update interval of apache.snapshots has elapsed or updates
are forced. Original error: Could not transfer metadata net.juniper.contrail:juniper-contrail-api:1.0-SNAPSHOT/maven-metadata.xml
from/to apache.snapshots (http://repository.apache.org/snapshots): Failed to transfer file:
http://repository.apache.org/snapshots/net/juniper/contrail/juniper-contrail-api/1.0-SNAPSHOT/maven-metadata.xml.
Return code is: 502 , ReasonPhrase:Proxy Error.
[WARNING] Missing POM for org.libvirt:libvirt:jar:0.5.1
[WARNING] Missing POM for org.libvirt:libvirt:jar:0.5.1
Downloading: http://repo.maven.apache.org/maven2/org/midonet/midonet-client/1.1.0/midonet-client-1.1.0.pom
            
[WARNING] Failure to transfer net.juniper.contrail:juniper-contrail-api:1.0-SNAPSHOT/maven-metadata.xml
from http://repository.apache.org/snapshots was cached in the local repository, resolution
will not be reattempted until the update interval of apache.snapshots has elapsed or updates
are forced. Original error: Could not transfer metadata net.juniper.contrail:juniper-contrail-api:1.0-SNAPSHOT/maven-metadata.xml
from/to apache.snapshots (http://repository.apache.org/snapshots): Failed to transfer file:
http://repository.apache.org/snapshots/net/juniper/contrail/juniper-contrail-api/1.0-SNAPSHOT/maven-metadata.xml.
Return code is: 502 , ReasonPhrase:Proxy Error.
Downloading: http://repository.apache.org/snapshots/net/juniper/contrail/juniper-contrail-api/1.0-SNAPSHOT/juniper-contrail-api-1.0-SNAPSHOT.pom
            
[INFO] ------------------------------------------------------------------------
[INFO] Reactor Summary:
[INFO] 
[INFO] Apache CloudStack Developer Tools - Checkstyle Configuration  SUCCESS [26.571s]
[INFO] Apache CloudStack ................................. SUCCESS [21.264s]
[INFO] Apache CloudStack Maven Conventions Parent ........ SUCCESS [11.733s]
[INFO] Apache CloudStack Framework - Managed Context ..... SUCCESS [12.339s]
[INFO] Apache CloudStack Utils ........................... SUCCESS [51.423s]
[INFO] Apache CloudStack Framework ....................... SUCCESS [0.107s]
[INFO] Apache CloudStack Framework - Event Notification .. SUCCESS [15.279s]
[INFO] Apache CloudStack Framework - Configuration ....... SUCCESS [16.884s]
[INFO] Apache CloudStack API ............................. SUCCESS [1:03.191s]
[INFO] Apache CloudStack Framework - REST ................ SUCCESS [6.046s]
[INFO] Apache CloudStack Framework - IPC ................. SUCCESS [11.655s]
[INFO] Apache CloudStack Cloud Engine .................... SUCCESS [0.096s]
[INFO] Apache CloudStack Cloud Engine API ................ SUCCESS [8.924s]
[INFO] Apache CloudStack Framework - Security ............ SUCCESS [4.330s]
[INFO] Apache CloudStack Core ............................ SUCCESS [40.337s]
[INFO] Apache CloudStack Agents .......................... SUCCESS [14.520s]
[INFO] Apache CloudStack Framework - Clustering .......... SUCCESS [5.971s]
[INFO] Apache CloudStack Framework - Event Notification .. SUCCESS [8.122s]
[INFO] Apache CloudStack Cloud Engine Schema Component ... SUCCESS [42.571s]
[INFO] Apache CloudStack Framework - Jobs ................ SUCCESS [14.298s]
[INFO] Apache CloudStack Cloud Engine Internal Components API  SUCCESS [8.685s]
[INFO] Apache CloudStack Server .......................... SUCCESS [1:41.244s]
[INFO] Apache CloudStack Usage Server .................... SUCCESS [13.371s]
[INFO] Apache CloudStack Cloud Engine Orchestration Component  SUCCESS [16.319s]
[INFO] Apache CloudStack Cloud Services .................. SUCCESS [0.153s]
[INFO] Apache CloudStack Secondary Storage ............... SUCCESS [1.035s]
[INFO] Apache CloudStack Secondary Storage Service ....... SUCCESS [8.758s]
[INFO] Apache CloudStack Engine Storage Component ........ SUCCESS [12.217s]
[INFO] Apache CloudStack Engine Storage Volume Component . SUCCESS [7.153s]
[INFO] Apache CloudStack Engine Storage Image Component .. SUCCESS [5.130s]
[INFO] Apache CloudStack Engine Storage Data Motion Component  SUCCESS [3.809s]
[INFO] Apache CloudStack Engine Storage Cache Component .. SUCCESS [3.842s]
[INFO] Apache CloudStack Engine Storage Snapshot Component  SUCCESS [12.155s]
[INFO] Apache CloudStack Cloud Engine API ................ SUCCESS [3.030s]
[INFO] Apache CloudStack Cloud Engine Service ............ SUCCESS [9.015s]
[INFO] Apache CloudStack Plugin POM ...................... SUCCESS [0.746s]
[INFO] Apache CloudStack Plugin - API Rate Limit ......... SUCCESS [9.913s]
[INFO] Apache CloudStack Plugin - Storage Volume default provider  SUCCESS [4.109s]
[INFO] Apache CloudStack Plugin - Storage Volume SolidFire Provider  SUCCESS [7.830s]
[INFO] Apache CloudStack Plugin - API SolidFire .......... SUCCESS [4.071s]
[INFO] Apache CloudStack Plugin - API Discovery .......... SUCCESS [6.442s]
[INFO] Apache CloudStack Plugin - ACL Static Role Based .. SUCCESS [3.762s]
[INFO] Apache CloudStack Plugin - Host Anti-Affinity Processor  SUCCESS [3.713s]
[INFO] Apache CloudStack Plugin - Explicit Dedication Processor  SUCCESS [3.938s]
[INFO] Apache CloudStack Plugin - User Concentrated Pod Deployment Planner  SUCCESS [3.599s]
[INFO] Apache CloudStack Plugin - User Dispersing Deployment Planner  SUCCESS [3.742s]
[INFO] Apache CloudStack Plugin - Implicit Dedication Planner  SUCCESS [13.992s]
[INFO] Apache CloudStack Plugin - Skip Heurestics Planner  SUCCESS [3.325s]
[INFO] Apache CloudStack Plugin - Host Allocator Random .. SUCCESS [3.534s]
[INFO] Apache CloudStack Plugin - Dedicated Resources .... SUCCESS [10.541s]
[INFO] Apache CloudStack Plugin - Hypervisor OracleVM .... SUCCESS [5.311s]
[INFO] Apache CloudStack Plugin - Open vSwitch ........... SUCCESS [6.099s]
[INFO] Apache CloudStack Plugin - Hypervisor XenServer ... SUCCESS [14.961s]
[INFO] Apache CloudStack Plugin - Hypervisor KVM ......... SUCCESS [19.416s]
[INFO] Apache CloudStack Plugin - RabbitMQ Event Bus ..... SUCCESS [5.010s]
[INFO] Apache CloudStack Plugin - In Memory Event Bus .... SUCCESS [5.808s]
[INFO] Apache CloudStack Plugin - Hypervisor Baremetal ... SUCCESS [7.113s]
[INFO] Apache CloudStack Plugin - Hypervisor UCS ......... SUCCESS [4.367s]
[INFO] Apache CloudStack Plugin - Hypervisor Hyper-V ..... SUCCESS [9.596s]
[INFO] Apache CloudStack Plugin - Network Elastic Load Balancer  SUCCESS [7.941s]
[INFO] Apache CloudStack Plugin - Network Internal Load Balancer  SUCCESS [13.367s]
[INFO] Apache CloudStack Framework - Spring Life Cycle ... SUCCESS [3.376s]
[INFO] Apache CloudStack Plugin - Network Juniper Contrail  SUCCESS [1:19.686s]
[INFO] Apache CloudStack Plugin - Palo Alto .............. SUCCESS [11.290s]
[INFO] Apache CloudStack Plugin - Network Netscaler ...... SUCCESS [6.898s]
[INFO] Apache CloudStack Plugin - Network Nicira NVP ..... SUCCESS [17.157s]
[INFO] Apache CloudStack Plugin - BigSwitch Virtual Network Segment  SUCCESS [8.815s]
[INFO] Apache CloudStack Plugin - Network Brocade VCS .... SUCCESS [13.659s]
[INFO] Apache CloudStack Plugin - Midokura Midonet ....... SUCCESS [12.240s]
[INFO] Apache CloudStack Plugin - Stratosphere SSP ....... SUCCESS [9.623s]
[INFO] Apache CloudStack Plugin - Network Opendaylight ... SUCCESS [9.533s]
[INFO] Apache CloudStack Plugin - Storage Allocator Random  SUCCESS [3.571s]
[INFO] Apache CloudStack Plugin - User Authenticator LDAP  SUCCESS [6.249s]
[INFO] Apache CloudStack Plugin - User Authenticator MD5 . SUCCESS [6.216s]
[INFO] Apache CloudStack Plugin - User Authenticator Plain Text  SUCCESS [3.706s]
[INFO] Apache CloudStack Plugin - User Authenticator SAML2  SUCCESS [6.495s]
[INFO] Apache CloudStack Plugin - User Authenticator SHA256 Salted  SUCCESS [7.540s]
[INFO] Apache CloudStack Plugin - Dns Notifier Example ... SUCCESS [3.064s]
[INFO] Apache CloudStack Plugin - Storage Image S3 ....... SUCCESS [3.830s]
[INFO] Apache CloudStack Plugin - Storage Image Swift provider  SUCCESS [3.100s]
[INFO] Apache CloudStack Plugin - Storage Image default provider  SUCCESS [3.342s]
[INFO] Apache CloudStack Plugin - Storage Image sample provider  SUCCESS [3.473s]
[INFO] Apache CloudStack Plugin - Storage Volume Nexenta Provider  SUCCESS [7.162s]
[INFO] Apache CloudStack Plugin - Storage Volume CloudByte Provider  SUCCESS [6.974s]
[INFO] Apache CloudStack Plugin - Storage Volume sample provider  SUCCESS [3.824s]
[INFO] Apache CloudStack Plugin - SNMP Alerts ............ SUCCESS [6.502s]
[INFO] Apache CloudStack Plugin - Syslog Alerts .......... SUCCESS [6.208s]
[INFO] Apache CloudStack Plugin - Network VXLAN .......... SUCCESS [7.638s]
[INFO] Apache CloudStack Plugin - GloboDNS ............... SUCCESS [15.878s]
[INFO] Apache CloudStack Plugin - Hypervisor Simulator ... SUCCESS [9.143s]
[INFO] Apache CloudStack Framework - Spring Module ....... SUCCESS [9.584s]
[INFO] Apache CloudStack Secondary Storage Controller .... SUCCESS [5.133s]
[INFO] Apache CloudStack Console Proxy - RDP Client ...... SUCCESS [14.756s]
[INFO] Apache CloudStack Console Proxy ................... SUCCESS [0.800s]
[INFO] Apache CloudStack Console Proxy - Server .......... SUCCESS [8.316s]
[INFO] Apache CloudStack System VM ....................... SUCCESS [10.701s]
[INFO] Apache CloudStack Client UI ....................... FAILURE [1:07.887s]
[INFO] Apache CloudStack Framework - QuickCloud .......... SKIPPED
[INFO] Apache CloudStack Test ............................ SKIPPED
[INFO] Apache CloudStack Developer Mode .................. SKIPPED
[INFO] Apache CloudStack Developer Tools ................. SKIPPED
[INFO] Apache CloudStack apidocs ......................... SKIPPED
[INFO] Apache CloudStack marvin .......................... SKIPPED
[INFO] Apache CloudStack DevCloud ........................ SKIPPED
[INFO] Apache CloudStack DevCloud-KVM .................... SKIPPED
[INFO] ------------------------------------------------------------------------
[INFO] BUILD FAILURE
[INFO] ------------------------------------------------------------------------
[INFO] Total time: 20:26.537s
[INFO] Finished at: Mon Aug 25 00:21:44 EDT 2014
[INFO] Final Memory: 78M/403M
[INFO] ------------------------------------------------------------------------
[ERROR] Failed to execute goal org.apache.maven.plugins:maven-remote-resources-plugin:1.3:process
(default) on project cloud-client-ui: Error resolving project artifact: Could not transfer
artifact net.juniper.contrail:juniper-contrail-api:pom:1.0-SNAPSHOT from/to apache.snapshots
(http://repository.apache.org/snapshots): Failed to transfer file: http://repository.apache.org/snapshots/net/juniper/contrail/juniper-contrail-api/1.0-SNAPSHOT/juniper-contrail-api-1.0-SNAPSHOT.pom.
Return code is: 502, ReasonPhrase: Proxy Error. for project net.juniper.contrail:juniper-contrail-api:jar:1.0-SNAPSHOT
-> [Help 1]
[ERROR] 
[ERROR] To see the full stack trace of the errors, re-run Maven with the -e switch.
[ERROR] Re-run Maven using the -X switch to enable full debug logging.
[ERROR] 
[ERROR] For more information about the errors and possible solutions, please read the following
articles:
[ERROR] [Help 1] http://cwiki.apache.org/confluence/display/MAVEN/MojoExecutionException
[ERROR] 
[ERROR] After correcting the problems, you can resume the build with the command
[ERROR]   mvn <goals> -rf :cloud-client-ui
Build step 'Invoke top-level Maven targets' marked build as failure
[xUnit] [INFO] - Starting to record.
[xUnit] [INFO] - Processing JUnit
[xUnit] [INFO] - [JUnit] - 1 test report file(s) were found with the pattern 'xunit.xml' relative
to '<http://jenkins.buildacloud.org/job/simulator-singlerun/ws/'> for the testing framework
'JUnit'.
[xUnit] [ERROR] - Test reports were found but not all of them are new. Did all the tests run?
  * <http://jenkins.buildacloud.org/job/simulator-singlerun/ws/xunit.xml> is 2 days
12 hr old

ERROR: Publisher org.jenkinsci.plugins.xunit.XUnitPublisher aborted due to exception
java.lang.InterruptedException: org.jenkinsci.plugins.xunit.OldTestReportException
	at hudson.FilePath.act(FilePath.java:905)
	at hudson.FilePath.act(FilePath.java:887)
	at org.jenkinsci.plugins.xunit.XUnitProcessor.performTests(XUnitProcessor.java:111)
	at org.jenkinsci.plugins.xunit.XUnitProcessor.performXUnit(XUnitProcessor.java:54)
	at org.jenkinsci.plugins.xunit.XUnitPublisher.perform(XUnitPublisher.java:88)
	at hudson.tasks.BuildStepMonitor$1.perform(BuildStepMonitor.java:20)
	at hudson.model.AbstractBuild$AbstractBuildExecution.perform(AbstractBuild.java:742)
	at hudson.model.AbstractBuild$AbstractBuildExecution.performAllBuildSteps(AbstractBuild.java:714)
	at hudson.model.Build$BuildExecution.post2(Build.java:183)
	at hudson.model.AbstractBuild$AbstractBuildExecution.post(AbstractBuild.java:663)
	at hudson.model.Run.execute(Run.java:1713)
	at hudson.model.FreeStyleBuild.run(FreeStyleBuild.java:43)
	at hudson.model.ResourceController.execute(ResourceController.java:88)
	at hudson.model.Executor.run(Executor.java:231)
Caused by: hudson.FilePath$TunneledInterruptedException: org.jenkinsci.plugins.xunit.OldTestReportException
	at hudson.FilePath$FileCallableWrapper.call(FilePath.java:2464)
	at hudson.remoting.UserRequest.perform(UserRequest.java:118)
	at hudson.remoting.UserRequest.perform(UserRequest.java:48)
	at hudson.remoting.Request$2.run(Request.java:328)
	at hudson.remoting.InterceptingExecutorService$1.call(InterceptingExecutorService.java:72)
	at java.util.concurrent.FutureTask.run(FutureTask.java:262)
	at java.util.concurrent.ThreadPoolExecutor.runWorker(ThreadPoolExecutor.java:1145)
	at java.util.concurrent.ThreadPoolExecutor$Worker.run(ThreadPoolExecutor.java:615)
	at java.lang.Thread.run(Thread.java:744)
Caused by: org.jenkinsci.plugins.xunit.OldTestReportException
	at org.jenkinsci.plugins.xunit.service.XUnitTransformer.invoke(XUnitTransformer.java:146)
	at org.jenkinsci.plugins.xunit.service.XUnitTransformer.invoke(XUnitTransformer.java:17)
	at hudson.FilePath$FileCallableWrapper.call(FilePath.java:2462)
	... 8 more

Mime
View raw message