cloudstack-dev mailing list archives

Site index · List index
Message view « Date » · « Thread »
Top « Date » · « Thread »
From jenk...@cloudstack.org
Subject Build failed in Jenkins: simulator-singlerun #28
Date Fri, 01 Aug 2014 23:37:16 GMT
See <http://jenkins.buildacloud.org/job/simulator-singlerun/28/changes>

Changes:

[sudison] CLOUDSTACK-7226: in case lun number is not provided, addprimarystorage cmd should
report error instead of NPE

------------------------------------------
[...truncated 2579 lines...]
[INFO]                                                                         
[INFO] ------------------------------------------------------------------------
[INFO] Building Apache CloudStack Plugin POM 4.5.0-SNAPSHOT
[INFO] ------------------------------------------------------------------------
[INFO] 
[INFO] --- maven-clean-plugin:2.5:clean (default-clean) @ cloudstack-plugins ---
[INFO] Deleting <http://jenkins.buildacloud.org/job/simulator-singlerun/ws/plugins/target>
(includes = [**/*], excludes = [])
[INFO] Deleting <http://jenkins.buildacloud.org/job/simulator-singlerun/ws/plugins>
(includes = [target, dist], excludes = [])
[INFO] 
[INFO] --- maven-remote-resources-plugin:1.3:process (default) @ cloudstack-plugins ---
[INFO] 
[INFO] --- maven-site-plugin:3.3:attach-descriptor (attach-descriptor) @ cloudstack-plugins
---
[INFO] 
[INFO] --- maven-install-plugin:2.3.1:install (default-install) @ cloudstack-plugins ---
[INFO] Installing <http://jenkins.buildacloud.org/job/simulator-singlerun/ws/plugins/pom.xml>
to /var/lib/jenkins/.m2/repository/org/apache/cloudstack/cloudstack-plugins/4.5.0-SNAPSHOT/cloudstack-plugins-4.5.0-SNAPSHOT.pom
[INFO]                                                                         
[INFO] ------------------------------------------------------------------------
[INFO] Building Apache CloudStack Plugin - API Rate Limit 4.5.0-SNAPSHOT
[INFO] ------------------------------------------------------------------------
[INFO] 
[INFO] --- maven-clean-plugin:2.5:clean (default-clean) @ cloud-plugin-api-limit-account-based
---
[INFO] Deleting <http://jenkins.buildacloud.org/job/simulator-singlerun/ws/plugins/api/rate-limit/target>
(includes = [**/*], excludes = [])
[INFO] Deleting <http://jenkins.buildacloud.org/job/simulator-singlerun/ws/plugins/api/rate-limit>
(includes = [target, dist], excludes = [])
[INFO] 
[INFO] --- maven-checkstyle-plugin:2.11:check (cloudstack-checkstyle) @ cloud-plugin-api-limit-account-based
---
[INFO] Starting audit...
Audit done.

[INFO] 
[INFO] --- maven-remote-resources-plugin:1.3:process (default) @ cloud-plugin-api-limit-account-based
---
[INFO] 
[INFO] --- maven-resources-plugin:2.5:resources (default-resources) @ cloud-plugin-api-limit-account-based
---
[debug] execute contextualize
[INFO] Using 'UTF-8' encoding to copy filtered resources.
[INFO] Copying 2 resources
[INFO] Copying 3 resources
[INFO] 
[INFO] --- maven-compiler-plugin:2.5.1:compile (default-compile) @ cloud-plugin-api-limit-account-based
---
[INFO] Compiling 9 source files to <http://jenkins.buildacloud.org/job/simulator-singlerun/ws/plugins/api/rate-limit/target/classes>
[INFO] 
[INFO] --- maven-resources-plugin:2.5:testResources (default-testResources) @ cloud-plugin-api-limit-account-based
---
[debug] execute contextualize
[INFO] Using 'UTF-8' encoding to copy filtered resources.
[INFO] skip non existing resourceDirectory <http://jenkins.buildacloud.org/job/simulator-singlerun/ws/plugins/api/rate-limit/test/resources>
[INFO] Copying 3 resources
[INFO] 
[INFO] --- maven-compiler-plugin:2.5.1:testCompile (default-testCompile) @ cloud-plugin-api-limit-account-based
---
[INFO] Compiling 4 source files to <http://jenkins.buildacloud.org/job/simulator-singlerun/ws/plugins/api/rate-limit/target/test-classes>
[INFO] 
[INFO] --- maven-surefire-plugin:2.12:test (default-test) @ cloud-plugin-api-limit-account-based
---
[INFO] Surefire report directory: <http://jenkins.buildacloud.org/job/simulator-singlerun/ws/plugins/api/rate-limit/target/surefire-reports>

-------------------------------------------------------
 T E S T S
-------------------------------------------------------
Running org.apache.cloudstack.ratelimit.ApiRateLimitTest
log4j:WARN No appenders could be found for logger (net.sf.ehcache.config.ConfigurationFactory).
log4j:WARN Please initialize the log4j system properly.
log4j:WARN See http://logging.apache.org/log4j/1.2/faq.html#noconfig for more info.
Tests run: 7, Failures: 0, Errors: 0, Skipped: 0, Time elapsed: 2.573 sec

Results :

Tests run: 7, Failures: 0, Errors: 0, Skipped: 0

[INFO] 
[INFO] --- maven-jar-plugin:2.4:jar (default-jar) @ cloud-plugin-api-limit-account-based ---
[INFO] Building jar: <http://jenkins.buildacloud.org/job/simulator-singlerun/ws/plugins/api/rate-limit/target/cloud-plugin-api-limit-account-based-4.5.0-SNAPSHOT.jar>
[INFO] 
[INFO] --- maven-site-plugin:3.3:attach-descriptor (attach-descriptor) @ cloud-plugin-api-limit-account-based
---
[INFO] 
[INFO] --- maven-install-plugin:2.3.1:install (default-install) @ cloud-plugin-api-limit-account-based
---
[INFO] Installing <http://jenkins.buildacloud.org/job/simulator-singlerun/ws/plugins/api/rate-limit/target/cloud-plugin-api-limit-account-based-4.5.0-SNAPSHOT.jar>
to /var/lib/jenkins/.m2/repository/org/apache/cloudstack/cloud-plugin-api-limit-account-based/4.5.0-SNAPSHOT/cloud-plugin-api-limit-account-based-4.5.0-SNAPSHOT.jar
[INFO] Installing <http://jenkins.buildacloud.org/job/simulator-singlerun/ws/plugins/api/rate-limit/pom.xml>
to /var/lib/jenkins/.m2/repository/org/apache/cloudstack/cloud-plugin-api-limit-account-based/4.5.0-SNAPSHOT/cloud-plugin-api-limit-account-based-4.5.0-SNAPSHOT.pom
[INFO]                                                                         
[INFO] ------------------------------------------------------------------------
[INFO] Building Apache CloudStack Plugin - Storage Volume default provider 4.5.0-SNAPSHOT
[INFO] ------------------------------------------------------------------------
[INFO] 
[INFO] --- maven-clean-plugin:2.5:clean (default-clean) @ cloud-plugin-storage-volume-default
---
[INFO] Deleting <http://jenkins.buildacloud.org/job/simulator-singlerun/ws/plugins/storage/volume/default/target>
(includes = [**/*], excludes = [])
[INFO] Deleting <http://jenkins.buildacloud.org/job/simulator-singlerun/ws/plugins/storage/volume/default>
(includes = [target, dist], excludes = [])
[INFO] 
[INFO] --- maven-checkstyle-plugin:2.11:check (cloudstack-checkstyle) @ cloud-plugin-storage-volume-default
---
[INFO] Starting audit...
<http://jenkins.buildacloud.org/job/simulator-singlerun/ws/plugins/storage/volume/default/src/org/apache/cloudstack/storage/datastore/lifecycle/CloudStackPrimaryDataStoreLifeCycleImpl.java>:49:8:
Unused import - com.cloud.exception.DiscoveryException.
<http://jenkins.buildacloud.org/job/simulator-singlerun/ws/plugins/storage/volume/default/src/org/apache/cloudstack/storage/datastore/lifecycle/CloudStackPrimaryDataStoreLifeCycleImpl.java>:62:8:
Unused import - com.cloud.storage.StoragePoolDiscoverer.
Audit done.

[INFO] ------------------------------------------------------------------------
[INFO] Reactor Summary:
[INFO] 
[INFO] Apache CloudStack Developer Tools - Checkstyle Configuration  SUCCESS [5.316s]
[INFO] Apache CloudStack ................................. SUCCESS [2.874s]
[INFO] Apache CloudStack Maven Conventions Parent ........ SUCCESS [2.753s]
[INFO] Apache CloudStack Framework - Managed Context ..... SUCCESS [10.482s]
[INFO] Apache CloudStack Utils ........................... SUCCESS [25.257s]
[INFO] Apache CloudStack Framework ....................... SUCCESS [0.134s]
[INFO] Apache CloudStack Framework - Event Notification .. SUCCESS [11.707s]
[INFO] Apache CloudStack Framework - Configuration ....... SUCCESS [6.094s]
[INFO] Apache CloudStack API ............................. SUCCESS [25.690s]
[INFO] Apache CloudStack Framework - REST ................ SUCCESS [4.416s]
[INFO] Apache CloudStack Framework - IPC ................. SUCCESS [8.611s]
[INFO] Apache CloudStack Cloud Engine .................... SUCCESS [0.093s]
[INFO] Apache CloudStack Cloud Engine API ................ SUCCESS [6.235s]
[INFO] Apache CloudStack Framework - Security ............ SUCCESS [3.139s]
[INFO] Apache CloudStack Core ............................ SUCCESS [35.546s]
[INFO] Apache CloudStack Agents .......................... SUCCESS [12.639s]
[INFO] Apache CloudStack Framework - Clustering .......... SUCCESS [4.343s]
[INFO] Apache CloudStack Framework - Event Notification .. SUCCESS [3.644s]
[INFO] Apache CloudStack Cloud Engine Schema Component ... SUCCESS [23.718s]
[INFO] Apache CloudStack Framework - Jobs ................ SUCCESS [9.728s]
[INFO] Apache CloudStack Cloud Engine Internal Components API  SUCCESS [4.319s]
[INFO] Apache CloudStack Server .......................... SUCCESS [1:21.814s]
[INFO] Apache CloudStack Usage Server .................... SUCCESS [14.188s]
[INFO] Apache CloudStack Cloud Engine Orchestration Component  SUCCESS [15.390s]
[INFO] Apache CloudStack Cloud Services .................. SUCCESS [0.103s]
[INFO] Apache CloudStack Secondary Storage ............... SUCCESS [0.702s]
[INFO] Apache CloudStack Secondary Storage Service ....... SUCCESS [8.496s]
[INFO] Apache CloudStack Engine Storage Component ........ SUCCESS [10.962s]
[INFO] Apache CloudStack Engine Storage Volume Component . SUCCESS [6.437s]
[INFO] Apache CloudStack Engine Storage Image Component .. SUCCESS [4.574s]
[INFO] Apache CloudStack Engine Storage Data Motion Component  SUCCESS [4.385s]
[INFO] Apache CloudStack Engine Storage Cache Component .. SUCCESS [3.601s]
[INFO] Apache CloudStack Engine Storage Snapshot Component  SUCCESS [11.674s]
[INFO] Apache CloudStack Cloud Engine API ................ SUCCESS [2.808s]
[INFO] Apache CloudStack Cloud Engine Service ............ SUCCESS [6.541s]
[INFO] Apache CloudStack Plugin POM ...................... SUCCESS [0.789s]
[INFO] Apache CloudStack Plugin - API Rate Limit ......... SUCCESS [9.783s]
[INFO] Apache CloudStack Plugin - Storage Volume default provider  FAILURE [0.351s]
[INFO] Apache CloudStack Plugin - Storage Volume SolidFire Provider  SKIPPED
[INFO] Apache CloudStack Plugin - API SolidFire .......... SKIPPED
[INFO] Apache CloudStack Plugin - API Discovery .......... SKIPPED
[INFO] Apache CloudStack Plugin - ACL Static Role Based .. SKIPPED
[INFO] Apache CloudStack Plugin - Host Anti-Affinity Processor  SKIPPED
[INFO] Apache CloudStack Plugin - Explicit Dedication Processor  SKIPPED
[INFO] Apache CloudStack Plugin - User Concentrated Pod Deployment Planner  SKIPPED
[INFO] Apache CloudStack Plugin - User Dispersing Deployment Planner  SKIPPED
[INFO] Apache CloudStack Plugin - Implicit Dedication Planner  SKIPPED
[INFO] Apache CloudStack Plugin - Skip Heurestics Planner  SKIPPED
[INFO] Apache CloudStack Plugin - Host Allocator Random .. SKIPPED
[INFO] Apache CloudStack Plugin - Dedicated Resources .... SKIPPED
[INFO] Apache CloudStack Plugin - Hypervisor OracleVM .... SKIPPED
[INFO] Apache CloudStack Plugin - Open vSwitch ........... SKIPPED
[INFO] Apache CloudStack Plugin - Hypervisor XenServer ... SKIPPED
[INFO] Apache CloudStack Plugin - Hypervisor KVM ......... SKIPPED
[INFO] Apache CloudStack Plugin - RabbitMQ Event Bus ..... SKIPPED
[INFO] Apache CloudStack Plugin - In Memory Event Bus .... SKIPPED
[INFO] Apache CloudStack Plugin - Hypervisor Baremetal ... SKIPPED
[INFO] Apache CloudStack Plugin - Hypervisor UCS ......... SKIPPED
[INFO] Apache CloudStack Plugin - Hypervisor Hyper-V ..... SKIPPED
[INFO] Apache CloudStack Plugin - Network Elastic Load Balancer  SKIPPED
[INFO] Apache CloudStack Plugin - Network Internal Load Balancer  SKIPPED
[INFO] Apache CloudStack Framework - Spring Life Cycle ... SKIPPED
[INFO] Apache CloudStack Plugin - Network Juniper Contrail  SKIPPED
[INFO] Apache CloudStack Plugin - Palo Alto .............. SKIPPED
[INFO] Apache CloudStack Plugin - Network Netscaler ...... SKIPPED
[INFO] Apache CloudStack Plugin - Network Nicira NVP ..... SKIPPED
[INFO] Apache CloudStack Plugin - BigSwitch Virtual Network Segment  SKIPPED
[INFO] Apache CloudStack Plugin - Network Brocade VCS .... SKIPPED
[INFO] Apache CloudStack Plugin - Midokura Midonet ....... SKIPPED
[INFO] Apache CloudStack Plugin - Stratosphere SSP ....... SKIPPED
[INFO] Apache CloudStack Plugin - Network Opendaylight ... SKIPPED
[INFO] Apache CloudStack Plugin - Storage Allocator Random  SKIPPED
[INFO] Apache CloudStack Plugin - User Authenticator LDAP  SKIPPED
[INFO] Apache CloudStack Plugin - User Authenticator MD5 . SKIPPED
[INFO] Apache CloudStack Plugin - User Authenticator Plain Text  SKIPPED
[INFO] Apache CloudStack Plugin - User Authenticator SHA256 Salted  SKIPPED
[INFO] Apache CloudStack Plugin - Dns Notifier Example ... SKIPPED
[INFO] Apache CloudStack Plugin - Storage Image S3 ....... SKIPPED
[INFO] Apache CloudStack Plugin - Storage Image Swift provider  SKIPPED
[INFO] Apache CloudStack Plugin - Storage Image default provider  SKIPPED
[INFO] Apache CloudStack Plugin - Storage Image sample provider  SKIPPED
[INFO] Apache CloudStack Plugin - Storage Volume Nexenta Provider  SKIPPED
[INFO] Apache CloudStack Plugin - Storage Volume CloudByte Provider  SKIPPED
[INFO] Apache CloudStack Plugin - Storage Volume sample provider  SKIPPED
[INFO] Apache CloudStack Plugin - SNMP Alerts ............ SKIPPED
[INFO] Apache CloudStack Plugin - Syslog Alerts .......... SKIPPED
[INFO] Apache CloudStack Plugin - Network VXLAN .......... SKIPPED
[INFO] Apache CloudStack Plugin - Hypervisor Simulator ... SKIPPED
[INFO] Apache CloudStack Framework - Spring Module ....... SKIPPED
[INFO] Apache CloudStack Secondary Storage Controller .... SKIPPED
[INFO] Apache CloudStack Client UI ....................... SKIPPED
[INFO] Apache CloudStack Console Proxy - RDP Client ...... SKIPPED
[INFO] Apache CloudStack Console Proxy ................... SKIPPED
[INFO] Apache CloudStack Console Proxy - Server .......... SKIPPED
[INFO] Apache CloudStack Framework - QuickCloud .......... SKIPPED
[INFO] Apache CloudStack Test ............................ SKIPPED
[INFO] Apache CloudStack Developer Mode .................. SKIPPED
[INFO] Apache CloudStack Developer Tools ................. SKIPPED
[INFO] Apache CloudStack apidocs ......................... SKIPPED
[INFO] Apache CloudStack marvin .......................... SKIPPED
[INFO] Apache CloudStack DevCloud ........................ SKIPPED
[INFO] Apache CloudStack DevCloud-KVM .................... SKIPPED
[INFO] ------------------------------------------------------------------------
[INFO] BUILD FAILURE
[INFO] ------------------------------------------------------------------------
[INFO] Total time: 6:32.517s
[INFO] Finished at: Fri Aug 01 19:37:10 EDT 2014
[INFO] Final Memory: 57M/343M
[INFO] ------------------------------------------------------------------------
[ERROR] Failed to execute goal org.apache.maven.plugins:maven-checkstyle-plugin:2.11:check
(cloudstack-checkstyle) on project cloud-plugin-storage-volume-default: Failed during checkstyle
execution: There are 2 checkstyle errors. -> [Help 1]
[ERROR] 
[ERROR] To see the full stack trace of the errors, re-run Maven with the -e switch.
[ERROR] Re-run Maven using the -X switch to enable full debug logging.
[ERROR] 
[ERROR] For more information about the errors and possible solutions, please read the following
articles:
[ERROR] [Help 1] http://cwiki.apache.org/confluence/display/MAVEN/MojoExecutionException
[ERROR] 
[ERROR] After correcting the problems, you can resume the build with the command
[ERROR]   mvn <goals> -rf :cloud-plugin-storage-volume-default
Build step 'Invoke top-level Maven targets' marked build as failure
[xUnit] [INFO] - Starting to record.
[xUnit] [INFO] - Processing JUnit
[xUnit] [INFO] - [JUnit] - 1 test report file(s) were found with the pattern 'xunit.xml' relative
to '<http://jenkins.buildacloud.org/job/simulator-singlerun/ws/'> for the testing framework
'JUnit'.
[xUnit] [ERROR] - Test reports were found but not all of them are new. Did all the tests run?
  * <http://jenkins.buildacloud.org/job/simulator-singlerun/ws/xunit.xml> is 3 hr 13
min old

ERROR: Publisher org.jenkinsci.plugins.xunit.XUnitPublisher aborted due to exception
java.lang.InterruptedException: org.jenkinsci.plugins.xunit.OldTestReportException
	at hudson.FilePath.act(FilePath.java:905)
	at hudson.FilePath.act(FilePath.java:887)
	at org.jenkinsci.plugins.xunit.XUnitProcessor.performTests(XUnitProcessor.java:111)
	at org.jenkinsci.plugins.xunit.XUnitProcessor.performXUnit(XUnitProcessor.java:54)
	at org.jenkinsci.plugins.xunit.XUnitPublisher.perform(XUnitPublisher.java:88)
	at hudson.tasks.BuildStepMonitor$1.perform(BuildStepMonitor.java:20)
	at hudson.model.AbstractBuild$AbstractBuildExecution.perform(AbstractBuild.java:742)
	at hudson.model.AbstractBuild$AbstractBuildExecution.performAllBuildSteps(AbstractBuild.java:714)
	at hudson.model.Build$BuildExecution.post2(Build.java:183)
	at hudson.model.AbstractBuild$AbstractBuildExecution.post(AbstractBuild.java:663)
	at hudson.model.Run.execute(Run.java:1713)
	at hudson.model.FreeStyleBuild.run(FreeStyleBuild.java:43)
	at hudson.model.ResourceController.execute(ResourceController.java:88)
	at hudson.model.Executor.run(Executor.java:231)
Caused by: hudson.FilePath$TunneledInterruptedException: org.jenkinsci.plugins.xunit.OldTestReportException
	at hudson.FilePath$FileCallableWrapper.call(FilePath.java:2464)
	at hudson.remoting.UserRequest.perform(UserRequest.java:118)
	at hudson.remoting.UserRequest.perform(UserRequest.java:48)
	at hudson.remoting.Request$2.run(Request.java:328)
	at hudson.remoting.InterceptingExecutorService$1.call(InterceptingExecutorService.java:72)
	at java.util.concurrent.FutureTask.run(FutureTask.java:262)
	at java.util.concurrent.ThreadPoolExecutor.runWorker(ThreadPoolExecutor.java:1145)
	at java.util.concurrent.ThreadPoolExecutor$Worker.run(ThreadPoolExecutor.java:615)
	at java.lang.Thread.run(Thread.java:744)
Caused by: org.jenkinsci.plugins.xunit.OldTestReportException
	at org.jenkinsci.plugins.xunit.service.XUnitTransformer.invoke(XUnitTransformer.java:146)
	at org.jenkinsci.plugins.xunit.service.XUnitTransformer.invoke(XUnitTransformer.java:17)
	at hudson.FilePath$FileCallableWrapper.call(FilePath.java:2462)
	... 8 more

Mime
View raw message