cloudstack-dev mailing list archives

Site index · List index
Message view « Date » · « Thread »
Top « Date » · « Thread »
Subject Build failed in Jenkins: cloudstack-4.3-maven-build-noredist #452
Date Mon, 25 Aug 2014 13:36:42 GMT
See <>


[runseb] Updating pom.xml version numbers for release 4.3.1-SNAPSHOT

Started by upstream project "cloudstack-4.3-maven-build" build number 560
originally caused by:
 Started by an SCM change
[EnvInject] - Loading node environment variables.
Building remotely on cloudstack-buildslave-centos6-e8b (cloudstack-buildslave-centos6) in
workspace <>
Cloning the remote Git repository
Cloning repository git://
Fetching upstream changes from git://
Fetching upstream changes from git://
Checking out Revision a654894dbd59b9c0674589b988e02b52d8a3dc14 (origin/4.3)
Deleting old artifacts from #449
[copy-to-slave] Copying 'cloudstack-nonoss-deps.tgz', excluding nothing, from 'file:/var/lib/jenkins/userContent/'
on the master to '<'>
on 'cloudstack-buildslave-centos6-e8b'.
[cloudstack-4.3-maven-build-noredist] $ /jenkins/tools/hudson.tasks.Maven_MavenInstallation/maven-3.1.1/bin/mvn
[INFO] Scanning for projects...

[ERROR] The build could not read 1 project -> [Help 1]
[ERROR]   The project org.apache.cloudstack:xapi:5.6.100-1-SNAPSHOT (<>
has 1 error
[ERROR]     Non-resolvable parent POM: Could not find artifact org.apache.cloudstack:cloudstack:pom:4.3.0
in central ( and 'parent.relativePath' points at wrong
local POM @ line 21, column 11 -> [Help 2]
[ERROR] To see the full stack trace of the errors, re-run Maven with the -e switch.
[ERROR] Re-run Maven using the -X switch to enable full debug logging.
[ERROR] For more information about the errors and possible solutions, please read the following
[ERROR] [Help 1]
[ERROR] [Help 2]
Build step 'Invoke top-level Maven targets' marked build as failure
[FINDBUGS] Skipping publisher since build result is FAILURE
Archiving artifacts

View raw message