cloudstack-dev mailing list archives

Site index · List index
Message view « Date » · « Thread »
Top « Date » · « Thread »
From jenk...@cloudstack.org
Subject Build failed in Jenkins: simulator-hotfix-trigger #5
Date Tue, 05 Aug 2014 09:00:02 GMT
See <http://jenkins.buildacloud.org/job/simulator-hotfix-trigger/5/>

------------------------------------------
[...truncated 6019 lines...]
[INFO] Starting audit...
Audit done.

[INFO] 
[INFO] --- maven-remote-resources-plugin:1.3:process (default) @ cloud-console-proxy ---
[INFO] 
[INFO] --- maven-resources-plugin:2.5:resources (default-resources) @ cloud-console-proxy
---
[debug] execute contextualize
[INFO] Using 'UTF-8' encoding to copy filtered resources.
[INFO] skip non existing resourceDirectory <http://jenkins.buildacloud.org/job/simulator-hotfix-trigger/ws/services/console-proxy/server/certs>
[INFO] Copying 3 resources
[INFO] 
[INFO] --- maven-compiler-plugin:2.5.1:compile (default-compile) @ cloud-console-proxy ---
[INFO] Compiling 58 source files to <http://jenkins.buildacloud.org/job/simulator-hotfix-trigger/ws/services/console-proxy/server/target/classes>
[INFO] 
[INFO] --- maven-resources-plugin:2.5:testResources (default-testResources) @ cloud-console-proxy
---
[debug] execute contextualize
[INFO] Using 'UTF-8' encoding to copy filtered resources.
[INFO] skip non existing resourceDirectory <http://jenkins.buildacloud.org/job/simulator-hotfix-trigger/ws/services/console-proxy/server/test/resources>
[INFO] Copying 3 resources
[INFO] 
[INFO] --- maven-compiler-plugin:2.5.1:testCompile (default-testCompile) @ cloud-console-proxy
---
[INFO] Compiling 1 source file to <http://jenkins.buildacloud.org/job/simulator-hotfix-trigger/ws/services/console-proxy/server/target/test-classes>
[INFO] 
[INFO] --- maven-surefire-plugin:2.12:test (default-test) @ cloud-console-proxy ---
[INFO] Surefire report directory: <http://jenkins.buildacloud.org/job/simulator-hotfix-trigger/ws/services/console-proxy/server/target/surefire-reports>

-------------------------------------------------------
 T E S T S
-------------------------------------------------------
Running com.cloud.consoleproxy.ConsoleProxyRdpClientTest
Tests run: 3, Failures: 0, Errors: 0, Skipped: 0, Time elapsed: 0.161 sec

Results :

Tests run: 3, Failures: 0, Errors: 0, Skipped: 0

[INFO] 
[INFO] --- maven-jar-plugin:2.4:jar (default-jar) @ cloud-console-proxy ---
[INFO] Building jar: <http://jenkins.buildacloud.org/job/simulator-hotfix-trigger/ws/services/console-proxy/server/target/cloud-console-proxy-4.5.0-SNAPSHOT.jar>
[INFO] 
[INFO] --- maven-site-plugin:3.3:attach-descriptor (attach-descriptor) @ cloud-console-proxy
---
[INFO] 
[INFO] --- maven-install-plugin:2.3.1:install (default-install) @ cloud-console-proxy ---
[INFO] Installing <http://jenkins.buildacloud.org/job/simulator-hotfix-trigger/ws/services/console-proxy/server/target/cloud-console-proxy-4.5.0-SNAPSHOT.jar>
to /var/lib/jenkins/.m2/repository/org/apache/cloudstack/cloud-console-proxy/4.5.0-SNAPSHOT/cloud-console-proxy-4.5.0-SNAPSHOT.jar
[INFO] Installing <http://jenkins.buildacloud.org/job/simulator-hotfix-trigger/ws/services/console-proxy/server/pom.xml>
to /var/lib/jenkins/.m2/repository/org/apache/cloudstack/cloud-console-proxy/4.5.0-SNAPSHOT/cloud-console-proxy-4.5.0-SNAPSHOT.pom
[INFO]                                                                         
[INFO] ------------------------------------------------------------------------
[INFO] Building Apache CloudStack System VM 4.5.0-SNAPSHOT
[INFO] ------------------------------------------------------------------------
[INFO] 
[INFO] --- maven-clean-plugin:2.5:clean (default-clean) @ cloud-systemvm ---
[INFO] Deleting <http://jenkins.buildacloud.org/job/simulator-hotfix-trigger/ws/systemvm>
(includes = [target, dist], excludes = [])
[INFO] 
[INFO] --- maven-checkstyle-plugin:2.11:check (cloudstack-checkstyle) @ cloud-systemvm ---
[INFO] Starting audit...
Audit done.

[INFO] 
[INFO] --- maven-antrun-plugin:1.7:run (build-cloud-scripts) @ cloud-systemvm ---
[INFO] Executing tasks

main:
    [mkdir] Created dir: <http://jenkins.buildacloud.org/job/simulator-hotfix-trigger/ws/systemvm/dist>
    [mkdir] Created dir: <http://jenkins.buildacloud.org/job/simulator-hotfix-trigger/ws/systemvm/target/build-patch>
    [mkdir] Created dir: <http://jenkins.buildacloud.org/job/simulator-hotfix-trigger/ws/systemvm/target/build-patch/usr/sbin>
     [copy] Copying 105 files to <http://jenkins.buildacloud.org/job/simulator-hotfix-trigger/ws/systemvm/target/build-patch>
     [copy] Copying 3 files to <http://jenkins.buildacloud.org/job/simulator-hotfix-trigger/ws/systemvm/target/build-patch/usr/sbin>
      [tar] Building tar: <http://jenkins.buildacloud.org/job/simulator-hotfix-trigger/ws/systemvm/target/patch.tar>
     [gzip] Building: <http://jenkins.buildacloud.org/job/simulator-hotfix-trigger/ws/systemvm/dist/cloud-scripts.tgz>
   [delete] Deleting directory <http://jenkins.buildacloud.org/job/simulator-hotfix-trigger/ws/systemvm/target/build-patch>
   [delete] Deleting: <http://jenkins.buildacloud.org/job/simulator-hotfix-trigger/ws/systemvm/target/patch.tar>
[INFO] Executed tasks
[INFO] 
[INFO] --- maven-remote-resources-plugin:1.3:process (default) @ cloud-systemvm ---
[INFO] 
[INFO] --- maven-site-plugin:3.3:attach-descriptor (attach-descriptor) @ cloud-systemvm ---
[INFO] 
[INFO] --- maven-assembly-plugin:2.2.1:single (make-systemvm) @ cloud-systemvm ---
[INFO] Reading assembly descriptor: systemvm-descriptor.xml
[WARNING] Cannot include project artifact: org.apache.cloudstack:cloud-systemvm:pom:4.5.0-SNAPSHOT;
it doesn't have an associated file or directory.
[INFO] Building zip: <http://jenkins.buildacloud.org/job/simulator-hotfix-trigger/ws/systemvm/target/systemvm.zip>
[INFO] 
[INFO] --- maven-resources-plugin:2.5:copy-resources (copy-resources) @ cloud-systemvm ---
[debug] execute contextualize
[INFO] Using 'UTF-8' encoding to copy filtered resources.
[INFO] Copying 1 resource
[INFO] Copying 1 resource
[INFO] 
[INFO] --- exec-maven-plugin:1.2.1:exec (default) @ cloud-systemvm ---
[INFO] ------------------------------------------------------------------------
[INFO] Reactor Summary:
[INFO] 
[INFO] Apache CloudStack Developer Tools - Checkstyle Configuration  SUCCESS [2.906s]
[INFO] Apache CloudStack ................................. SUCCESS [2.793s]
[INFO] Apache CloudStack Maven Conventions Parent ........ SUCCESS [1.199s]
[INFO] Apache CloudStack Framework - Managed Context ..... SUCCESS [4.999s]
[INFO] Apache CloudStack Utils ........................... SUCCESS [19.285s]
[INFO] Apache CloudStack Framework ....................... SUCCESS [0.109s]
[INFO] Apache CloudStack Framework - Event Notification .. SUCCESS [11.562s]
[INFO] Apache CloudStack Framework - Configuration ....... SUCCESS [5.641s]
[INFO] Apache CloudStack API ............................. SUCCESS [24.784s]
[INFO] Apache CloudStack Framework - REST ................ SUCCESS [3.936s]
[INFO] Apache CloudStack Framework - IPC ................. SUCCESS [8.296s]
[INFO] Apache CloudStack Cloud Engine .................... SUCCESS [0.069s]
[INFO] Apache CloudStack Cloud Engine API ................ SUCCESS [6.747s]
[INFO] Apache CloudStack Framework - Security ............ SUCCESS [3.334s]
[INFO] Apache CloudStack Core ............................ SUCCESS [34.699s]
[INFO] Apache CloudStack Agents .......................... SUCCESS [9.452s]
[INFO] Apache CloudStack Framework - Clustering .......... SUCCESS [5.187s]
[INFO] Apache CloudStack Framework - Event Notification .. SUCCESS [2.946s]
[INFO] Apache CloudStack Cloud Engine Schema Component ... SUCCESS [24.381s]
[INFO] Apache CloudStack Framework - Jobs ................ SUCCESS [9.434s]
[INFO] Apache CloudStack Cloud Engine Internal Components API  SUCCESS [5.594s]
[INFO] Apache CloudStack Server .......................... SUCCESS [1:24.564s]
[INFO] Apache CloudStack Usage Server .................... SUCCESS [13.592s]
[INFO] Apache CloudStack Cloud Engine Orchestration Component  SUCCESS [14.258s]
[INFO] Apache CloudStack Cloud Services .................. SUCCESS [0.075s]
[INFO] Apache CloudStack Secondary Storage ............... SUCCESS [0.489s]
[INFO] Apache CloudStack Secondary Storage Service ....... SUCCESS [7.431s]
[INFO] Apache CloudStack Engine Storage Component ........ SUCCESS [10.595s]
[INFO] Apache CloudStack Engine Storage Volume Component . SUCCESS [6.429s]
[INFO] Apache CloudStack Engine Storage Image Component .. SUCCESS [4.281s]
[INFO] Apache CloudStack Engine Storage Data Motion Component  SUCCESS [3.480s]
[INFO] Apache CloudStack Engine Storage Cache Component .. SUCCESS [3.897s]
[INFO] Apache CloudStack Engine Storage Snapshot Component  SUCCESS [11.750s]
[INFO] Apache CloudStack Cloud Engine API ................ SUCCESS [3.125s]
[INFO] Apache CloudStack Cloud Engine Service ............ SUCCESS [6.543s]
[INFO] Apache CloudStack Plugin POM ...................... SUCCESS [0.494s]
[INFO] Apache CloudStack Plugin - API Rate Limit ......... SUCCESS [9.109s]
[INFO] Apache CloudStack Plugin - Storage Volume default provider  SUCCESS [3.562s]
[INFO] Apache CloudStack Plugin - Storage Volume SolidFire Provider  SUCCESS [7.036s]
[INFO] Apache CloudStack Plugin - API SolidFire .......... SUCCESS [3.265s]
[INFO] Apache CloudStack Plugin - API Discovery .......... SUCCESS [6.671s]
[INFO] Apache CloudStack Plugin - ACL Static Role Based .. SUCCESS [3.134s]
[INFO] Apache CloudStack Plugin - Host Anti-Affinity Processor  SUCCESS [3.645s]
[INFO] Apache CloudStack Plugin - Explicit Dedication Processor  SUCCESS [3.492s]
[INFO] Apache CloudStack Plugin - User Concentrated Pod Deployment Planner  SUCCESS [3.308s]
[INFO] Apache CloudStack Plugin - User Dispersing Deployment Planner  SUCCESS [3.319s]
[INFO] Apache CloudStack Plugin - Implicit Dedication Planner  SUCCESS [10.258s]
[INFO] Apache CloudStack Plugin - Skip Heurestics Planner  SUCCESS [3.507s]
[INFO] Apache CloudStack Plugin - Host Allocator Random .. SUCCESS [3.650s]
[INFO] Apache CloudStack Plugin - Dedicated Resources .... SUCCESS [9.912s]
[INFO] Apache CloudStack Plugin - Hypervisor OracleVM .... SUCCESS [5.883s]
[INFO] Apache CloudStack Plugin - Open vSwitch ........... SUCCESS [5.723s]
[INFO] Apache CloudStack Plugin - Hypervisor XenServer ... SUCCESS [14.795s]
[INFO] Apache CloudStack Plugin - Hypervisor KVM ......... SUCCESS [16.322s]
[INFO] Apache CloudStack Plugin - RabbitMQ Event Bus ..... SUCCESS [3.612s]
[INFO] Apache CloudStack Plugin - In Memory Event Bus .... SUCCESS [6.319s]
[INFO] Apache CloudStack Plugin - Hypervisor Baremetal ... SUCCESS [6.386s]
[INFO] Apache CloudStack Plugin - Hypervisor UCS ......... SUCCESS [4.230s]
[INFO] Apache CloudStack Plugin - Hypervisor Hyper-V ..... SUCCESS [8.239s]
[INFO] Apache CloudStack Plugin - Network Elastic Load Balancer  SUCCESS [7.380s]
[INFO] Apache CloudStack Plugin - Network Internal Load Balancer  SUCCESS [12.881s]
[INFO] Apache CloudStack Framework - Spring Life Cycle ... SUCCESS [3.528s]
[INFO] Apache CloudStack Plugin - Network Juniper Contrail  SUCCESS [19.456s]
[INFO] Apache CloudStack Plugin - Palo Alto .............. SUCCESS [10.486s]
[INFO] Apache CloudStack Plugin - Network Netscaler ...... SUCCESS [6.845s]
[INFO] Apache CloudStack Plugin - Network Nicira NVP ..... SUCCESS [15.511s]
[INFO] Apache CloudStack Plugin - BigSwitch Virtual Network Segment  SUCCESS [8.526s]
[INFO] Apache CloudStack Plugin - Network Brocade VCS .... SUCCESS [12.673s]
[INFO] Apache CloudStack Plugin - Midokura Midonet ....... SUCCESS [10.236s]
[INFO] Apache CloudStack Plugin - Stratosphere SSP ....... SUCCESS [9.033s]
[INFO] Apache CloudStack Plugin - Network Opendaylight ... SUCCESS [9.141s]
[INFO] Apache CloudStack Plugin - Storage Allocator Random  SUCCESS [3.268s]
[INFO] Apache CloudStack Plugin - User Authenticator LDAP  SUCCESS [5.370s]
[INFO] Apache CloudStack Plugin - User Authenticator MD5 . SUCCESS [5.911s]
[INFO] Apache CloudStack Plugin - User Authenticator Plain Text  SUCCESS [3.448s]
[INFO] Apache CloudStack Plugin - User Authenticator SHA256 Salted  SUCCESS [7.181s]
[INFO] Apache CloudStack Plugin - Dns Notifier Example ... SUCCESS [3.363s]
[INFO] Apache CloudStack Plugin - Storage Image S3 ....... SUCCESS [3.399s]
[INFO] Apache CloudStack Plugin - Storage Image Swift provider  SUCCESS [3.257s]
[INFO] Apache CloudStack Plugin - Storage Image default provider  SUCCESS [3.278s]
[INFO] Apache CloudStack Plugin - Storage Image sample provider  SUCCESS [2.792s]
[INFO] Apache CloudStack Plugin - Storage Volume Nexenta Provider  SUCCESS [5.689s]
[INFO] Apache CloudStack Plugin - Storage Volume CloudByte Provider  SUCCESS [4.682s]
[INFO] Apache CloudStack Plugin - Storage Volume sample provider  SUCCESS [3.298s]
[INFO] Apache CloudStack Plugin - SNMP Alerts ............ SUCCESS [6.649s]
[INFO] Apache CloudStack Plugin - Syslog Alerts .......... SUCCESS [5.319s]
[INFO] Apache CloudStack Plugin - Network VXLAN .......... SUCCESS [7.137s]
[INFO] Apache CloudStack Plugin - Hypervisor Simulator ... SUCCESS [7.714s]
[INFO] Apache CloudStack Framework - Spring Module ....... SUCCESS [9.763s]
[INFO] Apache CloudStack Secondary Storage Controller .... SUCCESS [4.462s]
[INFO] Apache CloudStack Console Proxy - RDP Client ...... SUCCESS [12.285s]
[INFO] Apache CloudStack Console Proxy ................... SUCCESS [0.452s]
[INFO] Apache CloudStack Console Proxy - Server .......... SUCCESS [6.811s]
[INFO] Apache CloudStack System VM ....................... FAILURE [9.869s]
[INFO] Apache CloudStack Client UI ....................... SKIPPED
[INFO] Apache CloudStack Framework - QuickCloud .......... SKIPPED
[INFO] Apache CloudStack Test ............................ SKIPPED
[INFO] Apache CloudStack Developer Mode .................. SKIPPED
[INFO] Apache CloudStack Developer Tools ................. SKIPPED
[INFO] Apache CloudStack apidocs ......................... SKIPPED
[INFO] Apache CloudStack marvin .......................... SKIPPED
[INFO] Apache CloudStack DevCloud ........................ SKIPPED
[INFO] Apache CloudStack DevCloud-KVM .................... SKIPPED
[INFO] ------------------------------------------------------------------------
[INFO] BUILD FAILURE
[INFO] ------------------------------------------------------------------------
[INFO] Total time: 12:39.028s
[INFO] Finished at: Tue Aug 05 04:59:58 EDT 2014
[INFO] Final Memory: 74M/398M
[INFO] ------------------------------------------------------------------------
[ERROR] Failed to execute goal org.codehaus.mojo:exec-maven-plugin:1.2.1:exec (default) on
project cloud-systemvm: Command execution failed. Cannot run program "mkisofs" (in directory
"<http://jenkins.buildacloud.org/job/simulator-hotfix-trigger/ws/systemvm/dist")>: error=2,
No such file or directory -> [Help 1]
[ERROR] 
[ERROR] To see the full stack trace of the errors, re-run Maven with the -e switch.
[ERROR] Re-run Maven using the -X switch to enable full debug logging.
[ERROR] 
[ERROR] For more information about the errors and possible solutions, please read the following
articles:
[ERROR] [Help 1] http://cwiki.apache.org/confluence/display/MAVEN/MojoExecutionException
[ERROR] 
[ERROR] After correcting the problems, you can resume the build with the command
[ERROR]   mvn <goals> -rf :cloud-systemvm
Build step 'Invoke top-level Maven targets' marked build as failure
[xUnit] [INFO] - Starting to record.
[xUnit] [INFO] - Processing JUnit
[xUnit] [INFO] - [JUnit] - No test report file(s) were found with the pattern 'xunit.xml'
relative to '<http://jenkins.buildacloud.org/job/simulator-hotfix-trigger/ws/'> for
the testing framework 'JUnit'.  Did you enter a pattern relative to the correct directory?
 Did you generate the result report(s) for 'JUnit'?
[xUnit] [ERROR] - No test reports found for the metric 'JUnit' with the resolved pattern 'xunit.xml'.
Configuration error?.
ERROR: Publisher org.jenkinsci.plugins.xunit.XUnitPublisher aborted due to exception
java.lang.InterruptedException: org.jenkinsci.plugins.xunit.NoFoundTestException
	at hudson.FilePath.act(FilePath.java:905)
	at hudson.FilePath.act(FilePath.java:887)
	at org.jenkinsci.plugins.xunit.XUnitProcessor.performTests(XUnitProcessor.java:111)
	at org.jenkinsci.plugins.xunit.XUnitProcessor.performXUnit(XUnitProcessor.java:54)
	at org.jenkinsci.plugins.xunit.XUnitPublisher.perform(XUnitPublisher.java:88)
	at hudson.tasks.BuildStepMonitor$1.perform(BuildStepMonitor.java:20)
	at hudson.model.AbstractBuild$AbstractBuildExecution.perform(AbstractBuild.java:742)
	at hudson.model.AbstractBuild$AbstractBuildExecution.performAllBuildSteps(AbstractBuild.java:714)
	at hudson.model.Build$BuildExecution.post2(Build.java:183)
	at hudson.model.AbstractBuild$AbstractBuildExecution.post(AbstractBuild.java:663)
	at hudson.model.Run.execute(Run.java:1713)
	at hudson.model.FreeStyleBuild.run(FreeStyleBuild.java:43)
	at hudson.model.ResourceController.execute(ResourceController.java:88)
	at hudson.model.Executor.run(Executor.java:231)
Caused by: hudson.FilePath$TunneledInterruptedException: org.jenkinsci.plugins.xunit.NoFoundTestException
	at hudson.FilePath$FileCallableWrapper.call(FilePath.java:2464)
	at hudson.remoting.UserRequest.perform(UserRequest.java:118)
	at hudson.remoting.UserRequest.perform(UserRequest.java:48)
	at hudson.remoting.Request$2.run(Request.java:328)
	at hudson.remoting.InterceptingExecutorService$1.call(InterceptingExecutorService.java:72)
	at java.util.concurrent.FutureTask.run(FutureTask.java:262)
	at java.util.concurrent.ThreadPoolExecutor.runWorker(ThreadPoolExecutor.java:1145)
	at java.util.concurrent.ThreadPoolExecutor$Worker.run(ThreadPoolExecutor.java:615)
	at java.lang.Thread.run(Thread.java:744)
Caused by: org.jenkinsci.plugins.xunit.NoFoundTestException
	at org.jenkinsci.plugins.xunit.service.XUnitTransformer.invoke(XUnitTransformer.java:144)
	at org.jenkinsci.plugins.xunit.service.XUnitTransformer.invoke(XUnitTransformer.java:17)
	at hudson.FilePath$FileCallableWrapper.call(FilePath.java:2462)
	... 8 more

Mime
View raw message