cloudstack-dev mailing list archives

Site index · List index
Message view « Date » · « Thread »
Top « Date » · « Thread »
From Priyanka Deepala <priyanka.deepal...@gmail.com>
Subject Re: Test Failures
Date Thu, 24 Jul 2014 06:47:53 GMT
This is the snapshot of errors
-------------------------------------------------------
 T E S T S
-------------------------------------------------------
Running com.cloud.agent.resource.virtualnetwork.VirtualRoutingResourceTest
log4j:WARN No appenders could be found for logger
(org.springframework.test.context.junit4.SpringJUnit4ClassRunner).
log4j:WARN Please initialize the log4j system properly.
log4j:WARN See http://logging.apache.org/log4j/1.2/faq.html#noconfig for
more info.
Tests run: 20, Failures: 2, Errors: 0, Skipped: 0, Time elapsed: 1.027 sec
<<< FAILURE!
Running com.cloud.agent.transport.RequestTest
Tests run: 5, Failures: 0, Errors: 0, Skipped: 0, Time elapsed: 0.423 sec
Running com.cloud.network.HAProxyConfiguratorTest
Tests run: 1, Failures: 0, Errors: 0, Skipped: 0, Time elapsed: 0.001 sec
Running org.apache.cloudstack.api.agent.test.AgentControlAnswerTest
Tests run: 1, Failures: 0, Errors: 0, Skipped: 0, Time elapsed: 0 sec
Running org.apache.cloudstack.api.agent.test.AgentControlCommandTest
Tests run: 1, Failures: 0, Errors: 0, Skipped: 0, Time elapsed: 0 sec
Running org.apache.cloudstack.api.agent.test.AnswerTest
Tests run: 4, Failures: 0, Errors: 0, Skipped: 0, Time elapsed: 0.001 sec
Running org.apache.cloudstack.api.agent.test.AttachIsoCommandTest
Tests run: 7, Failures: 0, Errors: 0, Skipped: 0, Time elapsed: 0.001 sec
Running org.apache.cloudstack.api.agent.test.AttachVolumeAnswerTest
Tests run: 2, Failures: 0, Errors: 0, Skipped: 0, Time elapsed: 0 sec
Running org.apache.cloudstack.api.agent.test.AttachVolumeCommandTest
Tests run: 9, Failures: 0, Errors: 0, Skipped: 0, Time elapsed: 0 sec
Running org.apache.cloudstack.api.agent.test.BackupSnapshotAnswerTest
Tests run: 5, Failures: 0, Errors: 0, Skipped: 0, Time elapsed: 0.019 sec
Running org.apache.cloudstack.api.agent.test.BackupSnapshotCommandTest
Tests run: 13, Failures: 0, Errors: 0, Skipped: 0, Time elapsed: 0 sec
Running org.apache.cloudstack.api.agent.test.BumpUpPriorityCommandTest
Tests run: 2, Failures: 0, Errors: 0, Skipped: 0, Time elapsed: 0 sec
Running org.apache.cloudstack.api.agent.test.CancelCommandTest
Tests run: 3, Failures: 0, Errors: 0, Skipped: 0, Time elapsed: 0.004 sec
Running org.apache.cloudstack.api.agent.test.ChangeAgentAnswerTest
Tests run: 2, Failures: 0, Errors: 0, Skipped: 0, Time elapsed: 0.016 sec
Running org.apache.cloudstack.api.agent.test.ChangeAgentCommandTest
Tests run: 3, Failures: 0, Errors: 0, Skipped: 0, Time elapsed: 0 sec
Running org.apache.cloudstack.api.agent.test.CheckHealthAnswerTest
Tests run: 3, Failures: 0, Errors: 0, Skipped: 0, Time elapsed: 0.001 sec
Running org.apache.cloudstack.api.agent.test.CheckHealthCommandTest
Tests run: 2, Failures: 0, Errors: 0, Skipped: 0, Time elapsed: 0.001 sec
Running org.apache.cloudstack.api.agent.test.CheckNetworkAnswerTest
Tests run: 4, Failures: 0, Errors: 0, Skipped: 0, Time elapsed: 0.008 sec
Running org.apache.cloudstack.api.agent.test.CheckNetworkCommandTest
Tests run: 2, Failures: 0, Errors: 0, Skipped: 0, Time elapsed: 0.008 sec
Running org.apache.cloudstack.api.agent.test.CheckOnHostCommandTest
Tests run: 42, Failures: 0, Errors: 0, Skipped: 0, Time elapsed: 0.06 sec
Running org.apache.cloudstack.api.agent.test.SnapshotCommandTest
Tests run: 8, Failures: 0, Errors: 0, Skipped: 0, Time elapsed: 0.018 sec

Results :

Failed tests:
testFirewallRulesCommand(com.cloud.agent.resource.virtualnetwork.VirtualRoutingResourceTest):
expected:<...1.2/24:,64.10.10.10:[reverted:0:0:0:,64.10.10.10:TCP:22:80:
10.10.1.1/24-10.10.1.2/24]:,> but was:<...1.2/24:,64.10.10.10:[TCP:22:80:
10.10.1.1/24-10.10.1.2/24:,64.10.10.10:reverted:0:0:0]:,>

testAggregationCommands(com.cloud.agent.resource.virtualnetwork.VirtualRoutingResourceTest):
expected:<...1.2/24:,64.10.10.10:[reverted:0:0:0:,64.10.10.10:TCP:22:80:
10.10.1.1/24-10.10.1.2/24]:,(..)

Tests run: 139, Failures: 2, Errors: 0, Skipped: 0

[INFO]
------------------------------------------------------------------------
[INFO] Reactor Summary:
[INFO]
[INFO] Apache CloudStack Developer Tools - Checkstyle Configuration SUCCESS
[  1.713 s]
[INFO] Apache CloudStack .................................. SUCCESS [
 2.205 s]
[INFO] Apache CloudStack Maven Conventions Parent ......... SUCCESS [
 1.252 s]
[INFO] Apache CloudStack Framework - Managed Context ...... SUCCESS [
 2.646 s]
[INFO] Apache CloudStack Utils ............................ SUCCESS [
 8.078 s]
[INFO] Apache CloudStack Framework ........................ SUCCESS [
 0.214 s]
[INFO] Apache CloudStack Framework - Event Notification ... SUCCESS [
 3.856 s]
[INFO] Apache CloudStack Framework - Configuration ........ SUCCESS [
 2.083 s]
[INFO] Apache CloudStack API .............................. SUCCESS [
 7.264 s]
[INFO] Apache CloudStack Framework - REST ................. SUCCESS [
 1.256 s]
[INFO] Apache CloudStack Framework - IPC .................. SUCCESS [
 2.793 s]
[INFO] Apache CloudStack Cloud Engine ..................... SUCCESS [
 0.139 s]
[INFO] Apache CloudStack Cloud Engine API ................. SUCCESS [
 3.473 s]
[INFO] Apache CloudStack Framework - Security ............. SUCCESS [
 1.678 s]
[INFO] Apache CloudStack Core ............................. FAILURE [
 4.356 s]
[INFO] Apache CloudStack Agents ........................... SKIPPED
[INFO] Apache CloudStack Framework - Clustering ........... SKIPPED
[INFO] Apache CloudStack Framework - Event Notification ... SKIPPED
[INFO] Apache CloudStack Cloud Engine Schema Component .... SKIPPED
[INFO] Apache CloudStack Framework - Jobs ................. SKIPPED
[INFO] Apache CloudStack Cloud Engine Internal Components API SKIPPED
[INFO] Apache CloudStack Server ........................... SKIPPED
[INFO] Apache CloudStack Usage Server ..................... SKIPPED
[INFO] Apache CloudStack Cloud Engine Orchestration Component SKIPPED
[INFO] Apache CloudStack Cloud Services ................... SKIPPED
[INFO] Apache CloudStack Secondary Storage ................ SKIPPED
[INFO] Apache CloudStack Secondary Storage Service ........ SKIPPED
[INFO] Apache CloudStack Engine Storage Component ......... SKIPPED
[INFO] Apache CloudStack Engine Storage Volume Component .. SKIPPED
[INFO] Apache CloudStack Engine Storage Image Component ... SKIPPED
[INFO] Apache CloudStack Engine Storage Data Motion Component SKIPPED
[INFO] Apache CloudStack Engine Storage Cache Component ... SKIPPED
[INFO] Apache CloudStack Engine Storage Snapshot Component  SKIPPED
[INFO] Apache CloudStack Cloud Engine API ................. SKIPPED
[INFO] Apache CloudStack Cloud Engine Service ............. SKIPPED
[INFO] Apache CloudStack Plugin POM ....................... SKIPPED
[INFO] Apache CloudStack Plugin - API Rate Limit .......... SKIPPED
[INFO] Apache CloudStack Plugin - Storage Volume default provider SKIPPED
[INFO] Apache CloudStack Plugin - Storage Volume SolidFire Provider SKIPPED
[INFO] Apache CloudStack Plugin - API SolidFire ........... SKIPPED
[INFO] Apache CloudStack Plugin - API Discovery ........... SKIPPED
[INFO] Apache CloudStack Plugin - ACL Static Role Based ... SKIPPED
[INFO] Apache CloudStack Plugin - Host Anti-Affinity Processor SKIPPED
[INFO] Apache CloudStack Plugin - Explicit Dedication Processor SKIPPED
[INFO] Apache CloudStack Plugin - User Concentrated Pod Deployment Planner
SKIPPED
[INFO] Apache CloudStack Plugin - User Dispersing Deployment Planner SKIPPED
[INFO] Apache CloudStack Plugin - Implicit Dedication Planner SKIPPED
[INFO] Apache CloudStack Plugin - Skip Heurestics Planner . SKIPPED
[INFO] Apache CloudStack Plugin - Host Allocator Random ... SKIPPED
[INFO] Apache CloudStack Plugin - Dedicated Resources ..... SKIPPED
[INFO] Apache CloudStack Plugin - Hypervisor OracleVM ..... SKIPPED
[INFO] Apache CloudStack Plugin - Open vSwitch ............ SKIPPED
[INFO] Apache CloudStack Plugin - Hypervisor XenServer .... SKIPPED
[INFO] Apache CloudStack Plugin - Hypervisor KVM .......... SKIPPED
[INFO] Apache CloudStack Plugin - RabbitMQ Event Bus ...... SKIPPED
[INFO] Apache CloudStack Plugin - In Memory Event Bus ..... SKIPPED
[INFO] Apache CloudStack Plugin - Hypervisor Baremetal .... SKIPPED
[INFO] Apache CloudStack Plugin - Hypervisor UCS .......... SKIPPED
[INFO] Apache CloudStack Plugin - Hypervisor Hyper-V ...... SKIPPED
[INFO] Apache CloudStack Plugin - Network Elastic Load Balancer SKIPPED
[INFO] Apache CloudStack Plugin - Network Internal Load Balancer SKIPPED
[INFO] Apache CloudStack Framework - Spring Life Cycle .... SKIPPED
[INFO] Apache CloudStack Plugin - Network Juniper Contrail  SKIPPED
[INFO] Apache CloudStack Plugin - Palo Alto ............... SKIPPED
[INFO] Apache CloudStack Plugin - Network Netscaler ....... SKIPPED
[INFO] Apache CloudStack Plugin - Network Nicira NVP ...... SKIPPED
[INFO] Apache CloudStack Plugin - BigSwitch Virtual Network Segment SKIPPED
[INFO] Apache CloudStack Plugin - Network Brocade VCS ..... SKIPPED
[INFO] Apache CloudStack Plugin - Midokura Midonet ........ SKIPPED
[INFO] Apache CloudStack Plugin - Stratosphere SSP ........ SKIPPED
[INFO] Apache CloudStack Plugin - Network Opendaylight .... SKIPPED
[INFO] Apache CloudStack Plugin - Storage Allocator Random  SKIPPED
[INFO] Apache CloudStack Plugin - User Authenticator LDAP . SKIPPED
[INFO] Apache CloudStack Plugin - User Authenticator MD5 .. SKIPPED
[INFO] Apache CloudStack Plugin - User Authenticator Plain Text SKIPPED
[INFO] Apache CloudStack Plugin - User Authenticator SHA256 Salted SKIPPED
[INFO] Apache CloudStack Plugin - Dns Notifier Example .... SKIPPED
[INFO] Apache CloudStack Plugin - Storage Image S3 ........ SKIPPED
[INFO] Apache CloudStack Plugin - Storage Image Swift provider SKIPPED
[INFO] Apache CloudStack Plugin - Storage Image default provider SKIPPED
[INFO] Apache CloudStack Plugin - Storage Image sample provider SKIPPED
[INFO] Apache CloudStack Plugin - Storage Volume Nexenta Provider SKIPPED
[INFO] Apache CloudStack Plugin - Storage Volume CloudByte Provider SKIPPED
[INFO] Apache CloudStack Plugin - Storage Volume sample provider SKIPPED
[INFO] Apache CloudStack Plugin - SNMP Alerts ............. SKIPPED
[INFO] Apache CloudStack Plugin - Syslog Alerts ........... SKIPPED
[INFO] Apache CloudStack Plugin - Network VXLAN ........... SKIPPED
[INFO] Apache CloudStack Framework - Spring Module ........ SKIPPED
[INFO] Apache CloudStack Secondary Storage Controller ..... SKIPPED
[INFO] Apache CloudStack Console Proxy - RDP Client ....... SKIPPED
[INFO] Apache CloudStack Console Proxy .................... SKIPPED
[INFO] Apache CloudStack Console Proxy - Server ........... SKIPPED
[INFO] Apache CloudStack System VM ........................ SKIPPED
[INFO] Apache CloudStack Client UI ........................ SKIPPED
[INFO] Apache CloudStack Framework - QuickCloud ........... SKIPPED
[INFO] Apache CloudStack Test ............................. SKIPPED
[INFO] Apache CloudStack Developer Mode ................... SKIPPED
[INFO] Apache CloudStack Developer Tools .................. SKIPPED
[INFO] Apache CloudStack apidocs .......................... SKIPPED
[INFO] Apache CloudStack marvin ........................... SKIPPED
[INFO] Apache CloudStack DevCloud ......................... SKIPPED
[INFO] Apache CloudStack DevCloud-KVM ..................... SKIPPED
[INFO]
------------------------------------------------------------------------
[INFO] BUILD FAILURE
[INFO]
------------------------------------------------------------------------
[INFO] Total time: 46.715 s
[INFO] Finished at: 2014-07-24T12:03:32+05:30
[INFO] Final Memory: 49M/178M
[INFO]
------------------------------------------------------------------------
[ERROR] Failed to execute goal
org.apache.maven.plugins:maven-surefire-plugin:2.12:test (default-test) on
project cloud-core: There are test failures.
[ERROR]
[ERROR] Please refer to
C:\cygwin64\home\priya\cloudstack-oss\cloudstack\core\target\surefire-reports
for the individual test results.
[ERROR] -> [Help 1]



On Thu, Jul 24, 2014 at 11:53 AM, Daan Hoogland <daan.hoogland@gmail.com>
wrote:

> Priyanka,
>
> what branch? Did you look into the surfire-reports to find out what
> the test failures are?
>
> On Thu, Jul 24, 2014 at 7:10 AM, Priyanka Deepala
> <priyanka.deepala18@gmail.com> wrote:
> > After running mvn install -P developer,systemvm
> > Error:Failed to execute goal
> > org.apache.maven.plugins:maven-surefire-plugin:2.12:test (default-test)
> on
> > project cloud-core: There are test failures.
> > How to solve this error?
>
>
>
> --
> Daan
>

Mime
  • Unnamed multipart/alternative (inline, None, 0 bytes)
View raw message