cloudstack-dev mailing list archives

Site index · List index
Message view « Date » · « Thread »
Top « Date » · « Thread »
From jenk...@cloudstack.org
Subject Build failed in Jenkins: build-master-noredist #3173
Date Mon, 28 Jul 2014 20:15:06 GMT
See <http://jenkins.buildacloud.org/job/build-master-noredist/3173/changes>

Changes:

[anthony.xu] completed the new vmsync TODOs in the code.

------------------------------------------
[...truncated 5892 lines...]
[INFO] --- maven-resources-plugin:2.5:resources (default-resources) @ cloud-plugin-network-vsp
---
[debug] execute contextualize
[INFO] Using 'UTF-8' encoding to copy filtered resources.
[INFO] Copying 2 resources
[INFO] Copying 3 resources
[INFO] 
[INFO] --- maven-compiler-plugin:2.5.1:compile (default-compile) @ cloud-plugin-network-vsp
---
[INFO] Compiling 43 source files to <http://jenkins.buildacloud.org/job/build-master-noredist/ws/plugins/network-elements/nuage-vsp/target/classes>
[INFO] 
[INFO] --- license-maven-plugin:2.5:check (cloudstack-checklicence) @ cloud-plugin-network-vsp
---
[INFO] Checking licenses...
[INFO] 
[INFO] --- maven-resources-plugin:2.5:testResources (default-testResources) @ cloud-plugin-network-vsp
---
[debug] execute contextualize
[INFO] Using 'UTF-8' encoding to copy filtered resources.
[INFO] skip non existing resourceDirectory <http://jenkins.buildacloud.org/job/build-master-noredist/ws/plugins/network-elements/nuage-vsp/test/resources>
[INFO] Copying 3 resources
[INFO] 
[INFO] --- maven-compiler-plugin:2.5.1:testCompile (default-testCompile) @ cloud-plugin-network-vsp
---
[INFO] Compiling 5 source files to <http://jenkins.buildacloud.org/job/build-master-noredist/ws/plugins/network-elements/nuage-vsp/target/test-classes>
[INFO] 
[INFO] --- maven-surefire-plugin:2.12:test (default-test) @ cloud-plugin-network-vsp ---
[INFO] Surefire report directory: <http://jenkins.buildacloud.org/job/build-master-noredist/ws/plugins/network-elements/nuage-vsp/target/surefire-reports>

-------------------------------------------------------
 T E S T S
-------------------------------------------------------
Running com.cloud.network.element.NuageVspElementTest
log4j:WARN No appenders could be found for logger (com.cloud.network.element.NuageVspElement).
log4j:WARN Please initialize the log4j system properly.
log4j:WARN See http://logging.apache.org/log4j/1.2/faq.html#noconfig for more info.
Tests run: 6, Failures: 0, Errors: 0, Skipped: 0, Time elapsed: 0.654 sec
Running com.cloud.network.manager.NuageVspManagerTest
Tests run: 2, Failures: 0, Errors: 0, Skipped: 0, Time elapsed: 0.124 sec
Running com.cloud.network.resource.NuageVspResourceTest
Tests run: 13, Failures: 0, Errors: 0, Skipped: 0, Time elapsed: 0.044 sec
Running com.cloud.network.sync.NuageVspSyncTest
Tests run: 1, Failures: 0, Errors: 0, Skipped: 0, Time elapsed: 0.013 sec
Running com.cloud.network.guru.NuageVspGuestNetworkGuruTest
Tests run: 7, Failures: 0, Errors: 0, Skipped: 0, Time elapsed: 0.192 sec

Results :

Tests run: 29, Failures: 0, Errors: 0, Skipped: 0

[INFO] 
[INFO] --- maven-jar-plugin:2.4:jar (default-jar) @ cloud-plugin-network-vsp ---
[INFO] Building jar: <http://jenkins.buildacloud.org/job/build-master-noredist/ws/plugins/network-elements/nuage-vsp/target/cloud-plugin-network-vsp-4.5.0-SNAPSHOT.jar>
[INFO] 
[INFO] --- maven-site-plugin:3.3:attach-descriptor (attach-descriptor) @ cloud-plugin-network-vsp
---
[INFO] 
[INFO] --- maven-install-plugin:2.3.1:install (default-install) @ cloud-plugin-network-vsp
---
[INFO] Installing <http://jenkins.buildacloud.org/job/build-master-noredist/ws/plugins/network-elements/nuage-vsp/target/cloud-plugin-network-vsp-4.5.0-SNAPSHOT.jar>
to /jenkins/.m2/repository/org/apache/cloudstack/cloud-plugin-network-vsp/4.5.0-SNAPSHOT/cloud-plugin-network-vsp-4.5.0-SNAPSHOT.jar
[INFO] Installing <http://jenkins.buildacloud.org/job/build-master-noredist/ws/plugins/network-elements/nuage-vsp/pom.xml>
to /jenkins/.m2/repository/org/apache/cloudstack/cloud-plugin-network-vsp/4.5.0-SNAPSHOT/cloud-plugin-network-vsp-4.5.0-SNAPSHOT.pom
[INFO]                                                                         
[INFO] ------------------------------------------------------------------------
[INFO] Building Apache CloudStack VMware Base 4.5.0-SNAPSHOT
[INFO] ------------------------------------------------------------------------
[INFO] 
[INFO] --- maven-clean-plugin:2.5:clean (default-clean) @ cloud-vmware-base ---
[INFO] Deleting <http://jenkins.buildacloud.org/job/build-master-noredist/ws/vmware-base/target>
(includes = [**/*], excludes = [])
[INFO] Deleting <http://jenkins.buildacloud.org/job/build-master-noredist/ws/vmware-base>
(includes = [target, dist], excludes = [])
[INFO] 
[INFO] --- maven-checkstyle-plugin:2.11:check (cloudstack-checkstyle) @ cloud-vmware-base
---
[INFO] Starting audit...
Audit done.

[INFO] 
[INFO] --- maven-remote-resources-plugin:1.3:process (default) @ cloud-vmware-base ---
[INFO] 
[INFO] --- maven-resources-plugin:2.5:resources (default-resources) @ cloud-vmware-base ---
[debug] execute contextualize
[INFO] Using 'UTF-8' encoding to copy filtered resources.
[INFO] skip non existing resourceDirectory <http://jenkins.buildacloud.org/job/build-master-noredist/ws/vmware-base/resources>
[INFO] Copying 3 resources
[INFO] 
[INFO] --- maven-compiler-plugin:2.5.1:compile (default-compile) @ cloud-vmware-base ---
[INFO] Compiling 44 source files to <http://jenkins.buildacloud.org/job/build-master-noredist/ws/vmware-base/target/classes>
[INFO] 
[INFO] --- maven-resources-plugin:2.5:testResources (default-testResources) @ cloud-vmware-base
---
[debug] execute contextualize
[INFO] Using 'UTF-8' encoding to copy filtered resources.
[INFO] skip non existing resourceDirectory <http://jenkins.buildacloud.org/job/build-master-noredist/ws/vmware-base/test/resources>
[INFO] Copying 3 resources
[INFO] 
[INFO] --- maven-compiler-plugin:2.5.1:testCompile (default-testCompile) @ cloud-vmware-base
---
[INFO] Compiling 2 source files to <http://jenkins.buildacloud.org/job/build-master-noredist/ws/vmware-base/target/test-classes>
[INFO] 
[INFO] --- maven-surefire-plugin:2.12:test (default-test) @ cloud-vmware-base ---
[INFO] Surefire report directory: <http://jenkins.buildacloud.org/job/build-master-noredist/ws/vmware-base/target/surefire-reports>

-------------------------------------------------------
 T E S T S
-------------------------------------------------------

Results :

Tests run: 0, Failures: 0, Errors: 0, Skipped: 0

[INFO] 
[INFO] --- maven-jar-plugin:2.4:jar (default-jar) @ cloud-vmware-base ---
[INFO] Building jar: <http://jenkins.buildacloud.org/job/build-master-noredist/ws/vmware-base/target/cloud-vmware-base-4.5.0-SNAPSHOT.jar>
[INFO] 
[INFO] --- maven-site-plugin:3.3:attach-descriptor (attach-descriptor) @ cloud-vmware-base
---
[INFO] 
[INFO] --- maven-install-plugin:2.3.1:install (default-install) @ cloud-vmware-base ---
[INFO] Installing <http://jenkins.buildacloud.org/job/build-master-noredist/ws/vmware-base/target/cloud-vmware-base-4.5.0-SNAPSHOT.jar>
to /jenkins/.m2/repository/org/apache/cloudstack/cloud-vmware-base/4.5.0-SNAPSHOT/cloud-vmware-base-4.5.0-SNAPSHOT.jar
[INFO] Installing <http://jenkins.buildacloud.org/job/build-master-noredist/ws/vmware-base/pom.xml>
to /jenkins/.m2/repository/org/apache/cloudstack/cloud-vmware-base/4.5.0-SNAPSHOT/cloud-vmware-base-4.5.0-SNAPSHOT.pom
[INFO]                                                                         
[INFO] ------------------------------------------------------------------------
[INFO] Building Apache CloudStack Plugin - Hypervisor VMware 4.5.0-SNAPSHOT
[INFO] ------------------------------------------------------------------------
[INFO] 
[INFO] --- maven-clean-plugin:2.5:clean (default-clean) @ cloud-plugin-hypervisor-vmware ---
[INFO] Deleting <http://jenkins.buildacloud.org/job/build-master-noredist/ws/plugins/hypervisors/vmware/target>
(includes = [**/*], excludes = [])
[INFO] Deleting <http://jenkins.buildacloud.org/job/build-master-noredist/ws/plugins/hypervisors/vmware>
(includes = [target, dist], excludes = [])
[INFO] 
[INFO] --- maven-checkstyle-plugin:2.11:check (cloudstack-checkstyle) @ cloud-plugin-hypervisor-vmware
---
<http://jenkins.buildacloud.org/job/build-master-noredist/ws/plugins/hypervisors/vmware/src/com/cloud/hypervisor/vmware/resource/VmwareResource.java>:2547:27:
expecting SEMI, found ','
[INFO] Starting audit...
<http://jenkins.buildacloud.org/job/build-master-noredist/ws/plugins/hypervisors/vmware/src/com/cloud/hypervisor/vmware/resource/VmwareResource.java>:2551:13:
Got an exception - expecting EOF, found 'List'
Audit done.

[INFO] ------------------------------------------------------------------------
[INFO] Reactor Summary:
[INFO] 
[INFO] Apache CloudStack Developer Tools - Checkstyle Configuration  SUCCESS [0.883s]
[INFO] Apache CloudStack ................................. SUCCESS [1.251s]
[INFO] Apache CloudStack Maven Conventions Parent ........ SUCCESS [0.753s]
[INFO] Apache CloudStack Framework - Managed Context ..... SUCCESS [2.496s]
[INFO] Apache CloudStack Utils ........................... SUCCESS [9.607s]
[INFO] Apache CloudStack Framework ....................... SUCCESS [0.042s]
[INFO] Apache CloudStack Framework - Event Notification .. SUCCESS [5.488s]
[INFO] Apache CloudStack Framework - Configuration ....... SUCCESS [3.333s]
[INFO] Apache CloudStack API ............................. SUCCESS [11.346s]
[INFO] Apache CloudStack Framework - REST ................ SUCCESS [2.204s]
[INFO] Apache CloudStack Framework - IPC ................. SUCCESS [4.763s]
[INFO] Apache CloudStack Cloud Engine .................... SUCCESS [0.039s]
[INFO] Apache CloudStack Cloud Engine API ................ SUCCESS [3.575s]
[INFO] Apache CloudStack Framework - Security ............ SUCCESS [1.874s]
[INFO] Apache CloudStack Core ............................ SUCCESS [14.808s]
[INFO] Apache CloudStack Agents .......................... SUCCESS [4.646s]
[INFO] Apache CloudStack Framework - Clustering .......... SUCCESS [2.443s]
[INFO] Apache CloudStack Framework - Event Notification .. SUCCESS [1.461s]
[INFO] Apache CloudStack Cloud Engine Schema Component ... SUCCESS [10.453s]
[INFO] Apache CloudStack Framework - Jobs ................ SUCCESS [3.852s]
[INFO] Apache CloudStack Cloud Engine Internal Components API  SUCCESS [2.369s]
[INFO] Apache CloudStack Server .......................... SUCCESS [30.727s]
[INFO] Apache CloudStack Usage Server .................... SUCCESS [4.808s]
[INFO] Apache CloudStack Cloud Engine Orchestration Component  SUCCESS [6.701s]
[INFO] Apache CloudStack Cloud Services .................. SUCCESS [0.033s]
[INFO] Apache CloudStack Secondary Storage ............... SUCCESS [0.245s]
[INFO] Apache CloudStack Secondary Storage Service ....... SUCCESS [3.888s]
[INFO] Apache CloudStack Engine Storage Component ........ SUCCESS [4.925s]
[INFO] Apache CloudStack Engine Storage Volume Component . SUCCESS [3.383s]
[INFO] Apache CloudStack Engine Storage Image Component .. SUCCESS [2.239s]
[INFO] Apache CloudStack Engine Storage Data Motion Component  SUCCESS [1.987s]
[INFO] Apache CloudStack Engine Storage Cache Component .. SUCCESS [1.879s]
[INFO] Apache CloudStack Engine Storage Snapshot Component  SUCCESS [5.286s]
[INFO] Apache CloudStack Cloud Engine API ................ SUCCESS [1.512s]
[INFO] Apache CloudStack Cloud Engine Service ............ SUCCESS [3.776s]
[INFO] Apache CloudStack Plugin POM ...................... SUCCESS [0.244s]
[INFO] Apache CloudStack Plugin - API Rate Limit ......... SUCCESS [5.245s]
[INFO] Apache CloudStack Plugin - Storage Volume default provider  SUCCESS [1.834s]
[INFO] Apache CloudStack Plugin - Storage Volume SolidFire Provider  SUCCESS [3.645s]
[INFO] Apache CloudStack Plugin - API SolidFire .......... SUCCESS [1.927s]
[INFO] Apache CloudStack Plugin - API Discovery .......... SUCCESS [3.384s]
[INFO] Apache CloudStack Plugin - ACL Static Role Based .. SUCCESS [1.739s]
[INFO] Apache CloudStack Plugin - Host Anti-Affinity Processor  SUCCESS [1.862s]
[INFO] Apache CloudStack Plugin - Explicit Dedication Processor  SUCCESS [1.895s]
[INFO] Apache CloudStack Plugin - User Concentrated Pod Deployment Planner  SUCCESS [1.759s]
[INFO] Apache CloudStack Plugin - User Dispersing Deployment Planner  SUCCESS [1.824s]
[INFO] Apache CloudStack Plugin - Implicit Dedication Planner  SUCCESS [5.400s]
[INFO] Apache CloudStack Plugin - Skip Heurestics Planner  SUCCESS [1.771s]
[INFO] Apache CloudStack Plugin - Host Allocator Random .. SUCCESS [1.843s]
[INFO] Apache CloudStack Plugin - Dedicated Resources .... SUCCESS [5.390s]
[INFO] Apache CloudStack Plugin - Hypervisor OracleVM .... SUCCESS [2.544s]
[INFO] Apache CloudStack Plugin - Open vSwitch ........... SUCCESS [2.748s]
[INFO] Apache CloudStack Plugin - Hypervisor XenServer ... SUCCESS [7.058s]
[INFO] Apache CloudStack Plugin - Hypervisor KVM ......... SUCCESS [6.854s]
[INFO] Apache CloudStack Plugin - RabbitMQ Event Bus ..... SUCCESS [1.900s]
[INFO] Apache CloudStack Plugin - In Memory Event Bus .... SUCCESS [3.226s]
[INFO] Apache CloudStack Plugin - Hypervisor Baremetal ... SUCCESS [3.330s]
[INFO] Apache CloudStack Plugin - Hypervisor UCS ......... SUCCESS [2.192s]
[INFO] Apache CloudStack Plugin - Hypervisor Hyper-V ..... SUCCESS [4.431s]
[INFO] Apache CloudStack Plugin - Network Elastic Load Balancer  SUCCESS [4.214s]
[INFO] Apache CloudStack Plugin - Network Internal Load Balancer  SUCCESS [6.614s]
[INFO] Apache CloudStack Framework - Spring Life Cycle ... SUCCESS [1.810s]
[INFO] Apache CloudStack Plugin - Network Juniper Contrail  SUCCESS [9.352s]
[INFO] Apache CloudStack Plugin - Palo Alto .............. SUCCESS [5.568s]
[INFO] Apache CloudStack Plugin - Network Netscaler ...... SUCCESS [3.339s]
[INFO] Apache CloudStack Plugin - Network Nicira NVP ..... SUCCESS [7.647s]
[INFO] Apache CloudStack Plugin - BigSwitch Virtual Network Segment  SUCCESS [4.512s]
[INFO] Apache CloudStack Plugin - Network Brocade VCS .... SUCCESS [6.376s]
[INFO] Apache CloudStack Plugin - Midokura Midonet ....... SUCCESS [4.892s]
[INFO] Apache CloudStack Plugin - Stratosphere SSP ....... SUCCESS [4.593s]
[INFO] Apache CloudStack Plugin - Network Opendaylight ... SUCCESS [4.294s]
[INFO] Apache CloudStack Plugin - Storage Allocator Random  SUCCESS [1.834s]
[INFO] Apache CloudStack Plugin - User Authenticator LDAP  SUCCESS [2.538s]
[INFO] Apache CloudStack Plugin - User Authenticator MD5 . SUCCESS [3.289s]
[INFO] Apache CloudStack Plugin - User Authenticator Plain Text  SUCCESS [1.720s]
[INFO] Apache CloudStack Plugin - User Authenticator SHA256 Salted  SUCCESS [3.561s]
[INFO] Apache CloudStack Plugin - Dns Notifier Example ... SUCCESS [1.650s]
[INFO] Apache CloudStack Plugin - Storage Image S3 ....... SUCCESS [1.895s]
[INFO] Apache CloudStack Plugin - Storage Image Swift provider  SUCCESS [1.589s]
[INFO] Apache CloudStack Plugin - Storage Image default provider  SUCCESS [1.648s]
[INFO] Apache CloudStack Plugin - Storage Image sample provider  SUCCESS [1.531s]
[INFO] Apache CloudStack Plugin - Storage Volume Nexenta Provider  SUCCESS [3.159s]
[INFO] Apache CloudStack Plugin - Storage Volume CloudByte Provider  SUCCESS [2.486s]
[INFO] Apache CloudStack Plugin - Storage Volume sample provider  SUCCESS [1.597s]
[INFO] Apache CloudStack Plugin - SNMP Alerts ............ SUCCESS [3.434s]
[INFO] Apache CloudStack Plugin - Syslog Alerts .......... SUCCESS [3.037s]
[INFO] Apache CloudStack Plugin - Network VXLAN .......... SUCCESS [3.838s]
[INFO] Apache CloudStack Plugin - NetApp File System ..... SUCCESS [2.352s]
[INFO] Apache CloudStack Plugin - F5 ..................... SUCCESS [2.513s]
[INFO] Apache CloudStack Plugin - Juniper SRX ............ SUCCESS [2.845s]
[INFO] Apache CloudStack Plugin - Nuage VSP .............. SUCCESS [5.566s]
[INFO] Apache CloudStack VMware Base ..................... SUCCESS [4.653s]
[INFO] Apache CloudStack Plugin - Hypervisor VMware ...... FAILURE [0.403s]
[INFO] Apache CloudStack Plugin - Cisco VNMC ............. SKIPPED
[INFO] Apache CloudStack Plugin - MySQL HA Strategy ...... SKIPPED
[INFO] Apache CloudStack Framework - Spring Module ....... SKIPPED
[INFO] Apache CloudStack Secondary Storage Controller .... SKIPPED
[INFO] Apache CloudStack Console Proxy - RDP Client ...... SKIPPED
[INFO] Apache CloudStack Console Proxy ................... SKIPPED
[INFO] Apache CloudStack Console Proxy - Server .......... SKIPPED
[INFO] Apache CloudStack System VM ....................... SKIPPED
[INFO] Apache CloudStack Client UI ....................... SKIPPED
[INFO] Apache CloudStack Framework - QuickCloud .......... SKIPPED
[INFO] Apache CloudStack AWS API Bridge .................. SKIPPED
[INFO] ------------------------------------------------------------------------
[INFO] BUILD FAILURE
[INFO] ------------------------------------------------------------------------
[INFO] Total time: 5:55.611s
[INFO] Finished at: Mon Jul 28 22:09:25 CEST 2014
[INFO] Final Memory: 98M/430M
[INFO] ------------------------------------------------------------------------
[ERROR] Failed to execute goal org.apache.maven.plugins:maven-checkstyle-plugin:2.11:check
(cloudstack-checkstyle) on project cloud-plugin-hypervisor-vmware: Failed during checkstyle
execution: There are 1 checkstyle errors. -> [Help 1]
[ERROR] 
[ERROR] To see the full stack trace of the errors, re-run Maven with the -e switch.
[ERROR] Re-run Maven using the -X switch to enable full debug logging.
[ERROR] 
[ERROR] For more information about the errors and possible solutions, please read the following
articles:
[ERROR] [Help 1] http://cwiki.apache.org/confluence/display/MAVEN/MojoExecutionException
[ERROR] 
[ERROR] After correcting the problems, you can resume the build with the command
[ERROR]   mvn <goals> -rf :cloud-plugin-hypervisor-vmware
Build step 'Invoke top-level Maven targets' marked build as failure
Archiving artifacts

Mime
View raw message