cloudstack-dev mailing list archives

Site index · List index
Message view « Date » · « Thread »
Top « Date » · « Thread »
From Ian Duffy <...@ianduffy.ie>
Subject Re: Build failed in Jenkins: cloudstack-4.4-forward-build #292
Date Wed, 25 Jun 2014 19:04:14 GMT
Unused import.... removed. should be resolved shortly.


On 25 June 2014 19:55, <jenkins@cloudstack.org> wrote:

> See <
> http://jenkins.buildacloud.org/job/cloudstack-4.4-forward-build/292/changes
> >
>
> Changes:
>
> [Ian Duffy] Allow for length of password on VMs to be set via global
> settings
>
> ------------------------------------------
> [...truncated 1179 lines...]
> [INFO] Using 'UTF-8' encoding to copy filtered resources.
> [INFO] Copying 2 resources
> [INFO] Copying 3 resources
> [INFO]
> [INFO] --- maven-compiler-plugin:2.5.1:compile (default-compile) @
> cloud-engine-schema ---
> [INFO] Compiling 658 source files to <
> http://jenkins.buildacloud.org/job/cloudstack-4.4-forward-build/ws/engine/schema/target/classes
> >
> [INFO]
> [INFO] --- maven-resources-plugin:2.5:testResources
> (default-testResources) @ cloud-engine-schema ---
> [debug] execute contextualize
> [INFO] Using 'UTF-8' encoding to copy filtered resources.
> [INFO] skip non existing resourceDirectory <
> http://jenkins.buildacloud.org/job/cloudstack-4.4-forward-build/ws/engine/schema/test/resources
> >
> [INFO] Copying 3 resources
> [INFO]
> [INFO] --- maven-compiler-plugin:2.5.1:testCompile (default-testCompile) @
> cloud-engine-schema ---
> [INFO] Compiling 2 source files to <
> http://jenkins.buildacloud.org/job/cloudstack-4.4-forward-build/ws/engine/schema/target/test-classes
> >
> [INFO]
> [INFO] --- maven-surefire-plugin:2.12:test (default-test) @
> cloud-engine-schema ---
> [INFO] Surefire report directory: <
> http://jenkins.buildacloud.org/job/cloudstack-4.4-forward-build/ws/engine/schema/target/surefire-reports
> >
>
> -------------------------------------------------------
>  T E S T S
> -------------------------------------------------------
> Running com.cloud.upgrade.dao.DatabaseAccessObjectTest
> Tests run: 25, Failures: 0, Errors: 0, Skipped: 0, Time elapsed: 0.561 sec
> Running com.cloud.upgrade.dao.DbUpgradeUtilsTest
> Tests run: 8, Failures: 0, Errors: 0, Skipped: 0, Time elapsed: 0.137 sec
>
> Results :
>
> Tests run: 33, Failures: 0, Errors: 0, Skipped: 0
>
> [INFO]
> [INFO]
> ------------------------------------------------------------------------
> [INFO] Building Apache CloudStack Framework - Jobs 4.4.0-SNAPSHOT
> [INFO]
> ------------------------------------------------------------------------
> [INFO]
> [INFO] --- maven-clean-plugin:2.5:clean (default-clean) @
> cloud-framework-jobs ---
> [INFO] Deleting <
> http://jenkins.buildacloud.org/job/cloudstack-4.4-forward-build/ws/framework/jobs/target>
> (includes = [**/*], excludes = [])
> [INFO] Deleting <
> http://jenkins.buildacloud.org/job/cloudstack-4.4-forward-build/ws/framework/jobs>
> (includes = [target, dist], excludes = [])
> [INFO]
> [INFO] --- maven-checkstyle-plugin:2.11:check (cloudstack-checkstyle) @
> cloud-framework-jobs ---
> [INFO] Starting audit...
> Audit done.
>
> [INFO]
> [INFO] --- maven-remote-resources-plugin:1.3:process (default) @
> cloud-framework-jobs ---
> [INFO]
> [INFO] --- maven-resources-plugin:2.5:resources (default-resources) @
> cloud-framework-jobs ---
> [debug] execute contextualize
> [INFO] Using 'UTF-8' encoding to copy filtered resources.
> [INFO] Copying 1 resource
> [INFO] Copying 3 resources
> [INFO]
> [INFO] --- maven-compiler-plugin:2.5.1:compile (default-compile) @
> cloud-framework-jobs ---
> [INFO] Compiling 33 source files to <
> http://jenkins.buildacloud.org/job/cloudstack-4.4-forward-build/ws/framework/jobs/target/classes
> >
> [INFO]
> [INFO] --- maven-resources-plugin:2.5:testResources
> (default-testResources) @ cloud-framework-jobs ---
> [debug] execute contextualize
> [INFO] Using 'UTF-8' encoding to copy filtered resources.
> [INFO] Copying 4 resources
> [INFO] Copying 3 resources
> [INFO]
> [INFO] --- maven-compiler-plugin:2.5.1:testCompile (default-testCompile) @
> cloud-framework-jobs ---
> [INFO] Compiling 4 source files to <
> http://jenkins.buildacloud.org/job/cloudstack-4.4-forward-build/ws/framework/jobs/target/test-classes
> >
> [INFO]
> [INFO] --- maven-surefire-plugin:2.12:test (default-test) @
> cloud-framework-jobs ---
> [INFO] Surefire report directory: <
> http://jenkins.buildacloud.org/job/cloudstack-4.4-forward-build/ws/framework/jobs/target/surefire-reports
> >
>
> -------------------------------------------------------
>  T E S T S
> -------------------------------------------------------
>
> Results :
>
> Tests run: 0, Failures: 0, Errors: 0, Skipped: 0
>
> [INFO]
> [INFO]
> ------------------------------------------------------------------------
> [INFO] Building Apache CloudStack Cloud Engine Internal Components API
> 4.4.0-SNAPSHOT
> [INFO]
> ------------------------------------------------------------------------
> [INFO]
> [INFO] --- maven-clean-plugin:2.5:clean (default-clean) @
> cloud-engine-components-api ---
> [INFO] Deleting <
> http://jenkins.buildacloud.org/job/cloudstack-4.4-forward-build/ws/engine/components-api/target>
> (includes = [**/*], excludes = [])
> [INFO] Deleting <
> http://jenkins.buildacloud.org/job/cloudstack-4.4-forward-build/ws/engine/components-api>
> (includes = [target, dist], excludes = [])
> [INFO]
> [INFO] --- maven-checkstyle-plugin:2.11:check (cloudstack-checkstyle) @
> cloud-engine-components-api ---
> [INFO] Starting audit...
> Audit done.
>
> [INFO]
> [INFO] --- maven-remote-resources-plugin:1.3:process (default) @
> cloud-engine-components-api ---
> [INFO]
> [INFO] --- maven-resources-plugin:2.5:resources (default-resources) @
> cloud-engine-components-api ---
> [debug] execute contextualize
> [INFO] Using 'UTF-8' encoding to copy filtered resources.
> [INFO] Copying 1 resource
> [INFO] Copying 3 resources
> [INFO]
> [INFO] --- maven-compiler-plugin:2.5.1:compile (default-compile) @
> cloud-engine-components-api ---
> [INFO] Compiling 31 source files to <
> http://jenkins.buildacloud.org/job/cloudstack-4.4-forward-build/ws/engine/components-api/target/classes
> >
> [INFO]
> [INFO] --- maven-resources-plugin:2.5:testResources
> (default-testResources) @ cloud-engine-components-api ---
> [debug] execute contextualize
> [INFO] Using 'UTF-8' encoding to copy filtered resources.
> [INFO] skip non existing resourceDirectory <
> http://jenkins.buildacloud.org/job/cloudstack-4.4-forward-build/ws/engine/components-api/test/resources
> >
> [INFO] Copying 3 resources
> [INFO]
> [INFO] --- maven-compiler-plugin:2.5.1:testCompile (default-testCompile) @
> cloud-engine-components-api ---
> [INFO] No sources to compile
> [INFO]
> [INFO] --- maven-surefire-plugin:2.12:test (default-test) @
> cloud-engine-components-api ---
> [INFO] Surefire report directory: <
> http://jenkins.buildacloud.org/job/cloudstack-4.4-forward-build/ws/engine/components-api/target/surefire-reports
> >
>
> -------------------------------------------------------
>  T E S T S
> -------------------------------------------------------
>
> Results :
>
> Tests run: 0, Failures: 0, Errors: 0, Skipped: 0
>
> [INFO]
> [INFO]
> ------------------------------------------------------------------------
> [INFO] Building Apache CloudStack Server 4.4.0-SNAPSHOT
> [INFO]
> ------------------------------------------------------------------------
> [INFO]
> [INFO] --- maven-clean-plugin:2.5:clean (default-clean) @ cloud-server ---
> [INFO] Deleting <
> http://jenkins.buildacloud.org/job/cloudstack-4.4-forward-build/ws/server/target>
> (includes = [**/*], excludes = [])
> [INFO] Deleting <
> http://jenkins.buildacloud.org/job/cloudstack-4.4-forward-build/ws/server>
> (includes = [target, dist], excludes = [])
> [INFO]
> [INFO] --- maven-checkstyle-plugin:2.11:check (cloudstack-checkstyle) @
> cloud-server ---
> [INFO] Starting audit...
> <
> http://jenkins.buildacloud.org/job/cloudstack-4.4-forward-build/ws/server/src/com/cloud/vm/UserVmManagerImpl.java>:247:8:
> Unused import - com.cloud.utils.PasswordGenerator.
> Audit done.
>
> [INFO]
> ------------------------------------------------------------------------
> [INFO] Reactor Summary:
> [INFO]
> [INFO] Apache CloudStack Developer Tools - Checkstyle Configuration
>  SUCCESS [0.646s]
> [INFO] Apache CloudStack ................................. SUCCESS [0.578s]
> [INFO] Apache CloudStack Maven Conventions Parent ........ SUCCESS [0.977s]
> [INFO] Apache CloudStack Framework - Managed Context ..... SUCCESS [2.468s]
> [INFO] Apache CloudStack Utils ........................... SUCCESS [9.634s]
> [INFO] Apache CloudStack Framework ....................... SUCCESS [0.041s]
> [INFO] Apache CloudStack Framework - Event Notification .. SUCCESS [5.577s]
> [INFO] Apache CloudStack Framework - Configuration ....... SUCCESS [3.385s]
> [INFO] Apache CloudStack API ............................. SUCCESS
> [11.487s]
> [INFO] Apache CloudStack Framework - REST ................ SUCCESS [2.186s]
> [INFO] Apache CloudStack Framework - IPC ................. SUCCESS [4.878s]
> [INFO] Apache CloudStack Cloud Engine .................... SUCCESS [0.034s]
> [INFO] Apache CloudStack Cloud Engine API ................ SUCCESS [3.916s]
> [INFO] Apache CloudStack Framework - Security ............ SUCCESS [1.859s]
> [INFO] Apache CloudStack Core ............................ SUCCESS [8.195s]
> [INFO] Apache CloudStack Agents .......................... SUCCESS [4.374s]
> [INFO] Apache CloudStack Framework - Clustering .......... SUCCESS [2.499s]
> [INFO] Apache CloudStack Framework - Event Notification .. SUCCESS [1.465s]
> [INFO] Apache CloudStack Cloud Engine Schema Component ... SUCCESS
> [11.056s]
> [INFO] Apache CloudStack Framework - Jobs ................ SUCCESS [4.045s]
> [INFO] Apache CloudStack Cloud Engine Internal Components API  SUCCESS
> [2.597s]
> [INFO] Apache CloudStack Server .......................... FAILURE [2.939s]
> [INFO] Apache CloudStack Usage Server .................... SKIPPED
> [INFO] Apache XenSource XAPI ............................. SKIPPED
> [INFO] Apache CloudStack Cloud Engine Orchestration Component  SKIPPED
> [INFO] Apache CloudStack Cloud Services .................. SKIPPED
> [INFO] Apache CloudStack Secondary Storage ............... SKIPPED
> [INFO] Apache CloudStack Secondary Storage Service ....... SKIPPED
> [INFO] Apache CloudStack Engine Storage Component ........ SKIPPED
> [INFO] Apache CloudStack Engine Storage Volume Component . SKIPPED
> [INFO] Apache CloudStack Engine Storage Image Component .. SKIPPED
> [INFO] Apache CloudStack Engine Storage Data Motion Component  SKIPPED
> [INFO] Apache CloudStack Engine Storage Cache Component .. SKIPPED
> [INFO] Apache CloudStack Engine Storage Snapshot Component  SKIPPED
> [INFO] Apache CloudStack Cloud Engine API ................ SKIPPED
> [INFO] Apache CloudStack Cloud Engine Service ............ SKIPPED
> [INFO] Apache CloudStack Plugin POM ...................... SKIPPED
> [INFO] Apache CloudStack Plugin - API Rate Limit ......... SKIPPED
> [INFO] Apache CloudStack Plugin - API Discovery .......... SKIPPED
> [INFO] Apache CloudStack Plugin - ACL Static Role Based .. SKIPPED
> [INFO] Apache CloudStack Plugin - Host Anti-Affinity Processor  SKIPPED
> [INFO] Apache CloudStack Plugin - Explicit Dedication Processor  SKIPPED
> [INFO] Apache CloudStack Plugin - User Concentrated Pod Deployment Planner
>  SKIPPED
> [INFO] Apache CloudStack Plugin - User Dispersing Deployment Planner
>  SKIPPED
> [INFO] Apache CloudStack Plugin - Implicit Dedication Planner  SKIPPED
> [INFO] Apache CloudStack Plugin - Skip Heurestics Planner  SKIPPED
> [INFO] Apache CloudStack Plugin - Host Allocator Random .. SKIPPED
> [INFO] Apache CloudStack Plugin - Dedicated Resources .... SKIPPED
> [INFO] Apache CloudStack Plugin - Hypervisor OracleVM .... SKIPPED
> [INFO] Apache CloudStack Plugin - Open vSwitch ........... SKIPPED
> [INFO] Apache CloudStack Plugin - Hypervisor Xen ......... SKIPPED
> [INFO] Apache CloudStack Plugin - Hypervisor KVM ......... SKIPPED
> [INFO] Apache CloudStack Plugin - RabbitMQ Event Bus ..... SKIPPED
> [INFO] Apache CloudStack Plugin - In Memory Event Bus .... SKIPPED
> [INFO] Apache CloudStack Plugin - Hypervisor Baremetal ... SKIPPED
> [INFO] Apache CloudStack Plugin - Hypervisor UCS ......... SKIPPED
> [INFO] Apache CloudStack Plugin - Hypervisor Hyper-V ..... SKIPPED
> [INFO] Apache CloudStack Plugin - Network Elastic Load Balancer  SKIPPED
> [INFO] Apache CloudStack Plugin - Network Internal Load Balancer  SKIPPED
> [INFO] Apache CloudStack Framework - Spring Life Cycle ... SKIPPED
> [INFO] Apache CloudStack Plugin - Network Juniper Contrail  SKIPPED
> [INFO] Apache CloudStack Plugin - Palo Alto .............. SKIPPED
> [INFO] Apache CloudStack Plugin - Network Netscaler ...... SKIPPED
> [INFO] Apache CloudStack Plugin - Network Nicira NVP ..... SKIPPED
> [INFO] Apache CloudStack Plugin - BigSwitch Virtual Network Segment
>  SKIPPED
> [INFO] Apache CloudStack Plugin - Midokura Midonet ....... SKIPPED
> [INFO] Apache CloudStack Plugin - Stratosphere SSP ....... SKIPPED
> [INFO] Apache CloudStack Plugin - Network Opendaylight ... SKIPPED
> [INFO] Apache CloudStack Plugin - Storage Allocator Random  SKIPPED
> [INFO] Apache CloudStack Plugin - User Authenticator LDAP  SKIPPED
> [INFO] Apache CloudStack Plugin - User Authenticator MD5 . SKIPPED
> [INFO] Apache CloudStack Plugin - User Authenticator Plain Text  SKIPPED
> [INFO] Apache CloudStack Plugin - User Authenticator SHA256 Salted  SKIPPED
> [INFO] Apache CloudStack Plugin - Dns Notifier Example ... SKIPPED
> [INFO] Apache CloudStack Plugin - Storage Image S3 ....... SKIPPED
> [INFO] Apache CloudStack Plugin - Storage Image Swift provider  SKIPPED
> [INFO] Apache CloudStack Plugin - Storage Image default provider  SKIPPED
> [INFO] Apache CloudStack Plugin - Storage Image sample provider  SKIPPED
> [INFO] Apache CloudStack Plugin - Storage Volume Nexenta Provider  SKIPPED
> [INFO] Apache CloudStack Plugin - Storage Volume SolidFire Provider
>  SKIPPED
> [INFO] Apache CloudStack Plugin - Storage Volume default provider  SKIPPED
> [INFO] Apache CloudStack Plugin - Storage Volume CloudByte Provider
>  SKIPPED
> [INFO] Apache CloudStack Plugin - Storage Volume sample provider  SKIPPED
> [INFO] Apache CloudStack Plugin - SNMP Alerts ............ SKIPPED
> [INFO] Apache CloudStack Plugin - Syslog Alerts .......... SKIPPED
> [INFO] Apache CloudStack Plugin - Network VXLAN .......... SKIPPED
> [INFO] Apache CloudStack Framework - Spring Module ....... SKIPPED
> [INFO] Apache CloudStack Secondary Storage Controller .... SKIPPED
> [INFO] Apache CloudStack Client UI ....................... SKIPPED
> [INFO] Apache CloudStack Console Proxy - RDP Client ...... SKIPPED
> [INFO] Apache CloudStack Console Proxy ................... SKIPPED
> [INFO] Apache CloudStack Console Proxy - Server .......... SKIPPED
> [INFO] Apache CloudStack Framework - QuickCloud .......... SKIPPED
> [INFO]
> ------------------------------------------------------------------------
> [INFO] BUILD FAILURE
> [INFO]
> ------------------------------------------------------------------------
> [INFO] Total time: 1:26.598s
> [INFO] Finished at: Wed Jun 25 20:55:12 CEST 2014
> [INFO] Final Memory: 51M/371M
> [INFO]
> ------------------------------------------------------------------------
> [ERROR] Failed to execute goal
> org.apache.maven.plugins:maven-checkstyle-plugin:2.11:check
> (cloudstack-checkstyle) on project cloud-server: Failed during checkstyle
> execution: There are 1 checkstyle errors. -> [Help 1]
> [ERROR]
> [ERROR] To see the full stack trace of the errors, re-run Maven with the
> -e switch.
> [ERROR] Re-run Maven using the -X switch to enable full debug logging.
> [ERROR]
> [ERROR] For more information about the errors and possible solutions,
> please read the following articles:
> [ERROR] [Help 1]
> http://cwiki.apache.org/confluence/display/MAVEN/MojoExecutionException
> [ERROR]
> [ERROR] After correcting the problems, you can resume the build with the
> command
> [ERROR]   mvn <goals> -rf :cloud-server
> Build step 'Invoke top-level Maven targets' marked build as failure
>

Mime
  • Unnamed multipart/alternative (inline, None, 0 bytes)
View raw message