cloudstack-dev mailing list archives

Site index · List index
Message view « Date » · « Thread »
Top « Date » · « Thread »
From jenk...@cloudstack.org
Subject Build failed in Jenkins: cloudstack-4.4-forward-build #278
Date Mon, 23 Jun 2014 06:51:20 GMT
See <http://jenkins.buildacloud.org/job/cloudstack-4.4-forward-build/278/changes>

Changes:

[Devdeep Singh] CLOUDSTACK-6965: fixed the NullPointerException introduced by fix for cloudstack

------------------------------------------
[...truncated 1095 lines...]
[INFO] 
[INFO] --- maven-resources-plugin:2.5:testResources (default-testResources) @ cloud-framework-cluster
---
[debug] execute contextualize
[INFO] Using 'UTF-8' encoding to copy filtered resources.
[INFO] skip non existing resourceDirectory <http://jenkins.buildacloud.org/job/cloudstack-4.4-forward-build/ws/framework/cluster/test/resources>
[INFO] Copying 3 resources
[INFO] 
[INFO] --- maven-compiler-plugin:2.5.1:testCompile (default-testCompile) @ cloud-framework-cluster
---
[INFO] No sources to compile
[INFO] 
[INFO] --- maven-surefire-plugin:2.12:test (default-test) @ cloud-framework-cluster ---
[INFO] Surefire report directory: <http://jenkins.buildacloud.org/job/cloudstack-4.4-forward-build/ws/framework/cluster/target/surefire-reports>

-------------------------------------------------------
 T E S T S
-------------------------------------------------------

Results :

Tests run: 0, Failures: 0, Errors: 0, Skipped: 0

[INFO]                                                                         
[INFO] ------------------------------------------------------------------------
[INFO] Building Apache CloudStack Framework - Event Notification 4.4.0-SNAPSHOT
[INFO] ------------------------------------------------------------------------
[INFO] 
[INFO] --- maven-clean-plugin:2.5:clean (default-clean) @ cloud-framework-events ---
[INFO] Deleting <http://jenkins.buildacloud.org/job/cloudstack-4.4-forward-build/ws/framework/events/target>
(includes = [**/*], excludes = [])
[INFO] Deleting <http://jenkins.buildacloud.org/job/cloudstack-4.4-forward-build/ws/framework/events>
(includes = [target, dist], excludes = [])
[INFO] 
[INFO] --- maven-checkstyle-plugin:2.11:check (cloudstack-checkstyle) @ cloud-framework-events
---
[INFO] Starting audit...
Audit done.

[INFO] 
[INFO] --- maven-remote-resources-plugin:1.3:process (default) @ cloud-framework-events ---
[INFO] 
[INFO] --- maven-resources-plugin:2.5:resources (default-resources) @ cloud-framework-events
---
[debug] execute contextualize
[INFO] Using 'UTF-8' encoding to copy filtered resources.
[INFO] skip non existing resourceDirectory <http://jenkins.buildacloud.org/job/cloudstack-4.4-forward-build/ws/framework/events/resources>
[INFO] Copying 3 resources
[INFO] 
[INFO] --- maven-compiler-plugin:2.5.1:compile (default-compile) @ cloud-framework-events
---
[INFO] Compiling 5 source files to <http://jenkins.buildacloud.org/job/cloudstack-4.4-forward-build/ws/framework/events/target/classes>
[INFO] 
[INFO] --- maven-resources-plugin:2.5:testResources (default-testResources) @ cloud-framework-events
---
[debug] execute contextualize
[INFO] Using 'UTF-8' encoding to copy filtered resources.
[INFO] skip non existing resourceDirectory <http://jenkins.buildacloud.org/job/cloudstack-4.4-forward-build/ws/framework/events/test/resources>
[INFO] Copying 3 resources
[INFO] 
[INFO] --- maven-compiler-plugin:2.5.1:testCompile (default-testCompile) @ cloud-framework-events
---
[INFO] No sources to compile
[INFO] 
[INFO] --- maven-surefire-plugin:2.12:test (default-test) @ cloud-framework-events ---
[INFO] Surefire report directory: <http://jenkins.buildacloud.org/job/cloudstack-4.4-forward-build/ws/framework/events/target/surefire-reports>

-------------------------------------------------------
 T E S T S
-------------------------------------------------------

Results :

Tests run: 0, Failures: 0, Errors: 0, Skipped: 0

[INFO]                                                                         
[INFO] ------------------------------------------------------------------------
[INFO] Building Apache CloudStack Cloud Engine Schema Component 4.4.0-SNAPSHOT
[INFO] ------------------------------------------------------------------------
[INFO] 
[INFO] --- maven-clean-plugin:2.5:clean (default-clean) @ cloud-engine-schema ---
[INFO] Deleting <http://jenkins.buildacloud.org/job/cloudstack-4.4-forward-build/ws/engine/schema/target>
(includes = [**/*], excludes = [])
[INFO] Deleting <http://jenkins.buildacloud.org/job/cloudstack-4.4-forward-build/ws/engine/schema>
(includes = [target, dist], excludes = [])
[INFO] 
[INFO] --- maven-checkstyle-plugin:2.11:check (cloudstack-checkstyle) @ cloud-engine-schema
---
[INFO] Starting audit...
Audit done.

[INFO] 
[INFO] --- maven-remote-resources-plugin:1.3:process (default) @ cloud-engine-schema ---
[INFO] 
[INFO] --- maven-resources-plugin:2.5:resources (default-resources) @ cloud-engine-schema
---
[debug] execute contextualize
[INFO] Using 'UTF-8' encoding to copy filtered resources.
[INFO] Copying 2 resources
[INFO] Copying 3 resources
[INFO] 
[INFO] --- maven-compiler-plugin:2.5.1:compile (default-compile) @ cloud-engine-schema ---
[INFO] Compiling 655 source files to <http://jenkins.buildacloud.org/job/cloudstack-4.4-forward-build/ws/engine/schema/target/classes>
[INFO] 
[INFO] --- maven-resources-plugin:2.5:testResources (default-testResources) @ cloud-engine-schema
---
[debug] execute contextualize
[INFO] Using 'UTF-8' encoding to copy filtered resources.
[INFO] skip non existing resourceDirectory <http://jenkins.buildacloud.org/job/cloudstack-4.4-forward-build/ws/engine/schema/test/resources>
[INFO] Copying 3 resources
[INFO] 
[INFO] --- maven-compiler-plugin:2.5.1:testCompile (default-testCompile) @ cloud-engine-schema
---
[INFO] Compiling 2 source files to <http://jenkins.buildacloud.org/job/cloudstack-4.4-forward-build/ws/engine/schema/target/test-classes>
[INFO] 
[INFO] --- maven-surefire-plugin:2.12:test (default-test) @ cloud-engine-schema ---
[INFO] Surefire report directory: <http://jenkins.buildacloud.org/job/cloudstack-4.4-forward-build/ws/engine/schema/target/surefire-reports>

-------------------------------------------------------
 T E S T S
-------------------------------------------------------
Running com.cloud.upgrade.dao.DatabaseAccessObjectTest
Tests run: 25, Failures: 16, Errors: 0, Skipped: 0, Time elapsed: 3.27 sec <<< FAILURE!
Running com.cloud.upgrade.dao.DbUpgradeUtilsTest
Tests run: 8, Failures: 0, Errors: 0, Skipped: 0, Time elapsed: 0.478 sec

Results :

Failed tests:   testDropPrimaryKeyWhenExecuteUpdateResultsInException(com.cloud.upgrade.dao.DatabaseAccessObjectTest):
(..)
  testDropPrimaryKeyWhenPrepareStatementResultsInException(com.cloud.upgrade.dao.DatabaseAccessObjectTest):
(..)
  testDropColumnWhenPrepareStatementResultsInException(com.cloud.upgrade.dao.DatabaseAccessObjectTest):
(..)
  testDropKeyWhenTableNameIsNull(com.cloud.upgrade.dao.DatabaseAccessObjectTest): (..)
  testColumnExistsWhenColumnNameIsNull(com.cloud.upgrade.dao.DatabaseAccessObjectTest): (..)
  testDropPrimaryKeyWhenConnectionIsNull(com.cloud.upgrade.dao.DatabaseAccessObjectTest):
Expected exception: java.lang.NullPointerException
  testDropPrimaryKeyWhenTableNameIsNull(com.cloud.upgrade.dao.DatabaseAccessObjectTest): (..)
  testColumnExistsWhenTableNameIsNull(com.cloud.upgrade.dao.DatabaseAccessObjectTest): (..)
  testDropColumnWhenTableNameIsNull(com.cloud.upgrade.dao.DatabaseAccessObjectTest): (..)
  testColumnExistsWhenConnectionIsNull(com.cloud.upgrade.dao.DatabaseAccessObjectTest): Expected
exception: java.lang.NullPointerException
  testDropColumnWhenexecuteUpdateResultsInException(com.cloud.upgrade.dao.DatabaseAccessObjectTest):
(..)
  testDropColumnWhenColumnNameIsNull(com.cloud.upgrade.dao.DatabaseAccessObjectTest): (..)
  testDropColumnWhenConnectionIsNull(com.cloud.upgrade.dao.DatabaseAccessObjectTest): Expected
exception: java.lang.NullPointerException
  testDropKeyWhenExecuteUpdateResultsInException(com.cloud.upgrade.dao.DatabaseAccessObjectTest):
(..)
  testDropKeyWhenKeyIsNull(com.cloud.upgrade.dao.DatabaseAccessObjectTest): (..)
  testDropKeyWhenPrepareStatementResultsInException(com.cloud.upgrade.dao.DatabaseAccessObjectTest):
(..)

Tests run: 33, Failures: 16, Errors: 0, Skipped: 0

[INFO] ------------------------------------------------------------------------
[INFO] Reactor Summary:
[INFO] 
[INFO] Apache CloudStack Developer Tools - Checkstyle Configuration  SUCCESS [4.137s]
[INFO] Apache CloudStack ................................. SUCCESS [4.687s]
[INFO] Apache CloudStack Maven Conventions Parent ........ SUCCESS [8.539s]
[INFO] Apache CloudStack Framework - Managed Context ..... SUCCESS [26.229s]
[INFO] Apache CloudStack Utils ........................... SUCCESS [56.348s]
[INFO] Apache CloudStack Framework ....................... SUCCESS [0.316s]
[INFO] Apache CloudStack Framework - Event Notification .. SUCCESS [34.519s]
[INFO] Apache CloudStack Framework - Configuration ....... SUCCESS [19.215s]
[INFO] Apache CloudStack API ............................. SUCCESS [59.982s]
[INFO] Apache CloudStack Framework - REST ................ SUCCESS [12.674s]
[INFO] Apache CloudStack Framework - IPC ................. SUCCESS [27.633s]
[INFO] Apache CloudStack Cloud Engine .................... SUCCESS [0.174s]
[INFO] Apache CloudStack Cloud Engine API ................ SUCCESS [17.930s]
[INFO] Apache CloudStack Framework - Security ............ SUCCESS [9.900s]
[INFO] Apache CloudStack Core ............................ SUCCESS [39.786s]
[INFO] Apache CloudStack Agents .......................... SUCCESS [19.194s]
[INFO] Apache CloudStack Framework - Clustering .......... SUCCESS [11.374s]
[INFO] Apache CloudStack Framework - Event Notification .. SUCCESS [7.534s]
[INFO] Apache CloudStack Cloud Engine Schema Component ... FAILURE [1:06.958s]
[INFO] Apache CloudStack Framework - Jobs ................ SKIPPED
[INFO] Apache CloudStack Cloud Engine Internal Components API  SKIPPED
[INFO] Apache CloudStack Server .......................... SKIPPED
[INFO] Apache CloudStack Usage Server .................... SKIPPED
[INFO] Apache XenSource XAPI ............................. SKIPPED
[INFO] Apache CloudStack Cloud Engine Orchestration Component  SKIPPED
[INFO] Apache CloudStack Cloud Services .................. SKIPPED
[INFO] Apache CloudStack Secondary Storage ............... SKIPPED
[INFO] Apache CloudStack Secondary Storage Service ....... SKIPPED
[INFO] Apache CloudStack Engine Storage Component ........ SKIPPED
[INFO] Apache CloudStack Engine Storage Volume Component . SKIPPED
[INFO] Apache CloudStack Engine Storage Image Component .. SKIPPED
[INFO] Apache CloudStack Engine Storage Data Motion Component  SKIPPED
[INFO] Apache CloudStack Engine Storage Cache Component .. SKIPPED
[INFO] Apache CloudStack Engine Storage Snapshot Component  SKIPPED
[INFO] Apache CloudStack Cloud Engine API ................ SKIPPED
[INFO] Apache CloudStack Cloud Engine Service ............ SKIPPED
[INFO] Apache CloudStack Plugin POM ...................... SKIPPED
[INFO] Apache CloudStack Plugin - API Rate Limit ......... SKIPPED
[INFO] Apache CloudStack Plugin - API Discovery .......... SKIPPED
[INFO] Apache CloudStack Plugin - ACL Static Role Based .. SKIPPED
[INFO] Apache CloudStack Plugin - Host Anti-Affinity Processor  SKIPPED
[INFO] Apache CloudStack Plugin - Explicit Dedication Processor  SKIPPED
[INFO] Apache CloudStack Plugin - User Concentrated Pod Deployment Planner  SKIPPED
[INFO] Apache CloudStack Plugin - User Dispersing Deployment Planner  SKIPPED
[INFO] Apache CloudStack Plugin - Implicit Dedication Planner  SKIPPED
[INFO] Apache CloudStack Plugin - Skip Heurestics Planner  SKIPPED
[INFO] Apache CloudStack Plugin - Host Allocator Random .. SKIPPED
[INFO] Apache CloudStack Plugin - Dedicated Resources .... SKIPPED
[INFO] Apache CloudStack Plugin - Hypervisor OracleVM .... SKIPPED
[INFO] Apache CloudStack Plugin - Open vSwitch ........... SKIPPED
[INFO] Apache CloudStack Plugin - Hypervisor Xen ......... SKIPPED
[INFO] Apache CloudStack Plugin - Hypervisor KVM ......... SKIPPED
[INFO] Apache CloudStack Plugin - RabbitMQ Event Bus ..... SKIPPED
[INFO] Apache CloudStack Plugin - In Memory Event Bus .... SKIPPED
[INFO] Apache CloudStack Plugin - Hypervisor Baremetal ... SKIPPED
[INFO] Apache CloudStack Plugin - Hypervisor UCS ......... SKIPPED
[INFO] Apache CloudStack Plugin - Hypervisor Hyper-V ..... SKIPPED
[INFO] Apache CloudStack Plugin - Network Elastic Load Balancer  SKIPPED
[INFO] Apache CloudStack Plugin - Network Internal Load Balancer  SKIPPED
[INFO] Apache CloudStack Framework - Spring Life Cycle ... SKIPPED
[INFO] Apache CloudStack Plugin - Network Juniper Contrail  SKIPPED
[INFO] Apache CloudStack Plugin - Palo Alto .............. SKIPPED
[INFO] Apache CloudStack Plugin - Network Netscaler ...... SKIPPED
[INFO] Apache CloudStack Plugin - Network Nicira NVP ..... SKIPPED
[INFO] Apache CloudStack Plugin - BigSwitch Virtual Network Segment  SKIPPED
[INFO] Apache CloudStack Plugin - Midokura Midonet ....... SKIPPED
[INFO] Apache CloudStack Plugin - Stratosphere SSP ....... SKIPPED
[INFO] Apache CloudStack Plugin - Network Opendaylight ... SKIPPED
[INFO] Apache CloudStack Plugin - Storage Allocator Random  SKIPPED
[INFO] Apache CloudStack Plugin - User Authenticator LDAP  SKIPPED
[INFO] Apache CloudStack Plugin - User Authenticator MD5 . SKIPPED
[INFO] Apache CloudStack Plugin - User Authenticator Plain Text  SKIPPED
[INFO] Apache CloudStack Plugin - User Authenticator SHA256 Salted  SKIPPED
[INFO] Apache CloudStack Plugin - Dns Notifier Example ... SKIPPED
[INFO] Apache CloudStack Plugin - Storage Image S3 ....... SKIPPED
[INFO] Apache CloudStack Plugin - Storage Image Swift provider  SKIPPED
[INFO] Apache CloudStack Plugin - Storage Image default provider  SKIPPED
[INFO] Apache CloudStack Plugin - Storage Image sample provider  SKIPPED
[INFO] Apache CloudStack Plugin - Storage Volume Nexenta Provider  SKIPPED
[INFO] Apache CloudStack Plugin - Storage Volume SolidFire Provider  SKIPPED
[INFO] Apache CloudStack Plugin - Storage Volume default provider  SKIPPED
[INFO] Apache CloudStack Plugin - Storage Volume CloudByte Provider  SKIPPED
[INFO] Apache CloudStack Plugin - Storage Volume sample provider  SKIPPED
[INFO] Apache CloudStack Plugin - SNMP Alerts ............ SKIPPED
[INFO] Apache CloudStack Plugin - Syslog Alerts .......... SKIPPED
[INFO] Apache CloudStack Plugin - Network VXLAN .......... SKIPPED
[INFO] Apache CloudStack Framework - Spring Module ....... SKIPPED
[INFO] Apache CloudStack Secondary Storage Controller .... SKIPPED
[INFO] Apache CloudStack Client UI ....................... SKIPPED
[INFO] Apache CloudStack Console Proxy - RDP Client ...... SKIPPED
[INFO] Apache CloudStack Console Proxy ................... SKIPPED
[INFO] Apache CloudStack Console Proxy - Server .......... SKIPPED
[INFO] Apache CloudStack Framework - QuickCloud .......... SKIPPED
[INFO] ------------------------------------------------------------------------
[INFO] BUILD FAILURE
[INFO] ------------------------------------------------------------------------
[INFO] Total time: 7:21.210s
[INFO] Finished at: Mon Jun 23 02:35:23 EDT 2014
[INFO] Final Memory: 46M/225M
[INFO] ------------------------------------------------------------------------
[ERROR] Failed to execute goal org.apache.maven.plugins:maven-surefire-plugin:2.12:test (default-test)
on project cloud-engine-schema: There are test failures.
[ERROR] 
[ERROR] Please refer to <http://jenkins.buildacloud.org/job/cloudstack-4.4-forward-build/ws/engine/schema/target/surefire-reports>
for the individual test results.
[ERROR] -> [Help 1]
[ERROR] 
[ERROR] To see the full stack trace of the errors, re-run Maven with the -e switch.
[ERROR] Re-run Maven using the -X switch to enable full debug logging.
[ERROR] 
[ERROR] For more information about the errors and possible solutions, please read the following
articles:
[ERROR] [Help 1] http://cwiki.apache.org/confluence/display/MAVEN/MojoFailureException
[ERROR] 
[ERROR] After correcting the problems, you can resume the build with the command
[ERROR]   mvn <goals> -rf :cloud-engine-schema
Build step 'Invoke top-level Maven targets' marked build as failure

Mime
View raw message