cloudstack-dev mailing list archives

Site index · List index
Message view « Date » · « Thread »
Top « Date » · « Thread »
From jenk...@cloudstack.org
Subject Build failed in Jenkins: build-master #1008
Date Mon, 23 Jun 2014 13:05:10 GMT
See <http://jenkins.buildacloud.org/job/build-master/1008/changes>

Changes:

[Daan Hoogland] raw immage for ovm

------------------------------------------
[...truncated 197 lines...]
16/18 KB   
18/18 KB   
           
Downloaded: http://repo.maven.apache.org/maven2/commons-logging/commons-logging/1.1.1/commons-logging-1.1.1.pom
(18 KB at 1281.0 KB/sec)
Downloading: http://repo.maven.apache.org/maven2/org/apache/commons/commons-parent/5/commons-parent-5.pom
3/16 KB    
7/16 KB   
11/16 KB   
15/16 KB   
16/16 KB   
           
Downloaded: http://repo.maven.apache.org/maven2/org/apache/commons/commons-parent/5/commons-parent-5.pom
(16 KB at 921.5 KB/sec)
Downloading: http://repo.maven.apache.org/maven2/commons-codec/commons-codec/1.3/commons-codec-1.3.pom
4/6 KB     
6/6 KB   
         
Downloaded: http://repo.maven.apache.org/maven2/commons-codec/commons-codec/1.3/commons-codec-1.3.pom
(6 KB at 541.9 KB/sec)
Downloading: http://repo.maven.apache.org/maven2/org/apache/axis2/axis2-aar-maven-plugin/1.6.2/axis2-aar-maven-plugin-1.6.2.jar
Downloading: http://repo.maven.apache.org/maven2/org/apache/maven/maven-archiver/2.2/maven-archiver-2.2.jar
Downloading: http://repo.maven.apache.org/maven2/org/codehaus/plexus/plexus-archiver/1.0-alpha-7/plexus-archiver-1.0-alpha-7.jar
Downloading: http://repo.maven.apache.org/maven2/org/codehaus/plexus/plexus-utils/1.4.9/plexus-utils-1.4.9.jar
Downloading: http://repo.maven.apache.org/maven2/commons-httpclient/commons-httpclient/3.1/commons-httpclient-3.1.jar
3/21 KB   
7/21 KB   
7/21 KB   4/298 KB   
7/21 KB   8/298 KB   
7/21 KB   3/200 KB   8/298 KB   
7/21 KB   7/200 KB   8/298 KB   4/10 KB   
7/21 KB   11/200 KB   8/298 KB   4/10 KB   
11/21 KB   4/139 KB   11/200 KB   8/298 KB   4/10 KB   
11/21 KB   4/139 KB   15/200 KB   8/298 KB   4/10 KB   
15/21 KB   4/139 KB   15/200 KB   8/298 KB   4/10 KB   
7/21 KB   7/200 KB   8/298 KB   4/10 KB   
15/21 KB   4/139 KB   19/200 KB   8/298 KB   4/10 KB   
15/21 KB   4/139 KB   19/200 KB   8/298 KB   8/10 KB   
15/21 KB   4/139 KB   23/200 KB   8/298 KB   8/10 KB   
15/21 KB   4/139 KB   23/200 KB   8/298 KB   10/10 KB   
7/21 KB   4/139 KB   11/200 KB   8/298 KB   4/10 KB   
15/21 KB   4/139 KB   23/200 KB   12/298 KB   10/10 KB   
15/21 KB   8/139 KB   23/200 KB   12/298 KB   10/10 KB   
15/21 KB   8/139 KB   23/200 KB   16/298 KB   10/10 KB   
15/21 KB   12/139 KB   23/200 KB   16/298 KB   10/10 KB   
15/21 KB   12/139 KB   23/200 KB   20/298 KB   10/10 KB   
15/21 KB   16/139 KB   23/200 KB   20/298 KB   10/10 KB   
15/21 KB   16/139 KB   23/200 KB   24/298 KB   10/10 KB   
15/21 KB   20/139 KB   23/200 KB   28/298 KB   10/10 KB   
19/21 KB   20/139 KB   23/200 KB   28/298 KB   10/10 KB   
19/21 KB   20/139 KB   23/200 KB   32/298 KB   10/10 KB   
21/21 KB   20/139 KB   23/200 KB   32/298 KB   10/10 KB   
15/21 KB   20/139 KB   23/200 KB   24/298 KB   10/10 KB   
                                                          
21/21 KB   20/139 KB   27/200 KB   36/298 KB   10/10 KB   
21/21 KB   24/139 KB   27/200 KB   36/298 KB              
21/21 KB   24/139 KB   31/200 KB   36/298 KB   
21/21 KB   20/139 KB   23/200 KB   36/298 KB   10/10 KB   
21/21 KB   28/139 KB   31/200 KB   36/298 KB   
Downloaded: http://repo.maven.apache.org/maven2/org/apache/maven/maven-archiver/2.2/maven-archiver-2.2.jar
(10 KB at 425.4 KB/sec)
21/21 KB   28/139 KB   35/200 KB   40/298 KB   
21/21 KB   28/139 KB   35/200 KB   36/298 KB   
21/21 KB   32/139 KB   35/200 KB   40/298 KB   
21/21 KB   32/139 KB   35/200 KB   44/298 KB   
Downloading: http://repo.maven.apache.org/maven2/commons-logging/commons-logging/1.1.1/commons-logging-1.1.1.jar
21/21 KB   36/139 KB   39/200 KB   44/298 KB   
21/21 KB   32/139 KB   39/200 KB   44/298 KB   
21/21 KB   40/139 KB   39/200 KB   48/298 KB   
21/21 KB   36/139 KB   39/200 KB   48/298 KB   
                                               
Downloaded: http://repo.maven.apache.org/maven2/org/apache/axis2/axis2-aar-maven-plugin/1.6.2/axis2-aar-maven-plugin-1.6.2.jar
(21 KB at 730.2 KB/sec)
21/21 KB   40/139 KB   43/200 KB   48/298 KB   
44/139 KB   43/200 KB   48/298 KB              
44/139 KB   43/200 KB   52/298 KB   
44/139 KB   47/200 KB   52/298 KB   
48/139 KB   47/200 KB   52/298 KB   
48/139 KB   47/200 KB   56/298 KB   
48/139 KB   51/200 KB   56/298 KB   
52/139 KB   51/200 KB   56/298 KB   
Downloading: http://repo.maven.apache.org/maven2/commons-codec/commons-codec/1.3/commons-codec-1.3.jar
52/139 KB   51/200 KB   60/298 KB   
52/139 KB   51/200 KB   60/298 KB   3/60 KB   
56/139 KB   55/200 KB   60/298 KB   3/60 KB   
56/139 KB   55/200 KB   60/298 KB   7/60 KB   
56/139 KB   55/200 KB   64/298 KB   7/60 KB   
60/139 KB   55/200 KB   64/298 KB   7/60 KB   
60/139 KB   55/200 KB   68/298 KB   11/60 KB   
60/139 KB   55/200 KB   68/298 KB   11/60 KB   
64/139 KB   55/200 KB   68/298 KB   11/60 KB   
64/139 KB   55/200 KB   72/298 KB   11/60 KB   
64/139 KB   55/200 KB   72/298 KB   15/60 KB   
64/139 KB   55/200 KB   76/298 KB   15/60 KB   
68/139 KB   55/200 KB   76/298 KB   19/60 KB   
52/139 KB   55/200 KB   76/298 KB   19/60 KB   
72/139 KB   55/200 KB   80/298 KB   19/60 KB   
72/139 KB   59/200 KB   80/298 KB   19/60 KB   
72/139 KB   63/200 KB   80/298 KB   19/60 KB   
76/139 KB   63/200 KB   80/298 KB   19/60 KB   
76/139 KB   67/200 KB   80/298 KB   19/60 KB   
80/139 KB   67/200 KB   80/298 KB   19/60 KB   
80/139 KB   71/200 KB   80/298 KB   19/60 KB   
84/139 KB   71/200 KB   80/298 KB   19/60 KB   
68/139 KB   55/200 KB   76/298 KB   19/60 KB   
84/139 KB   75/200 KB   80/298 KB   3/46 KB   19/60 KB   
88/139 KB   75/200 KB   80/298 KB   3/46 KB   19/60 KB   
84/139 KB   71/200 KB   80/298 KB   3/46 KB   19/60 KB   
92/139 KB   79/200 KB   80/298 KB   3/46 KB   23/60 KB   
68/139 KB   55/200 KB   80/298 KB   19/60 KB   
96/139 KB   79/200 KB   80/298 KB   7/46 KB   23/60 KB   
92/139 KB   79/200 KB   80/298 KB   7/46 KB   23/60 KB   
88/139 KB   79/200 KB   80/298 KB   3/46 KB   23/60 KB   
88/139 KB   75/200 KB   80/298 KB   3/46 KB   23/60 KB   
100/139 KB   79/200 KB   84/298 KB   7/46 KB   23/60 KB   
100/139 KB   79/200 KB   84/298 KB   11/46 KB   23/60 KB   
100/139 KB   79/200 KB   84/298 KB   11/46 KB   27/60 KB   
104/139 KB   79/200 KB   84/298 KB   11/46 KB   27/60 KB   
104/139 KB   79/200 KB   84/298 KB   15/46 KB   31/60 KB   
104/139 KB   83/200 KB   84/298 KB   15/46 KB   31/60 KB   
108/139 KB   83/200 KB   84/298 KB   15/46 KB   31/60 KB   
108/139 KB   83/200 KB   84/298 KB   15/46 KB   35/60 KB   
96/139 KB   79/200 KB   84/298 KB   7/46 KB   23/60 KB   
112/139 KB   87/200 KB   84/298 KB   15/46 KB   35/60 KB   
112/139 KB   87/200 KB   84/298 KB   15/46 KB   39/60 KB   
108/139 KB   87/200 KB   84/298 KB   15/46 KB   35/60 KB   
116/139 KB   87/200 KB   88/298 KB   15/46 KB   39/60 KB   
104/139 KB   79/200 KB   84/298 KB   15/46 KB   27/60 KB   
116/139 KB   87/200 KB   88/298 KB   15/46 KB   43/60 KB   
116/139 KB   87/200 KB   88/298 KB   15/46 KB   47/60 KB   
116/139 KB   87/200 KB   88/298 KB   15/46 KB   51/60 KB   
116/139 KB   87/200 KB   88/298 KB   15/46 KB   55/60 KB   
120/139 KB   87/200 KB   88/298 KB   15/46 KB   55/60 KB   
120/139 KB   87/200 KB   88/298 KB   15/46 KB   59/60 KB   
124/139 KB   87/200 KB   88/298 KB   15/46 KB   59/60 KB   
124/139 KB   87/200 KB   88/298 KB   15/46 KB   60/60 KB   
128/139 KB   87/200 KB   88/298 KB   15/46 KB   60/60 KB   
128/139 KB   87/200 KB   88/298 KB   19/46 KB   60/60 KB   
132/139 KB   87/200 KB   88/298 KB   19/46 KB   60/60 KB   
112/139 KB   87/200 KB   88/298 KB   15/46 KB   39/60 KB   
136/139 KB   87/200 KB   88/298 KB   23/46 KB   60/60 KB   
132/139 KB   87/200 KB   88/298 KB   23/46 KB   60/60 KB   
136/139 KB   87/200 KB   92/298 KB   27/46 KB   60/60 KB   
139/139 KB   87/200 KB   92/298 KB   27/46 KB   60/60 KB   
139/139 KB   87/200 KB   92/298 KB   31/46 KB   60/60 KB   
139/139 KB   87/200 KB   92/298 KB   35/46 KB   60/60 KB   
136/139 KB   87/200 KB   92/298 KB   23/46 KB   60/60 KB   
139/139 KB   87/200 KB   92/298 KB   39/46 KB   60/60 KB   
139/139 KB   87/200 KB   96/298 KB   39/46 KB   60/60 KB   
139/139 KB   91/200 KB   96/298 KB   43/46 KB   60/60 KB   
139/139 KB   91/200 KB   100/298 KB   43/46 KB   60/60 KB   
139/139 KB   87/200 KB   96/298 KB   43/46 KB   60/60 KB   
139/139 KB   95/200 KB   104/298 KB   43/46 KB   60/60 KB   
139/139 KB   95/200 KB   104/298 KB   46/46 KB   60/60 KB   
139/139 KB   95/200 KB   108/298 KB   46/46 KB   60/60 KB   
139/139 KB   95/200 KB   112/298 KB   46/46 KB   60/60 KB   
                                                            
Downloaded: http://repo.maven.apache.org/maven2/commons-logging/commons-logging/1.1.1/commons-logging-1.1.1.jar
(60 KB at 1975.5 KB/sec)
139/139 KB   95/200 KB   116/298 KB   46/46 KB              
139/139 KB   95/200 KB   120/298 KB   46/46 KB   
                                                 
Downloaded: http://repo.maven.apache.org/maven2/org/codehaus/plexus/plexus-archiver/1.0-alpha-7/plexus-archiver-1.0-alpha-7.jar
(139 KB at 2719.8 KB/sec)
95/200 KB   124/298 KB   46/46 KB                
139/139 KB   95/200 KB   100/298 KB   43/46 KB   60/60 KB   
95/200 KB   128/298 KB   46/46 KB   
99/200 KB   128/298 KB   46/46 KB   
99/200 KB   132/298 KB   46/46 KB   
103/200 KB   132/298 KB   46/46 KB   
103/200 KB   136/298 KB   46/46 KB   
103/200 KB   140/298 KB   46/46 KB   
107/200 KB   140/298 KB   46/46 KB   
107/200 KB   144/298 KB   46/46 KB   
111/200 KB   144/298 KB   46/46 KB   
111/200 KB   148/298 KB   46/46 KB   
115/200 KB   148/298 KB              
                                     
119/200 KB   152/298 KB   
Downloaded: http://repo.maven.apache.org/maven2/commons-codec/commons-codec/1.3/commons-codec-1.3.jar
(46 KB at 1521.0 KB/sec)
123/200 KB   152/298 KB   
127/200 KB   152/298 KB   
115/200 KB   152/298 KB   
131/200 KB   152/298 KB   
131/200 KB   156/298 KB   
135/200 KB   156/298 KB   
135/200 KB   160/298 KB   
139/200 KB   160/298 KB   
139/200 KB   164/298 KB   
143/200 KB   164/298 KB   
143/200 KB   168/298 KB   
147/200 KB   168/298 KB   
147/200 KB   172/298 KB   
151/200 KB   172/298 KB   
151/200 KB   176/298 KB   
155/200 KB   176/298 KB   
155/200 KB   180/298 KB   
159/200 KB   180/298 KB   
159/200 KB   184/298 KB   
163/200 KB   184/298 KB   
163/200 KB   188/298 KB   
167/200 KB   188/298 KB   
167/200 KB   192/298 KB   
171/200 KB   192/298 KB   
171/200 KB   196/298 KB   
175/200 KB   196/298 KB   
175/200 KB   200/298 KB   
179/200 KB   200/298 KB   
179/200 KB   204/298 KB   
183/200 KB   204/298 KB   
183/200 KB   208/298 KB   
187/200 KB   208/298 KB   
187/200 KB   212/298 KB   
191/200 KB   212/298 KB   
191/200 KB   216/298 KB   
195/200 KB   216/298 KB   
195/200 KB   220/298 KB   
199/200 KB   220/298 KB   
199/200 KB   224/298 KB   
200/200 KB   224/298 KB   
200/200 KB   228/298 KB   
200/200 KB   232/298 KB   
200/200 KB   236/298 KB   
200/200 KB   240/298 KB   
200/200 KB   244/298 KB   
200/200 KB   248/298 KB   
200/200 KB   252/298 KB   
200/200 KB   256/298 KB   
200/200 KB   260/298 KB   
200/200 KB   264/298 KB   
200/200 KB   268/298 KB   
200/200 KB   272/298 KB   
200/200 KB   276/298 KB   
200/200 KB   280/298 KB   
200/200 KB   284/298 KB   
200/200 KB   288/298 KB   
200/200 KB   292/298 KB   
200/200 KB   296/298 KB   
                          
298/298 KB                
Downloaded: http://repo.maven.apache.org/maven2/org/codehaus/plexus/plexus-utils/1.4.9/plexus-utils-1.4.9.jar
(200 KB at 3065.1 KB/sec)
             
Downloaded: http://repo.maven.apache.org/maven2/commons-httpclient/commons-httpclient/3.1/commons-httpclient-3.1.jar
(298 KB at 4255.0 KB/sec)
[ERROR] The build could not read 1 project -> [Help 1]
[ERROR]   
[ERROR]   The project org.apache.cloudstack:cloud-plugin-hypervisor-ovm3:4.4.0-SNAPSHOT (<http://jenkins.buildacloud.org/job/build-master/ws/plugins/hypervisors/ovm3/pom.xml)>
has 1 error
[ERROR]     Non-resolvable parent POM: Could not find artifact org.apache.cloudstack:cloudstack-plugins:pom:4.4.0-SNAPSHOT
and 'parent.relativePath' points at wrong local POM @ line 23, column 11 -> [Help 2]
[ERROR] 
[ERROR] To see the full stack trace of the errors, re-run Maven with the -e switch.
[ERROR] Re-run Maven using the -X switch to enable full debug logging.
[ERROR] 
[ERROR] For more information about the errors and possible solutions, please read the following
articles:
[ERROR] [Help 1] http://cwiki.apache.org/confluence/display/MAVEN/ProjectBuildingException
[ERROR] [Help 2] http://cwiki.apache.org/confluence/display/MAVEN/UnresolvableModelException
Build step 'Invoke top-level Maven targets' marked build as failure
Recording test results

Mime
View raw message