cloudstack-dev mailing list archives

Site index · List index
Message view « Date » · « Thread »
Top « Date » · « Thread »
From jenk...@cloudstack.org
Subject Build failed in Jenkins: build-master #1007
Date Mon, 23 Jun 2014 10:45:55 GMT
See <http://jenkins.buildacloud.org/job/build-master/1007/changes>

Changes:

[Daan Hoogland] CLOUDSTACK-6967: Initial OVM3 drop

[Daan Hoogland] CLOUDSTACK-6967: Now with module!

------------------------------------------
Started by an SCM change
[EnvInject] - Loading node environment variables.
Building remotely on cloudstack-buildslave-centos6-cb6 (cloudstack-buildslave-centos6) in
workspace <http://jenkins.buildacloud.org/job/build-master/ws/>
Fetching changes from the remote Git repository
Fetching upstream changes from https://git-wip-us.apache.org/repos/asf/cloudstack.git
Checking out Revision 189972bc7c9e73abff392429eda298f9f837992e (origin/master)
[copy-to-slave] Copying 'settings.xml', excluding nothing, from 'file:/var/lib/jenkins/userContent/'
on the master to '<http://jenkins.buildacloud.org/job/build-master/ws/'> on 'cloudstack-buildslave-centos6-cb6'.
[build-master] $ /jenkins/tools/hudson.tasks.Maven_MavenInstallation/maven-3.1.1/bin/mvn -s
<http://jenkins.buildacloud.org/job/build-master/ws/settings.xml> -Psystemvm,awsapi
clean test
[INFO] Scanning for projects...
[ERROR] The build could not read 1 project -> [Help 1]
[ERROR]   
[ERROR]   The project org.apache.cloudstack:cloud-plugin-hypervisor-ovm3:4.4.0-SNAPSHOT (<http://jenkins.buildacloud.org/job/build-master/ws/plugins/hypervisors/ovm3/pom.xml)>
has 1 error
[ERROR]     Non-resolvable parent POM: Could not find artifact org.apache.cloudstack:cloudstack-plugins:pom:4.4.0-SNAPSHOT
and 'parent.relativePath' points at wrong local POM @ line 23, column 11 -> [Help 2]
[ERROR] 
[ERROR] To see the full stack trace of the errors, re-run Maven with the -e switch.
[ERROR] Re-run Maven using the -X switch to enable full debug logging.
[ERROR] 
[ERROR] For more information about the errors and possible solutions, please read the following
articles:
[ERROR] [Help 1] http://cwiki.apache.org/confluence/display/MAVEN/ProjectBuildingException
[ERROR] [Help 2] http://cwiki.apache.org/confluence/display/MAVEN/UnresolvableModelException
Build step 'Invoke top-level Maven targets' marked build as failure
Recording test results

Mime
View raw message