cloudstack-dev mailing list archives

Site index · List index
Message view « Date » · « Thread »
Top « Date » · « Thread »
From jenk...@cloudstack.org
Subject Build failed in Jenkins: cloudstack-4.4-forward-build #261
Date Wed, 18 Jun 2014 18:11:54 GMT
See <http://jenkins.buildacloud.org/job/cloudstack-4.4-forward-build/261/changes>

Changes:

[mail] CLOUDSTACK-6935 refactor StoragePoolAllocator#filter logic

------------------------------------------
[...truncated 1493 lines...]
[INFO] --- maven-resources-plugin:2.5:resources (default-resources) @ xapi ---
[debug] execute contextualize
[INFO] Using 'UTF-8' encoding to copy filtered resources.
[INFO] skip non existing resourceDirectory <http://jenkins.buildacloud.org/job/cloudstack-4.4-forward-build/ws/deps/XenServerJava/resources>
[INFO] Copying 3 resources
[INFO] 
[INFO] --- maven-compiler-plugin:2.5.1:compile (default-compile) @ xapi ---
[INFO] Compiling 51 source files to <http://jenkins.buildacloud.org/job/cloudstack-4.4-forward-build/ws/deps/XenServerJava/target/classes>
[INFO] 
[INFO] --- maven-resources-plugin:2.5:testResources (default-testResources) @ xapi ---
[debug] execute contextualize
[INFO] Using 'UTF-8' encoding to copy filtered resources.
[INFO] skip non existing resourceDirectory <http://jenkins.buildacloud.org/job/cloudstack-4.4-forward-build/ws/deps/XenServerJava/test/resources>
[INFO] Copying 3 resources
[INFO] 
[INFO] --- maven-compiler-plugin:2.5.1:testCompile (default-testCompile) @ xapi ---
[INFO] No sources to compile
[INFO] 
[INFO] --- maven-surefire-plugin:2.12:test (default-test) @ xapi ---
[INFO] Surefire report directory: <http://jenkins.buildacloud.org/job/cloudstack-4.4-forward-build/ws/deps/XenServerJava/target/surefire-reports>

-------------------------------------------------------
 T E S T S
-------------------------------------------------------

Results :

Tests run: 0, Failures: 0, Errors: 0, Skipped: 0

[INFO]                                                                         
[INFO] ------------------------------------------------------------------------
[INFO] Building Apache CloudStack Cloud Engine Orchestration Component 4.4.0-SNAPSHOT
[INFO] ------------------------------------------------------------------------
[INFO] 
[INFO] --- maven-clean-plugin:2.5:clean (default-clean) @ cloud-engine-orchestration ---
[INFO] Deleting <http://jenkins.buildacloud.org/job/cloudstack-4.4-forward-build/ws/engine/orchestration>
(includes = [target, dist], excludes = [])
[INFO] 
[INFO] --- maven-checkstyle-plugin:2.11:check (cloudstack-checkstyle) @ cloud-engine-orchestration
---
[INFO] Starting audit...
Audit done.

[INFO] 
[INFO] --- maven-remote-resources-plugin:1.3:process (default) @ cloud-engine-orchestration
---
[INFO] 
[INFO] --- maven-resources-plugin:2.5:resources (default-resources) @ cloud-engine-orchestration
---
[debug] execute contextualize
[INFO] Using 'UTF-8' encoding to copy filtered resources.
[INFO] Copying 1 resource
[INFO] Copying 3 resources
[INFO] 
[INFO] --- maven-compiler-plugin:2.5.1:compile (default-compile) @ cloud-engine-orchestration
---
[INFO] Compiling 68 source files to <http://jenkins.buildacloud.org/job/cloudstack-4.4-forward-build/ws/engine/orchestration/target/classes>
[INFO] 
[INFO] --- maven-resources-plugin:2.5:testResources (default-testResources) @ cloud-engine-orchestration
---
[debug] execute contextualize
[INFO] Using 'UTF-8' encoding to copy filtered resources.
[INFO] skip non existing resourceDirectory <http://jenkins.buildacloud.org/job/cloudstack-4.4-forward-build/ws/engine/orchestration/test/resources>
[INFO] Copying 3 resources
[INFO] 
[INFO] --- maven-compiler-plugin:2.5.1:testCompile (default-testCompile) @ cloud-engine-orchestration
---
[INFO] Compiling 5 source files to <http://jenkins.buildacloud.org/job/cloudstack-4.4-forward-build/ws/engine/orchestration/target/test-classes>
[INFO] 
[INFO] --- maven-surefire-plugin:2.12:test (default-test) @ cloud-engine-orchestration ---
[INFO] Tests are skipped.
[INFO]                                                                         
[INFO] ------------------------------------------------------------------------
[INFO] Building Apache CloudStack Cloud Services 4.4.0-SNAPSHOT
[INFO] ------------------------------------------------------------------------
[INFO] 
[INFO] --- maven-clean-plugin:2.5:clean (default-clean) @ cloudstack-services ---
[INFO] Deleting <http://jenkins.buildacloud.org/job/cloudstack-4.4-forward-build/ws/services>
(includes = [target, dist], excludes = [])
[INFO] 
[INFO] --- maven-remote-resources-plugin:1.3:process (default) @ cloudstack-services ---
[INFO]                                                                         
[INFO] ------------------------------------------------------------------------
[INFO] Building Apache CloudStack Secondary Storage 4.4.0-SNAPSHOT
[INFO] ------------------------------------------------------------------------
[INFO] 
[INFO] --- maven-clean-plugin:2.5:clean (default-clean) @ cloudstack-service-secondary-storage
---
[INFO] Deleting <http://jenkins.buildacloud.org/job/cloudstack-4.4-forward-build/ws/services/secondary-storage>
(includes = [target, dist], excludes = [])
[INFO] 
[INFO] --- maven-checkstyle-plugin:2.11:check (cloudstack-checkstyle) @ cloudstack-service-secondary-storage
---
[INFO] Starting audit...
Audit done.

[INFO] 
[INFO] --- maven-remote-resources-plugin:1.3:process (default) @ cloudstack-service-secondary-storage
---
[INFO]                                                                         
[INFO] ------------------------------------------------------------------------
[INFO] Building Apache CloudStack Secondary Storage Service 4.4.0-SNAPSHOT
[INFO] ------------------------------------------------------------------------
[INFO] 
[INFO] --- maven-clean-plugin:2.5:clean (default-clean) @ cloud-secondary-storage ---
[INFO] Deleting <http://jenkins.buildacloud.org/job/cloudstack-4.4-forward-build/ws/services/secondary-storage/server>
(includes = [target, dist], excludes = [])
[INFO] 
[INFO] --- maven-checkstyle-plugin:2.11:check (cloudstack-checkstyle) @ cloud-secondary-storage
---
[INFO] Starting audit...
Audit done.

[INFO] 
[INFO] --- maven-remote-resources-plugin:1.3:process (default) @ cloud-secondary-storage ---
[INFO] 
[INFO] --- maven-resources-plugin:2.5:resources (default-resources) @ cloud-secondary-storage
---
[debug] execute contextualize
[INFO] Using 'UTF-8' encoding to copy filtered resources.
[INFO] Copying 2 resources
[INFO] Copying 3 resources
[INFO] 
[INFO] --- maven-compiler-plugin:2.5.1:compile (default-compile) @ cloud-secondary-storage
---
[INFO] Compiling 10 source files to <http://jenkins.buildacloud.org/job/cloudstack-4.4-forward-build/ws/services/secondary-storage/server/target/classes>
[INFO] 
[INFO] --- maven-resources-plugin:2.5:testResources (default-testResources) @ cloud-secondary-storage
---
[debug] execute contextualize
[INFO] Using 'UTF-8' encoding to copy filtered resources.
[INFO] skip non existing resourceDirectory <http://jenkins.buildacloud.org/job/cloudstack-4.4-forward-build/ws/services/secondary-storage/server/test/resources>
[INFO] Copying 3 resources
[INFO] 
[INFO] --- maven-compiler-plugin:2.5.1:testCompile (default-testCompile) @ cloud-secondary-storage
---
[INFO] Compiling 2 source files to <http://jenkins.buildacloud.org/job/cloudstack-4.4-forward-build/ws/services/secondary-storage/server/target/test-classes>
[INFO] 
[INFO] --- maven-surefire-plugin:2.12:test (default-test) @ cloud-secondary-storage ---
[INFO] Tests are skipped.
[INFO]                                                                         
[INFO] ------------------------------------------------------------------------
[INFO] Building Apache CloudStack Engine Storage Component 4.4.0-SNAPSHOT
[INFO] ------------------------------------------------------------------------
[INFO] 
[INFO] --- maven-clean-plugin:2.5:clean (default-clean) @ cloud-engine-storage ---
[INFO] Deleting <http://jenkins.buildacloud.org/job/cloudstack-4.4-forward-build/ws/engine/storage>
(includes = [target, dist], excludes = [])
[INFO] 
[INFO] --- maven-checkstyle-plugin:2.11:check (cloudstack-checkstyle) @ cloud-engine-storage
---
[INFO] Starting audit...
<http://jenkins.buildacloud.org/job/cloudstack-4.4-forward-build/ws/engine/storage/src/org/apache/cloudstack/storage/allocator/ZoneWideStoragePoolAllocator.java>:37:8:
Unused import - com.cloud.storage.Volume.
Audit done.

[INFO] ------------------------------------------------------------------------
[INFO] Reactor Summary:
[INFO] 
[INFO] Apache CloudStack Developer Tools - Checkstyle Configuration  SUCCESS [0.649s]
[INFO] Apache CloudStack ................................. SUCCESS [0.596s]
[INFO] Apache CloudStack Maven Conventions Parent ........ SUCCESS [1.024s]
[INFO] Apache CloudStack Framework - Managed Context ..... SUCCESS [2.496s]
[INFO] Apache CloudStack Utils ........................... SUCCESS [10.085s]
[INFO] Apache CloudStack Framework ....................... SUCCESS [0.039s]
[INFO] Apache CloudStack Framework - Event Notification .. SUCCESS [5.715s]
[INFO] Apache CloudStack Framework - Configuration ....... SUCCESS [3.537s]
[INFO] Apache CloudStack API ............................. SUCCESS [10.304s]
[INFO] Apache CloudStack Framework - REST ................ SUCCESS [2.345s]
[INFO] Apache CloudStack Framework - IPC ................. SUCCESS [4.963s]
[INFO] Apache CloudStack Cloud Engine .................... SUCCESS [0.034s]
[INFO] Apache CloudStack Cloud Engine API ................ SUCCESS [3.700s]
[INFO] Apache CloudStack Framework - Security ............ SUCCESS [1.882s]
[INFO] Apache CloudStack Core ............................ SUCCESS [7.696s]
[INFO] Apache CloudStack Agents .......................... SUCCESS [4.390s]
[INFO] Apache CloudStack Framework - Clustering .......... SUCCESS [2.427s]
[INFO] Apache CloudStack Framework - Event Notification .. SUCCESS [1.484s]
[INFO] Apache CloudStack Cloud Engine Schema Component ... SUCCESS [10.569s]
[INFO] Apache CloudStack Framework - Jobs ................ SUCCESS [4.081s]
[INFO] Apache CloudStack Cloud Engine Internal Components API  SUCCESS [2.524s]
[INFO] Apache CloudStack Server .......................... SUCCESS [31.727s]
[INFO] Apache CloudStack Usage Server .................... SUCCESS [5.183s]
[INFO] Apache XenSource XAPI ............................. SUCCESS [3.906s]
[INFO] Apache CloudStack Cloud Engine Orchestration Component  SUCCESS [7.177s]
[INFO] Apache CloudStack Cloud Services .................. SUCCESS [0.028s]
[INFO] Apache CloudStack Secondary Storage ............... SUCCESS [0.241s]
[INFO] Apache CloudStack Secondary Storage Service ....... SUCCESS [3.988s]
[INFO] Apache CloudStack Engine Storage Component ........ FAILURE [0.415s]
[INFO] Apache CloudStack Engine Storage Volume Component . SKIPPED
[INFO] Apache CloudStack Engine Storage Image Component .. SKIPPED
[INFO] Apache CloudStack Engine Storage Data Motion Component  SKIPPED
[INFO] Apache CloudStack Engine Storage Cache Component .. SKIPPED
[INFO] Apache CloudStack Engine Storage Snapshot Component  SKIPPED
[INFO] Apache CloudStack Cloud Engine API ................ SKIPPED
[INFO] Apache CloudStack Cloud Engine Service ............ SKIPPED
[INFO] Apache CloudStack Plugin POM ...................... SKIPPED
[INFO] Apache CloudStack Plugin - API Rate Limit ......... SKIPPED
[INFO] Apache CloudStack Plugin - API Discovery .......... SKIPPED
[INFO] Apache CloudStack Plugin - ACL Static Role Based .. SKIPPED
[INFO] Apache CloudStack Plugin - Host Anti-Affinity Processor  SKIPPED
[INFO] Apache CloudStack Plugin - Explicit Dedication Processor  SKIPPED
[INFO] Apache CloudStack Plugin - User Concentrated Pod Deployment Planner  SKIPPED
[INFO] Apache CloudStack Plugin - User Dispersing Deployment Planner  SKIPPED
[INFO] Apache CloudStack Plugin - Implicit Dedication Planner  SKIPPED
[INFO] Apache CloudStack Plugin - Skip Heurestics Planner  SKIPPED
[INFO] Apache CloudStack Plugin - Host Allocator Random .. SKIPPED
[INFO] Apache CloudStack Plugin - Dedicated Resources .... SKIPPED
[INFO] Apache CloudStack Plugin - Hypervisor OracleVM .... SKIPPED
[INFO] Apache CloudStack Plugin - Open vSwitch ........... SKIPPED
[INFO] Apache CloudStack Plugin - Hypervisor Xen ......... SKIPPED
[INFO] Apache CloudStack Plugin - Hypervisor KVM ......... SKIPPED
[INFO] Apache CloudStack Plugin - RabbitMQ Event Bus ..... SKIPPED
[INFO] Apache CloudStack Plugin - In Memory Event Bus .... SKIPPED
[INFO] Apache CloudStack Plugin - Hypervisor Baremetal ... SKIPPED
[INFO] Apache CloudStack Plugin - Hypervisor UCS ......... SKIPPED
[INFO] Apache CloudStack Plugin - Hypervisor Hyper-V ..... SKIPPED
[INFO] Apache CloudStack Plugin - Network Elastic Load Balancer  SKIPPED
[INFO] Apache CloudStack Plugin - Network Internal Load Balancer  SKIPPED
[INFO] Apache CloudStack Framework - Spring Life Cycle ... SKIPPED
[INFO] Apache CloudStack Plugin - Network Juniper Contrail  SKIPPED
[INFO] Apache CloudStack Plugin - Palo Alto .............. SKIPPED
[INFO] Apache CloudStack Plugin - Network Netscaler ...... SKIPPED
[INFO] Apache CloudStack Plugin - Network Nicira NVP ..... SKIPPED
[INFO] Apache CloudStack Plugin - BigSwitch Virtual Network Segment  SKIPPED
[INFO] Apache CloudStack Plugin - Midokura Midonet ....... SKIPPED
[INFO] Apache CloudStack Plugin - Stratosphere SSP ....... SKIPPED
[INFO] Apache CloudStack Plugin - Network Opendaylight ... SKIPPED
[INFO] Apache CloudStack Plugin - Storage Allocator Random  SKIPPED
[INFO] Apache CloudStack Plugin - User Authenticator LDAP  SKIPPED
[INFO] Apache CloudStack Plugin - User Authenticator MD5 . SKIPPED
[INFO] Apache CloudStack Plugin - User Authenticator Plain Text  SKIPPED
[INFO] Apache CloudStack Plugin - User Authenticator SHA256 Salted  SKIPPED
[INFO] Apache CloudStack Plugin - Dns Notifier Example ... SKIPPED
[INFO] Apache CloudStack Plugin - Storage Image S3 ....... SKIPPED
[INFO] Apache CloudStack Plugin - Storage Image Swift provider  SKIPPED
[INFO] Apache CloudStack Plugin - Storage Image default provider  SKIPPED
[INFO] Apache CloudStack Plugin - Storage Image sample provider  SKIPPED
[INFO] Apache CloudStack Plugin - Storage Volume Nexenta Provider  SKIPPED
[INFO] Apache CloudStack Plugin - Storage Volume SolidFire Provider  SKIPPED
[INFO] Apache CloudStack Plugin - Storage Volume default provider  SKIPPED
[INFO] Apache CloudStack Plugin - Storage Volume CloudByte Provider  SKIPPED
[INFO] Apache CloudStack Plugin - Storage Volume sample provider  SKIPPED
[INFO] Apache CloudStack Plugin - SNMP Alerts ............ SKIPPED
[INFO] Apache CloudStack Plugin - Syslog Alerts .......... SKIPPED
[INFO] Apache CloudStack Plugin - Network VXLAN .......... SKIPPED
[INFO] Apache CloudStack Framework - Spring Module ....... SKIPPED
[INFO] Apache CloudStack Secondary Storage Controller .... SKIPPED
[INFO] Apache CloudStack Client UI ....................... SKIPPED
[INFO] Apache CloudStack Console Proxy - RDP Client ...... SKIPPED
[INFO] Apache CloudStack Console Proxy ................... SKIPPED
[INFO] Apache CloudStack Console Proxy - Server .......... SKIPPED
[INFO] Apache CloudStack Framework - QuickCloud .......... SKIPPED
[INFO] ------------------------------------------------------------------------
[INFO] BUILD FAILURE
[INFO] ------------------------------------------------------------------------
[INFO] Total time: 2:14.931s
[INFO] Finished at: Wed Jun 18 20:11:53 CEST 2014
[INFO] Final Memory: 53M/334M
[INFO] ------------------------------------------------------------------------
[ERROR] Failed to execute goal org.apache.maven.plugins:maven-checkstyle-plugin:2.11:check
(cloudstack-checkstyle) on project cloud-engine-storage: Failed during checkstyle execution:
There are 1 checkstyle errors. -> [Help 1]
[ERROR] 
[ERROR] To see the full stack trace of the errors, re-run Maven with the -e switch.
[ERROR] Re-run Maven using the -X switch to enable full debug logging.
[ERROR] 
[ERROR] For more information about the errors and possible solutions, please read the following
articles:
[ERROR] [Help 1] http://cwiki.apache.org/confluence/display/MAVEN/MojoExecutionException
[ERROR] 
[ERROR] After correcting the problems, you can resume the build with the command
[ERROR]   mvn <goals> -rf :cloud-engine-storage
Build step 'Invoke top-level Maven targets' marked build as failure

Mime
View raw message