cloudstack-dev mailing list archives

Site index · List index
Message view « Date » · « Thread »
Top « Date » · « Thread »
From jenk...@cloudstack.org
Subject Build failed in Jenkins: cloudstack-4.4-forward-build #152
Date Mon, 26 May 2014 05:40:30 GMT
See <http://jenkins.buildacloud.org/job/cloudstack-4.4-forward-build/152/changes>

Changes:

[aprateek] Added fix for CLOUDSTACK-6529

[aprateek] CLOUDSTACK-6758: [Marvin] Detect failed job and throw exception

[aprateek] CLOUDSTACK-6282-Added Automated testes for Networks and VPC API's

[aprateek] Fixed issues in regression suite project cpu limits

------------------------------------------
[...truncated 20797 lines...]
[INFO] Copying 3 resources
[INFO] 
[INFO] --- maven-compiler-plugin:2.5.1:compile (default-compile) @ cloud-plugin-hypervisor-ovm
---
[INFO] Compiling 18 source files to <http://jenkins.buildacloud.org/job/cloudstack-4.4-forward-build/ws/plugins/hypervisors/ovm/target/classes>
[INFO] 
[INFO] --- maven-resources-plugin:2.5:testResources (default-testResources) @ cloud-plugin-hypervisor-ovm
---
[debug] execute contextualize
[INFO] Using 'UTF-8' encoding to copy filtered resources.
[INFO] skip non existing resourceDirectory <http://jenkins.buildacloud.org/job/cloudstack-4.4-forward-build/ws/plugins/hypervisors/ovm/test/resources>
[INFO] Copying 3 resources
[INFO] 
[INFO] --- maven-compiler-plugin:2.5.1:testCompile (default-testCompile) @ cloud-plugin-hypervisor-ovm
---
[INFO] No sources to compile
[INFO] 
[INFO] --- maven-surefire-plugin:2.12:test (default-test) @ cloud-plugin-hypervisor-ovm ---
[INFO] Surefire report directory: <http://jenkins.buildacloud.org/job/cloudstack-4.4-forward-build/ws/plugins/hypervisors/ovm/target/surefire-reports>

-------------------------------------------------------
 T E S T S
-------------------------------------------------------

Results :

Tests run: 0, Failures: 0, Errors: 0, Skipped: 0

[INFO]                                                                         
[INFO] ------------------------------------------------------------------------
[INFO] Building Apache CloudStack Plugin - Open vSwitch 4.4.0-SNAPSHOT
[INFO] ------------------------------------------------------------------------
[INFO] 
[INFO] --- maven-clean-plugin:2.5:clean (default-clean) @ cloud-plugin-network-ovs ---
[INFO] Deleting <http://jenkins.buildacloud.org/job/cloudstack-4.4-forward-build/ws/plugins/network-elements/ovs>
(includes = [target, dist], excludes = [])
[INFO] 
[INFO] --- maven-checkstyle-plugin:2.11:check (cloudstack-checkstyle) @ cloud-plugin-network-ovs
---
[INFO] Starting audit...
Audit done.

[INFO] 
[INFO] --- maven-remote-resources-plugin:1.3:process (default) @ cloud-plugin-network-ovs
---
[INFO] 
[INFO] --- maven-resources-plugin:2.5:resources (default-resources) @ cloud-plugin-network-ovs
---
[debug] execute contextualize
[INFO] Using 'UTF-8' encoding to copy filtered resources.
[INFO] Copying 2 resources
[INFO] Copying 3 resources
[INFO] 
[INFO] --- maven-compiler-plugin:2.5.1:compile (default-compile) @ cloud-plugin-network-ovs
---
[INFO] Compiling 33 source files to <http://jenkins.buildacloud.org/job/cloudstack-4.4-forward-build/ws/plugins/network-elements/ovs/target/classes>
[INFO] 
[INFO] --- maven-resources-plugin:2.5:testResources (default-testResources) @ cloud-plugin-network-ovs
---
[debug] execute contextualize
[INFO] Using 'UTF-8' encoding to copy filtered resources.
[INFO] skip non existing resourceDirectory <http://jenkins.buildacloud.org/job/cloudstack-4.4-forward-build/ws/plugins/network-elements/ovs/test/resources>
[INFO] Copying 3 resources
[INFO] 
[INFO] --- maven-compiler-plugin:2.5.1:testCompile (default-testCompile) @ cloud-plugin-network-ovs
---
[INFO] No sources to compile
[INFO] 
[INFO] --- maven-surefire-plugin:2.12:test (default-test) @ cloud-plugin-network-ovs ---
[INFO] Surefire report directory: <http://jenkins.buildacloud.org/job/cloudstack-4.4-forward-build/ws/plugins/network-elements/ovs/target/surefire-reports>

-------------------------------------------------------
 T E S T S
-------------------------------------------------------

Results :

Tests run: 0, Failures: 0, Errors: 0, Skipped: 0

[INFO]                                                                         
[INFO] ------------------------------------------------------------------------
[INFO] Building Apache CloudStack Plugin - Hypervisor Xen 4.4.0-SNAPSHOT
[INFO] ------------------------------------------------------------------------
[INFO] 
[INFO] --- maven-clean-plugin:2.5:clean (default-clean) @ cloud-plugin-hypervisor-xen ---
[INFO] Deleting <http://jenkins.buildacloud.org/job/cloudstack-4.4-forward-build/ws/plugins/hypervisors/xen>
(includes = [target, dist], excludes = [])
[INFO] 
[INFO] --- maven-checkstyle-plugin:2.11:check (cloudstack-checkstyle) @ cloud-plugin-hypervisor-xen
---
[INFO] Starting audit...
Audit done.

[INFO] 
[INFO] --- maven-remote-resources-plugin:1.3:process (default) @ cloud-plugin-hypervisor-xen
---
[INFO] 
[INFO] --- maven-resources-plugin:2.5:resources (default-resources) @ cloud-plugin-hypervisor-xen
---
[debug] execute contextualize
[INFO] Using 'UTF-8' encoding to copy filtered resources.
[INFO] Copying 4 resources
[INFO] Copying 3 resources
[INFO] 
[INFO] --- maven-compiler-plugin:2.5.1:compile (default-compile) @ cloud-plugin-hypervisor-xen
---
[INFO] Compiling 24 source files to <http://jenkins.buildacloud.org/job/cloudstack-4.4-forward-build/ws/plugins/hypervisors/xen/target/classes>
[INFO] 
[INFO] --- maven-resources-plugin:2.5:testResources (default-testResources) @ cloud-plugin-hypervisor-xen
---
[debug] execute contextualize
[INFO] Using 'UTF-8' encoding to copy filtered resources.
[INFO] skip non existing resourceDirectory <http://jenkins.buildacloud.org/job/cloudstack-4.4-forward-build/ws/plugins/hypervisors/xen/test/resources>
[INFO] Copying 3 resources
[INFO] 
[INFO] --- maven-compiler-plugin:2.5.1:testCompile (default-testCompile) @ cloud-plugin-hypervisor-xen
---
[INFO] Compiling 2 source files to <http://jenkins.buildacloud.org/job/cloudstack-4.4-forward-build/ws/plugins/hypervisors/xen/target/test-classes>
[INFO] 
[INFO] --- maven-surefire-plugin:2.12:test (default-test) @ cloud-plugin-hypervisor-xen ---
[INFO] Surefire report directory: <http://jenkins.buildacloud.org/job/cloudstack-4.4-forward-build/ws/plugins/hypervisors/xen/target/surefire-reports>

-------------------------------------------------------
 T E S T S
-------------------------------------------------------
Running com.cloud.hypervisor.xen.resource.CitrixResourceBaseTest
log4j:WARN No appenders could be found for logger (com.cloud.hypervisor.xen.resource.XenServerConnectionPool).
log4j:WARN Please initialize the log4j system properly.
log4j:WARN See http://logging.apache.org/log4j/1.2/faq.html#noconfig for more info.
Tests run: 4, Failures: 0, Errors: 0, Skipped: 0, Time elapsed: 1.045 sec
Running com.cloud.ha.XenServerFencerTest
Tests run: 1, Failures: 0, Errors: 0, Skipped: 0, Time elapsed: 0.005 sec

Results :

Tests run: 5, Failures: 0, Errors: 0, Skipped: 0

[INFO]                                                                         
[INFO] ------------------------------------------------------------------------
[INFO] Building Apache CloudStack Plugin - Hypervisor KVM 4.4.0-SNAPSHOT
[INFO] ------------------------------------------------------------------------
[WARNING] The POM for org.libvirt:libvirt:jar:0.5.1 is missing, no dependency information
available
Downloading: http://ceph.com/maven/com/ceph/rados/0.1.4/rados-0.1.4.jar
Downloading: http://ceph.com/maven/net/java/dev/jna/jna/4.0.0/jna-4.0.0.jar
4/18 KB                 
8/18 KB   
12/18 KB   
16/18 KB   
18/18 KB   
           
           
Downloaded: http://ceph.com/maven/com/ceph/rados/0.1.4/rados-0.1.4.jar (18 KB at 23.1 KB/sec)
[INFO] ------------------------------------------------------------------------
[INFO] Reactor Summary:
[INFO] 
[INFO] Apache CloudStack Developer Tools - Checkstyle Configuration  SUCCESS [2.905s]
[INFO] Apache CloudStack ................................. SUCCESS [2.136s]
[INFO] Apache CloudStack Maven Conventions Parent ........ SUCCESS [2.687s]
[INFO] Apache CloudStack Framework - Managed Context ..... SUCCESS [3.555s]
[INFO] Apache CloudStack Utils ........................... SUCCESS [17.009s]
[INFO] Apache CloudStack Framework ....................... SUCCESS [0.046s]
[INFO] Apache CloudStack Framework - Event Notification .. SUCCESS [7.397s]
[INFO] Apache CloudStack Framework - Configuration ....... SUCCESS [4.124s]
[INFO] Apache CloudStack API ............................. SUCCESS [13.953s]
[INFO] Apache CloudStack Framework - REST ................ SUCCESS [3.187s]
[INFO] Apache CloudStack Framework - IPC ................. SUCCESS [5.640s]
[INFO] Apache CloudStack Cloud Engine .................... SUCCESS [0.033s]
[INFO] Apache CloudStack Cloud Engine API ................ SUCCESS [4.499s]
[INFO] Apache CloudStack Framework - Security ............ SUCCESS [2.525s]
[INFO] Apache CloudStack Core ............................ SUCCESS [10.042s]
[INFO] Apache CloudStack Agents .......................... SUCCESS [5.750s]
[INFO] Apache CloudStack Framework - Clustering .......... SUCCESS [2.937s]
[INFO] Apache CloudStack Framework - Event Notification .. SUCCESS [1.987s]
[INFO] Apache CloudStack Cloud Engine Schema Component ... SUCCESS [13.129s]
[INFO] Apache CloudStack Framework - Jobs ................ SUCCESS [4.928s]
[INFO] Apache CloudStack Cloud Engine Internal Components API  SUCCESS [2.937s]
[INFO] Apache CloudStack Server .......................... SUCCESS [40.346s]
[INFO] Apache CloudStack Usage Server .................... SUCCESS [6.607s]
[INFO] Apache XenSource XAPI ............................. SUCCESS [5.234s]
[INFO] Apache CloudStack Cloud Engine Orchestration Component  SUCCESS [9.196s]
[INFO] Apache CloudStack Cloud Services .................. SUCCESS [0.027s]
[INFO] Apache CloudStack Secondary Storage ............... SUCCESS [0.258s]
[INFO] Apache CloudStack Secondary Storage Service ....... SUCCESS [4.619s]
[INFO] Apache CloudStack Engine Storage Component ........ SUCCESS [6.562s]
[INFO] Apache CloudStack Engine Storage Volume Component . SUCCESS [4.277s]
[INFO] Apache CloudStack Engine Storage Image Component .. SUCCESS [2.828s]
[INFO] Apache CloudStack Engine Storage Data Motion Component  SUCCESS [2.357s]
[INFO] Apache CloudStack Engine Storage Cache Component .. SUCCESS [2.293s]
[INFO] Apache CloudStack Engine Storage Snapshot Component  SUCCESS [6.885s]
[INFO] Apache CloudStack Cloud Engine API ................ SUCCESS [1.875s]
[INFO] Apache CloudStack Cloud Engine Service ............ SUCCESS [0.855s]
[INFO] Apache CloudStack Plugin POM ...................... SUCCESS [0.265s]
[INFO] Apache CloudStack Plugin - API Rate Limit ......... SUCCESS [6.241s]
[INFO] Apache CloudStack Plugin - API Discovery .......... SUCCESS [4.085s]
[INFO] Apache CloudStack Plugin - ACL Static Role Based .. SUCCESS [2.103s]
[INFO] Apache CloudStack Plugin - Host Anti-Affinity Processor  SUCCESS [2.167s]
[INFO] Apache CloudStack Plugin - Explicit Dedication Processor  SUCCESS [2.213s]
[INFO] Apache CloudStack Plugin - User Concentrated Pod Deployment Planner  SUCCESS [2.161s]
[INFO] Apache CloudStack Plugin - User Dispersing Deployment Planner  SUCCESS [2.060s]
[INFO] Apache CloudStack Plugin - Implicit Dedication Planner  SUCCESS [7.041s]
[INFO] Apache CloudStack Plugin - Skip Heurestics Planner  SUCCESS [1.870s]
[INFO] Apache CloudStack Plugin - Host Allocator Random .. SUCCESS [2.113s]
[INFO] Apache CloudStack Plugin - Dedicated Resources .... SUCCESS [6.606s]
[INFO] Apache CloudStack Plugin - Hypervisor OracleVM .... SUCCESS [3.113s]
[INFO] Apache CloudStack Plugin - Open vSwitch ........... SUCCESS [3.383s]
[INFO] Apache CloudStack Plugin - Hypervisor Xen ......... SUCCESS [9.317s]
[INFO] Apache CloudStack Plugin - Hypervisor KVM ......... FAILURE [0.775s]
[INFO] Apache CloudStack Plugin - RabbitMQ Event Bus ..... SKIPPED
[INFO] Apache CloudStack Plugin - In Memory Event Bus .... SKIPPED
[INFO] Apache CloudStack Plugin - Hypervisor Baremetal ... SKIPPED
[INFO] Apache CloudStack Plugin - Hypervisor UCS ......... SKIPPED
[INFO] Apache CloudStack Plugin - Hypervisor Hyper-V ..... SKIPPED
[INFO] Apache CloudStack Plugin - Network Elastic Load Balancer  SKIPPED
[INFO] Apache CloudStack Plugin - Network Internal Load Balancer  SKIPPED
[INFO] Apache CloudStack Framework - Spring Life Cycle ... SKIPPED
[INFO] Apache CloudStack Plugin - Network Juniper Contrail  SKIPPED
[INFO] Apache CloudStack Plugin - Palo Alto .............. SKIPPED
[INFO] Apache CloudStack Plugin - Network Netscaler ...... SKIPPED
[INFO] Apache CloudStack Plugin - Network Nicira NVP ..... SKIPPED
[INFO] Apache CloudStack Plugin - BigSwitch Virtual Network Segment  SKIPPED
[INFO] Apache CloudStack Plugin - Midokura Midonet ....... SKIPPED
[INFO] Apache CloudStack Plugin - Stratosphere SSP ....... SKIPPED
[INFO] Apache CloudStack Plugin - Network Opendaylight ... SKIPPED
[INFO] Apache CloudStack Plugin - Storage Allocator Random  SKIPPED
[INFO] Apache CloudStack Plugin - User Authenticator LDAP  SKIPPED
[INFO] Apache CloudStack Plugin - User Authenticator MD5 . SKIPPED
[INFO] Apache CloudStack Plugin - User Authenticator Plain Text  SKIPPED
[INFO] Apache CloudStack Plugin - User Authenticator SHA256 Salted  SKIPPED
[INFO] Apache CloudStack Plugin - Dns Notifier Example ... SKIPPED
[INFO] Apache CloudStack Plugin - Storage Image S3 ....... SKIPPED
[INFO] Apache CloudStack Plugin - Storage Image Swift provider  SKIPPED
[INFO] Apache CloudStack Plugin - Storage Image default provider  SKIPPED
[INFO] Apache CloudStack Plugin - Storage Image sample provider  SKIPPED
[INFO] Apache CloudStack Plugin - Storage Volume Nexenta Provider  SKIPPED
[INFO] Apache CloudStack Plugin - Storage Volume SolidFire Provider  SKIPPED
[INFO] Apache CloudStack Plugin - Storage Volume default provider  SKIPPED
[INFO] Apache CloudStack Plugin - Storage Volume CloudByte Provider  SKIPPED
[INFO] Apache CloudStack Plugin - Storage Volume sample provider  SKIPPED
[INFO] Apache CloudStack Plugin - SNMP Alerts ............ SKIPPED
[INFO] Apache CloudStack Plugin - Syslog Alerts .......... SKIPPED
[INFO] Apache CloudStack Plugin - Network VXLAN .......... SKIPPED
[INFO] Apache CloudStack Framework - Spring Module ....... SKIPPED
[INFO] Apache CloudStack Secondary Storage Controller .... SKIPPED
[INFO] Apache CloudStack Client UI ....................... SKIPPED
[INFO] Apache CloudStack Console Proxy - RDP Client ...... SKIPPED
[INFO] Apache CloudStack Console Proxy ................... SKIPPED
[INFO] Apache CloudStack Console Proxy - Server .......... SKIPPED
[INFO] Apache CloudStack Framework - QuickCloud .......... SKIPPED
[INFO] ------------------------------------------------------------------------
[INFO] BUILD FAILURE
[INFO] ------------------------------------------------------------------------
[INFO] Total time: 4:24.387s
[INFO] Finished at: Mon May 26 07:40:26 CEST 2014
[INFO] Final Memory: 60M/383M
[INFO] ------------------------------------------------------------------------
[ERROR] Failed to execute goal on project cloud-plugin-hypervisor-kvm: Could not resolve dependencies
for project org.apache.cloudstack:cloud-plugin-hypervisor-kvm:jar:4.4.0-SNAPSHOT: Failure
to find net.java.dev.jna:jna:jar:4.0.0 in http://libvirt.org/maven2 was cached in the local
repository, resolution will not be reattempted until the update interval of libvirt-org has
elapsed or updates are forced -> [Help 1]
[ERROR] 
[ERROR] To see the full stack trace of the errors, re-run Maven with the -e switch.
[ERROR] Re-run Maven using the -X switch to enable full debug logging.
[ERROR] 
[ERROR] For more information about the errors and possible solutions, please read the following
articles:
[ERROR] [Help 1] http://cwiki.apache.org/confluence/display/MAVEN/DependencyResolutionException
[ERROR] 
[ERROR] After correcting the problems, you can resume the build with the command
[ERROR]   mvn <goals> -rf :cloud-plugin-hypervisor-kvm
Build step 'Invoke top-level Maven targets' marked build as failure

Mime
View raw message