cloudstack-dev mailing list archives

Site index · List index
Message view « Date » · « Thread »
Top « Date » · « Thread »
From Will Stevens <wstev...@cloudops.com>
Subject Re: Build failed in Jenkins: build-master-slowbuild #562
Date Wed, 09 Apr 2014 20:47:06 GMT
Well it gets farther, but I still can't get it to compile.

ws

[INFO] Apache CloudStack Developer Tools - Checkstyle Configuration
 SUCCESS [1.857s]
[INFO] Apache CloudStack ................................. SUCCESS [2.453s]
[INFO] Apache CloudStack Maven Conventions Parent ........ SUCCESS [1.401s]
[INFO] Apache CloudStack Framework - Managed Context ..... SUCCESS [2.377s]
[INFO] Apache CloudStack Utils ........................... SUCCESS [11.159s]
[INFO] Apache CloudStack Framework ....................... SUCCESS [0.058s]
[INFO] Apache CloudStack Framework - Event Notification .. SUCCESS [7.464s]
[INFO] Apache CloudStack Framework - Configuration ....... SUCCESS [2.454s]
[INFO] Apache CloudStack API ............................. SUCCESS [17.792s]
[INFO] Apache CloudStack Framework - REST ................ SUCCESS [1.613s]
[INFO] Apache CloudStack Framework - IPC ................. SUCCESS [3.399s]
[INFO] Apache CloudStack Cloud Engine .................... SUCCESS [0.053s]
[INFO] Apache CloudStack Cloud Engine API ................ SUCCESS [3.471s]
[INFO] Apache CloudStack Framework - Security ............ SUCCESS [2.335s]
[INFO] Apache CloudStack Core ............................ SUCCESS [9.078s]
[INFO] Apache CloudStack Agents .......................... SUCCESS [5.875s]
[INFO] Apache CloudStack Framework - Clustering .......... SUCCESS [3.626s]
[INFO] Apache CloudStack Framework - Jobs ................ SUCCESS [4.541s]
[INFO] Apache CloudStack Cloud Engine Schema Component ... SUCCESS [19.174s]
[INFO] Apache CloudStack Framework - Event Notification .. SUCCESS [1.702s]
[INFO] Apache CloudStack Cloud Engine Internal Components API  SUCCESS
[3.096s]
[INFO] Apache CloudStack Server .......................... SUCCESS [24.304s]
[INFO] Apache CloudStack Usage Server .................... SUCCESS [5.008s]
[INFO] Apache CloudStack Cloud Engine Orchestration Component  SUCCESS
[11.558s]
[INFO] Apache CloudStack Cloud Services .................. SUCCESS [0.051s]
[INFO] Apache CloudStack Secondary Storage ............... SUCCESS [0.345s]
[INFO] Apache CloudStack Secondary Storage Service ....... SUCCESS [4.336s]
[INFO] Apache CloudStack Engine Storage Component ........ SUCCESS [6.676s]
[INFO] Apache CloudStack Engine Storage Volume Component . SUCCESS [3.794s]
[INFO] Apache CloudStack Engine Storage Image Component .. SUCCESS [2.927s]
[INFO] Apache CloudStack Engine Storage Data Motion Component  SUCCESS
[2.491s]
[INFO] Apache CloudStack Engine Storage Cache Component .. SUCCESS [2.455s]
[INFO] Apache CloudStack Engine Storage Snapshot Component  SUCCESS [3.139s]
[INFO] Apache CloudStack Cloud Engine API ................ SUCCESS [1.855s]
[INFO] Apache CloudStack Cloud Engine Service ............ SUCCESS [3.750s]
[INFO] Apache CloudStack Plugin POM ...................... SUCCESS [0.563s]
[INFO] Apache CloudStack Plugin - API Rate Limit ......... SUCCESS [2.300s]
[INFO] Apache CloudStack Plugin - API Discovery .......... SUCCESS [2.432s]
[INFO] Apache CloudStack Plugin - ACL Static Role Based .. SUCCESS [2.077s]
[INFO] Apache CloudStack Plugin - Host Anti-Affinity Processor  SUCCESS
[2.684s]
[INFO] Apache CloudStack Plugin - Explicit Dedication Processor  SUCCESS
[2.379s]
[INFO] Apache CloudStack Plugin - User Concentrated Pod Deployment Planner
 SUCCESS [2.230s]
[INFO] Apache CloudStack Plugin - User Dispersing Deployment Planner
 SUCCESS [2.613s]
[INFO] Apache CloudStack Plugin - Implicit Dedication Planner  SUCCESS
[2.341s]
[INFO] Apache CloudStack Plugin - Skip Heurestics Planner  SUCCESS [1.959s]
[INFO] Apache CloudStack Plugin - Host Allocator Random .. SUCCESS [2.126s]
[INFO] Apache CloudStack Plugin - Dedicated Resources .... SUCCESS [3.420s]
[INFO] Apache CloudStack Plugin - Hypervisor OracleVM .... SUCCESS [3.971s]
[INFO] Apache CloudStack Plugin - Open vSwitch ........... SUCCESS [4.475s]
[INFO] Apache CloudStack Plugin - Hypervisor Xen ......... SUCCESS [9.794s]
[INFO] Apache CloudStack Plugin - Hypervisor KVM ......... FAILURE [6.517s]
[INFO] Apache CloudStack Plugin - RabbitMQ Event Bus ..... SKIPPED
[INFO] Apache CloudStack Plugin - In Memory Event Bus .... SKIPPED
[INFO] Apache CloudStack Plugin - Hypervisor Baremetal ... SKIPPED
[INFO] Apache CloudStack Plugin - Hypervisor UCS ......... SKIPPED
[INFO] Apache CloudStack Plugin - Hypervisor Hyper-V ..... SKIPPED
[INFO] Apache CloudStack Plugin - Network Elastic Load Balancer  SKIPPED
[INFO] Apache CloudStack Plugin - Network Internal Load Balancer  SKIPPED
[INFO] Apache CloudStack Framework - Spring Life Cycle ... SKIPPED
[INFO] Apache CloudStack Plugin - Network Juniper Contrail  SKIPPED
[INFO] Apache CloudStack Plugin - Palo Alto .............. SKIPPED
[INFO] Apache CloudStack Plugin - Network Netscaler ...... SKIPPED
[INFO] Apache CloudStack Plugin - Network Nicira NVP ..... SKIPPED
[INFO] Apache CloudStack Plugin - BigSwitch Virtual Network Segment  SKIPPED
[INFO] Apache CloudStack Plugin - Midokura Midonet ....... SKIPPED
[INFO] Apache CloudStack Plugin - Stratosphere SSP ....... SKIPPED
[INFO] Apache CloudStack Plugin - Network Opendaylight ... SKIPPED
[INFO] Apache CloudStack Plugin - Storage Allocator Random  SKIPPED
[INFO] Apache CloudStack Plugin - User Authenticator LDAP  SKIPPED
[INFO] Apache CloudStack Plugin - User Authenticator MD5 . SKIPPED
[INFO] Apache CloudStack Plugin - User Authenticator Plain Text  SKIPPED
[INFO] Apache CloudStack Plugin - User Authenticator SHA256 Salted  SKIPPED
[INFO] Apache CloudStack Plugin - Dns Notifier Example ... SKIPPED
[INFO] Apache CloudStack Plugin - Storage Image S3 ....... SKIPPED
[INFO] Apache CloudStack Plugin - Storage Image Swift provider  SKIPPED
[INFO] Apache CloudStack Plugin - Storage Image default provider  SKIPPED
[INFO] Apache CloudStack Plugin - Storage Image sample provider  SKIPPED
[INFO] Apache CloudStack Plugin - Storage Volume Nexenta Provider  SKIPPED
[INFO] Apache CloudStack Plugin - Storage Volume SolidFire Provider  SKIPPED
[INFO] Apache CloudStack Plugin - Storage Volume default provider  SKIPPED
[INFO] Apache CloudStack Plugin - Storage Volume CloudByte Provider  SKIPPED
[INFO] Apache CloudStack Plugin - Storage Volume sample provider  SKIPPED
[INFO] Apache CloudStack Plugin - SNMP Alerts ............ SKIPPED
[INFO] Apache CloudStack Plugin - Syslog Alerts .......... SKIPPED
[INFO] Apache CloudStack Plugin - Network VXLAN .......... SKIPPED
[INFO] Apache CloudStack Framework - Spring Module ....... SKIPPED
[INFO] Apache CloudStack IAM Service ..................... SKIPPED
[INFO] Apache CloudStack IAM - Server .................... SKIPPED
[INFO] Apache CloudStack IAM - Plugin .................... SKIPPED
[INFO] Apache CloudStack Secondary Storage Controller .... SKIPPED
[INFO] Apache CloudStack Console Proxy - RDP Client ...... SKIPPED
[INFO] Apache CloudStack Console Proxy ................... SKIPPED
[INFO] Apache CloudStack Console Proxy - Server .......... SKIPPED
[INFO] Apache CloudStack System VM ....................... SKIPPED
[INFO] Apache CloudStack Client UI ....................... SKIPPED
[INFO] Apache CloudStack Framework - QuickCloud .......... SKIPPED
[INFO] Apache CloudStack Test ............................ SKIPPED
[INFO] Apache CloudStack Developer Mode .................. SKIPPED
[INFO] Apache CloudStack Developer Tools ................. SKIPPED
[INFO] Apache CloudStack apidocs ......................... SKIPPED
[INFO] Apache CloudStack marvin .......................... SKIPPED
[INFO] Apache CloudStack DevCloud ........................ SKIPPED
[INFO] Apache CloudStack DevCloud-KVM .................... SKIPPED
[INFO]
------------------------------------------------------------------------
[INFO] BUILD FAILURE
[INFO]
------------------------------------------------------------------------
[INFO] Total time: 3:53.231s
[INFO] Finished at: Wed Apr 09 16:09:18 EDT 2014
[INFO] Final Memory: 51M/138M
[INFO]
------------------------------------------------------------------------
[ERROR] Failed to execute goal
org.apache.maven.plugins:maven-compiler-plugin:2.5.1:compile
(default-compile) on project cloud-plugin-hypervisor-kvm: Compilation
failure: Compilation failure:
[ERROR] error: error reading
/root/.m2/repository/com/ceph/rados/0.1.4/rados-0.1.4.jar; cannot read zip
file
[ERROR]
/root/cs_master/cloudstack/plugins/hypervisors/kvm/src/com/cloud/hypervisor/kvm/resource/LibvirtComputingResource.java:[19,21]
error: package com.ceph.rados does not exist
[ERROR]
/root/cs_master/cloudstack/plugins/hypervisors/kvm/src/com/cloud/hypervisor/kvm/resource/LibvirtComputingResource.java:[20,21]
error: package com.ceph.rados does not exist
[ERROR]
/root/cs_master/cloudstack/plugins/hypervisors/kvm/src/com/cloud/hypervisor/kvm/resource/LibvirtComputingResource.java:[21,21]
error: package com.ceph.rados does not exist
[ERROR]
/root/cs_master/cloudstack/plugins/hypervisors/kvm/src/com/cloud/hypervisor/kvm/resource/LibvirtComputingResource.java:[22,19]
error: package com.ceph.rbd does not exist
[ERROR]
/root/cs_master/cloudstack/plugins/hypervisors/kvm/src/com/cloud/hypervisor/kvm/resource/LibvirtComputingResource.java:[23,19]
error: package com.ceph.rbd does not exist
[ERROR]
/root/cs_master/cloudstack/plugins/hypervisors/kvm/src/com/cloud/hypervisor/kvm/resource/LibvirtComputingResource.java:[24,19]
error: package com.ceph.rbd does not exist
[ERROR]
/root/cs_master/cloudstack/plugins/hypervisors/kvm/src/com/cloud/hypervisor/kvm/storage/LibvirtStorageAdaptor.java:[34,21]
error: package com.ceph.rados does not exist
[ERROR]
/root/cs_master/cloudstack/plugins/hypervisors/kvm/src/com/cloud/hypervisor/kvm/storage/LibvirtStorageAdaptor.java:[35,21]
error: package com.ceph.rados does not exist
[ERROR]
/root/cs_master/cloudstack/plugins/hypervisors/kvm/src/com/cloud/hypervisor/kvm/storage/LibvirtStorageAdaptor.java:[36,21]
error: package com.ceph.rados does not exist
[ERROR]
/root/cs_master/cloudstack/plugins/hypervisors/kvm/src/com/cloud/hypervisor/kvm/storage/LibvirtStorageAdaptor.java:[37,19]
error: package com.ceph.rbd does not exist
[ERROR]
/root/cs_master/cloudstack/plugins/hypervisors/kvm/src/com/cloud/hypervisor/kvm/storage/LibvirtStorageAdaptor.java:[38,19]
error: package com.ceph.rbd does not exist
[ERROR]
/root/cs_master/cloudstack/plugins/hypervisors/kvm/src/com/cloud/hypervisor/kvm/storage/LibvirtStorageAdaptor.java:[39,19]
error: package com.ceph.rbd does not exist
[ERROR]
/root/cs_master/cloudstack/plugins/hypervisors/kvm/src/com/cloud/hypervisor/kvm/storage/LibvirtStorageAdaptor.java:[40,23]
error: package com.ceph.rbd.jna does not exist
[ERROR]
/root/cs_master/cloudstack/plugins/hypervisors/kvm/src/com/cloud/hypervisor/kvm/storage/KVMStorageProcessor.java:[50,21]
error: package com.ceph.rados does not exist
[ERROR]
/root/cs_master/cloudstack/plugins/hypervisors/kvm/src/com/cloud/hypervisor/kvm/storage/KVMStorageProcessor.java:[51,21]
error: package com.ceph.rados does not exist
[ERROR]
/root/cs_master/cloudstack/plugins/hypervisors/kvm/src/com/cloud/hypervisor/kvm/storage/KVMStorageProcessor.java:[52,21]
error: package com.ceph.rados does not exist
[ERROR]
/root/cs_master/cloudstack/plugins/hypervisors/kvm/src/com/cloud/hypervisor/kvm/storage/KVMStorageProcessor.java:[53,19]
error: package com.ceph.rbd does not exist
[ERROR]
/root/cs_master/cloudstack/plugins/hypervisors/kvm/src/com/cloud/hypervisor/kvm/storage/KVMStorageProcessor.java:[54,19]
error: package com.ceph.rbd does not exist
[ERROR]
/root/cs_master/cloudstack/plugins/hypervisors/kvm/src/com/cloud/hypervisor/kvm/storage/KVMStorageProcessor.java:[55,19]
error: package com.ceph.rbd does not exist
[ERROR]
/root/cs_master/cloudstack/plugins/hypervisors/kvm/src/com/cloud/hypervisor/kvm/resource/LibvirtComputingResource.java:[2372,24]
error: cannot find symbol
[ERROR] symbol:   class Rados
[ERROR] location: class LibvirtComputingResource
[ERROR]
/root/cs_master/cloudstack/plugins/hypervisors/kvm/src/com/cloud/hypervisor/kvm/resource/LibvirtComputingResource.java:[2372,38]
error: cannot find symbol
[ERROR] symbol:   class Rados
[ERROR] location: class LibvirtComputingResource
[ERROR]
/root/cs_master/cloudstack/plugins/hypervisors/kvm/src/com/cloud/hypervisor/kvm/resource/LibvirtComputingResource.java:[2379,24]
error: cannot find symbol
[ERROR] symbol:   class IoCTX
[ERROR] location: class LibvirtComputingResource
[ERROR]
/root/cs_master/cloudstack/plugins/hypervisors/kvm/src/com/cloud/hypervisor/kvm/resource/LibvirtComputingResource.java:[2380,24]
error: cannot find symbol
[ERROR] symbol:   class Rbd
[ERROR] location: class LibvirtComputingResource
[ERROR]
/root/cs_master/cloudstack/plugins/hypervisors/kvm/src/com/cloud/hypervisor/kvm/resource/LibvirtComputingResource.java:[2380,38]
error: cannot find symbol
[ERROR] symbol:   class Rbd
[ERROR] location: class LibvirtComputingResource
[ERROR]
/root/cs_master/cloudstack/plugins/hypervisors/kvm/src/com/cloud/hypervisor/kvm/resource/LibvirtComputingResource.java:[2381,24]
error: cannot find symbol
[ERROR] symbol:   class RbdImage
[ERROR] location: class LibvirtComputingResource
[ERROR]
/root/cs_master/cloudstack/plugins/hypervisors/kvm/src/com/cloud/hypervisor/kvm/resource/LibvirtComputingResource.java:[2455,20]
error: cannot find symbol
[ERROR] symbol:   class Rados
[ERROR] location: class LibvirtComputingResource
[ERROR]
/root/cs_master/cloudstack/plugins/hypervisors/kvm/src/com/cloud/hypervisor/kvm/resource/LibvirtComputingResource.java:[2455,34]
error: cannot find symbol
[ERROR] symbol:   class Rados
[ERROR] location: class LibvirtComputingResource
[ERROR]
/root/cs_master/cloudstack/plugins/hypervisors/kvm/src/com/cloud/hypervisor/kvm/resource/LibvirtComputingResource.java:[2462,20]
error: cannot find symbol
[ERROR] symbol:   class IoCTX
[ERROR] location: class LibvirtComputingResource
[ERROR]
/root/cs_master/cloudstack/plugins/hypervisors/kvm/src/com/cloud/hypervisor/kvm/resource/LibvirtComputingResource.java:[2463,20]
error: cannot find symbol
[ERROR] symbol:   class Rbd
[ERROR] location: class LibvirtComputingResource
[ERROR]
/root/cs_master/cloudstack/plugins/hypervisors/kvm/src/com/cloud/hypervisor/kvm/resource/LibvirtComputingResource.java:[2463,34]
error: cannot find symbol
[ERROR] symbol:   class Rbd
[ERROR] location: class LibvirtComputingResource
[ERROR]
/root/cs_master/cloudstack/plugins/hypervisors/kvm/src/com/cloud/hypervisor/kvm/resource/LibvirtComputingResource.java:[2464,20]
error: cannot find symbol
[ERROR] symbol:   class RbdImage
[ERROR] location: class LibvirtComputingResource
[ERROR]
/root/cs_master/cloudstack/plugins/hypervisors/kvm/src/com/cloud/hypervisor/kvm/resource/LibvirtComputingResource.java:[2484,25]
error: cannot find symbol
[ERROR] symbol:   class RadosException
[ERROR] location: class LibvirtComputingResource
[ERROR]
/root/cs_master/cloudstack/plugins/hypervisors/kvm/src/com/cloud/hypervisor/kvm/resource/LibvirtComputingResource.java:[2487,25]
error: cannot find symbol
[ERROR] symbol:   class RbdException
[ERROR] location: class LibvirtComputingResource
[ERROR]
/root/cs_master/cloudstack/plugins/hypervisors/kvm/src/com/cloud/hypervisor/kvm/storage/LibvirtStorageAdaptor.java:[640,16]
error: cannot find symbol
[ERROR] symbol:   class Rados
[ERROR] location: class LibvirtStorageAdaptor
[ERROR]
/root/cs_master/cloudstack/plugins/hypervisors/kvm/src/com/cloud/hypervisor/kvm/storage/LibvirtStorageAdaptor.java:[640,30]
error: cannot find symbol
[ERROR] symbol:   class Rados
[ERROR] location: class LibvirtStorageAdaptor
[ERROR]
/root/cs_master/cloudstack/plugins/hypervisors/kvm/src/com/cloud/hypervisor/kvm/storage/LibvirtStorageAdaptor.java:[647,16]
error: cannot find symbol
[ERROR] symbol:   class IoCTX
[ERROR] location: class LibvirtStorageAdaptor
[ERROR]
/root/cs_master/cloudstack/plugins/hypervisors/kvm/src/com/cloud/hypervisor/kvm/storage/LibvirtStorageAdaptor.java:[648,16]
error: cannot find symbol
[ERROR] symbol:   class Rbd
[ERROR] location: class LibvirtStorageAdaptor
[ERROR]
/root/cs_master/cloudstack/plugins/hypervisors/kvm/src/com/cloud/hypervisor/kvm/storage/LibvirtStorageAdaptor.java:[648,30]
error: cannot find symbol
[ERROR] symbol:   class Rbd
[ERROR] location: class LibvirtStorageAdaptor
[ERROR]
/root/cs_master/cloudstack/plugins/hypervisors/kvm/src/com/cloud/hypervisor/kvm/storage/LibvirtStorageAdaptor.java:[652,21]
error: cannot find symbol
[ERROR] symbol:   class RadosException
[ERROR] location: class LibvirtStorageAdaptor
[ERROR]
/root/cs_master/cloudstack/plugins/hypervisors/kvm/src/com/cloud/hypervisor/kvm/storage/LibvirtStorageAdaptor.java:[654,21]
error: cannot find symbol
[ERROR] symbol:   class RbdException
[ERROR] location: class LibvirtStorageAdaptor
[ERROR]
/root/cs_master/cloudstack/plugins/hypervisors/kvm/src/com/cloud/hypervisor/kvm/storage/LibvirtStorageAdaptor.java:[752,16]
error: cannot find symbol
[ERROR] symbol:   class Rados
[ERROR] location: class LibvirtStorageAdaptor
[ERROR]
/root/cs_master/cloudstack/plugins/hypervisors/kvm/src/com/cloud/hypervisor/kvm/storage/LibvirtStorageAdaptor.java:[752,30]
error: cannot find symbol
[ERROR] symbol:   class Rados
[ERROR] location: class LibvirtStorageAdaptor
[ERROR]
/root/cs_master/cloudstack/plugins/hypervisors/kvm/src/com/cloud/hypervisor/kvm/storage/LibvirtStorageAdaptor.java:[759,16]
error: cannot find symbol
[ERROR] symbol:   class IoCTX
[ERROR] location: class LibvirtStorageAdaptor
[ERROR]
/root/cs_master/cloudstack/plugins/hypervisors/kvm/src/com/cloud/hypervisor/kvm/storage/LibvirtStorageAdaptor.java:[760,16]
error: cannot find symbol
[ERROR] symbol:   class Rbd
[ERROR] location: class LibvirtStorageAdaptor
[ERROR]
/root/cs_master/cloudstack/plugins/hypervisors/kvm/src/com/cloud/hypervisor/kvm/storage/LibvirtStorageAdaptor.java:[760,30]
error: cannot find symbol
[ERROR] symbol:   class Rbd
[ERROR] location: class LibvirtStorageAdaptor
[ERROR]
/root/cs_master/cloudstack/plugins/hypervisors/kvm/src/com/cloud/hypervisor/kvm/storage/LibvirtStorageAdaptor.java:[761,16]
error: cannot find symbol
[ERROR] symbol:   class RbdImage
[ERROR] location: class LibvirtStorageAdaptor
[ERROR]
/root/cs_master/cloudstack/plugins/hypervisors/kvm/src/com/cloud/hypervisor/kvm/storage/LibvirtStorageAdaptor.java:[763,21]
error: cannot find symbol
[ERROR] symbol:   class RbdSnapInfo
[ERROR] location: class LibvirtStorageAdaptor
[ERROR]
/root/cs_master/cloudstack/plugins/hypervisors/kvm/src/com/cloud/hypervisor/kvm/storage/LibvirtStorageAdaptor.java:[764,21]
error: cannot find symbol
[ERROR] symbol:   class RbdSnapInfo
[ERROR] location: class LibvirtStorageAdaptor
[ERROR]
/root/cs_master/cloudstack/plugins/hypervisors/kvm/src/com/cloud/hypervisor/kvm/storage/LibvirtStorageAdaptor.java:[773,21]
error: cannot find symbol
[ERROR] symbol:   class RadosException
[ERROR] location: class LibvirtStorageAdaptor
[ERROR]
/root/cs_master/cloudstack/plugins/hypervisors/kvm/src/com/cloud/hypervisor/kvm/storage/LibvirtStorageAdaptor.java:[775,21]
error: cannot find symbol
[ERROR] symbol:   class RbdException
[ERROR] location: class LibvirtStorageAdaptor
[ERROR]
/root/cs_master/cloudstack/plugins/hypervisors/kvm/src/com/cloud/hypervisor/kvm/storage/LibvirtStorageAdaptor.java:[887,28]
error: cannot find symbol
[ERROR] symbol:   class Rados
[ERROR] location: class LibvirtStorageAdaptor
[ERROR]
/root/cs_master/cloudstack/plugins/hypervisors/kvm/src/com/cloud/hypervisor/kvm/storage/LibvirtStorageAdaptor.java:[887,42]
error: cannot find symbol
[ERROR] symbol:   class Rados
[ERROR] location: class LibvirtStorageAdaptor
[ERROR]
/root/cs_master/cloudstack/plugins/hypervisors/kvm/src/com/cloud/hypervisor/kvm/storage/LibvirtStorageAdaptor.java:[894,28]
error: cannot find symbol
[ERROR] symbol:   class IoCTX
[ERROR] location: class LibvirtStorageAdaptor
[ERROR]
/root/cs_master/cloudstack/plugins/hypervisors/kvm/src/com/cloud/hypervisor/kvm/storage/LibvirtStorageAdaptor.java:[895,28]
error: cannot find symbol
[ERROR] symbol:   class Rbd
[ERROR] location: class LibvirtStorageAdaptor
[ERROR]
/root/cs_master/cloudstack/plugins/hypervisors/kvm/src/com/cloud/hypervisor/kvm/storage/LibvirtStorageAdaptor.java:[895,42]
error: cannot find symbol
[ERROR] symbol:   class Rbd
[ERROR] location: class LibvirtStorageAdaptor
[ERROR]
/root/cs_master/cloudstack/plugins/hypervisors/kvm/src/com/cloud/hypervisor/kvm/storage/LibvirtStorageAdaptor.java:[896,28]
error: cannot find symbol
[ERROR] symbol:   class RbdImage
[ERROR] location: class LibvirtStorageAdaptor
[ERROR]
/root/cs_master/cloudstack/plugins/hypervisors/kvm/src/com/cloud/hypervisor/kvm/storage/LibvirtStorageAdaptor.java:[904,32]
error: cannot find symbol
[ERROR] symbol:   class RbdImage
[ERROR] location: class LibvirtStorageAdaptor
[ERROR]
/root/cs_master/cloudstack/plugins/hypervisors/kvm/src/com/cloud/hypervisor/kvm/storage/LibvirtStorageAdaptor.java:[925,28]
error: cannot find symbol
[ERROR] symbol:   class Rados
[ERROR] location: class LibvirtStorageAdaptor
[ERROR]
/root/cs_master/cloudstack/plugins/hypervisors/kvm/src/com/cloud/hypervisor/kvm/storage/LibvirtStorageAdaptor.java:[925,45]
error: cannot find symbol
[ERROR] symbol:   class Rados
[ERROR] location: class LibvirtStorageAdaptor
[ERROR]
/root/cs_master/cloudstack/plugins/hypervisors/kvm/src/com/cloud/hypervisor/kvm/storage/LibvirtStorageAdaptor.java:[932,28]
error: cannot find symbol
[ERROR] symbol:   class Rados
[ERROR] location: class LibvirtStorageAdaptor
[ERROR]
/root/cs_master/cloudstack/plugins/hypervisors/kvm/src/com/cloud/hypervisor/kvm/storage/LibvirtStorageAdaptor.java:[932,46]
error: cannot find symbol
[ERROR] symbol:   class Rados
[ERROR] location: class LibvirtStorageAdaptor
[ERROR]
/root/cs_master/cloudstack/plugins/hypervisors/kvm/src/com/cloud/hypervisor/kvm/storage/LibvirtStorageAdaptor.java:[939,28]
error: cannot find symbol
[ERROR] symbol:   class IoCTX
[ERROR] location: class LibvirtStorageAdaptor
[ERROR]
/root/cs_master/cloudstack/plugins/hypervisors/kvm/src/com/cloud/hypervisor/kvm/storage/LibvirtStorageAdaptor.java:[940,28]
error: cannot find symbol
[ERROR] symbol:   class Rbd
[ERROR] location: class LibvirtStorageAdaptor
[ERROR]
/root/cs_master/cloudstack/plugins/hypervisors/kvm/src/com/cloud/hypervisor/kvm/storage/LibvirtStorageAdaptor.java:[940,43]
error: cannot find symbol
[ERROR] symbol:   class Rbd
[ERROR] location: class LibvirtStorageAdaptor
[ERROR]
/root/cs_master/cloudstack/plugins/hypervisors/kvm/src/com/cloud/hypervisor/kvm/storage/LibvirtStorageAdaptor.java:[942,28]
error: cannot find symbol
[ERROR] symbol:   class IoCTX
[ERROR] location: class LibvirtStorageAdaptor
[ERROR]
/root/cs_master/cloudstack/plugins/hypervisors/kvm/src/com/cloud/hypervisor/kvm/storage/LibvirtStorageAdaptor.java:[943,28]
error: cannot find symbol
[ERROR] symbol:   class Rbd
[ERROR] location: class LibvirtStorageAdaptor
[ERROR]
/root/cs_master/cloudstack/plugins/hypervisors/kvm/src/com/cloud/hypervisor/kvm/storage/LibvirtStorageAdaptor.java:[943,43]
error: cannot find symbol
[ERROR] symbol:   class Rbd
[ERROR] location: class LibvirtStorageAdaptor
[ERROR]
/root/cs_master/cloudstack/plugins/hypervisors/kvm/src/com/cloud/hypervisor/kvm/storage/LibvirtStorageAdaptor.java:[949,28]
error: cannot find symbol
[ERROR] symbol:   class RbdImage
[ERROR] location: class LibvirtStorageAdaptor
[ERROR]
/root/cs_master/cloudstack/plugins/hypervisors/kvm/src/com/cloud/hypervisor/kvm/storage/LibvirtStorageAdaptor.java:[950,28]
error: cannot find symbol
[ERROR] symbol:   class RbdImage
[ERROR] location: class LibvirtStorageAdaptor
[ERROR]
/root/cs_master/cloudstack/plugins/hypervisors/kvm/src/com/cloud/hypervisor/kvm/storage/LibvirtStorageAdaptor.java:[962,29]
error: cannot find symbol
[ERROR] symbol:   class RadosException
[ERROR] location: class LibvirtStorageAdaptor
[ERROR]
/root/cs_master/cloudstack/plugins/hypervisors/kvm/src/com/cloud/hypervisor/kvm/storage/LibvirtStorageAdaptor.java:[965,29]
error: cannot find symbol
[ERROR] symbol:   class RbdException
[ERROR] location: class LibvirtStorageAdaptor
[ERROR]
/root/cs_master/cloudstack/plugins/hypervisors/kvm/src/com/cloud/hypervisor/kvm/storage/LibvirtStorageAdaptor.java:[1112,16]
error: cannot find symbol
[ERROR] symbol:   class Rados
[ERROR] location: class LibvirtStorageAdaptor
[ERROR]
/root/cs_master/cloudstack/plugins/hypervisors/kvm/src/com/cloud/hypervisor/kvm/storage/LibvirtStorageAdaptor.java:[1112,30]
error: cannot find symbol
[ERROR] symbol:   class Rados
[ERROR] location: class LibvirtStorageAdaptor
[ERROR]
/root/cs_master/cloudstack/plugins/hypervisors/kvm/src/com/cloud/hypervisor/kvm/storage/LibvirtStorageAdaptor.java:[1119,16]
error: cannot find symbol
[ERROR] symbol:   class IoCTX
[ERROR] location: class LibvirtStorageAdaptor
[ERROR]
/root/cs_master/cloudstack/plugins/hypervisors/kvm/src/com/cloud/hypervisor/kvm/storage/LibvirtStorageAdaptor.java:[1120,16]
error: cannot find symbol
[ERROR] symbol:   class Rbd
[ERROR] location: class LibvirtStorageAdaptor
[ERROR]
/root/cs_master/cloudstack/plugins/hypervisors/kvm/src/com/cloud/hypervisor/kvm/storage/LibvirtStorageAdaptor.java:[1120,30]
error: cannot find symbol
[ERROR] symbol:   class Rbd
[ERROR] location: class LibvirtStorageAdaptor
[ERROR]
/root/cs_master/cloudstack/plugins/hypervisors/kvm/src/com/cloud/hypervisor/kvm/storage/LibvirtStorageAdaptor.java:[1122,16]
error: cannot find symbol
[ERROR] symbol:   class RbdImage
[ERROR] location: class LibvirtStorageAdaptor
[ERROR]
/root/cs_master/cloudstack/plugins/hypervisors/kvm/src/com/cloud/hypervisor/kvm/storage/LibvirtStorageAdaptor.java:[1135,21]
error: cannot find symbol
[ERROR] symbol:   class RadosException
[ERROR] location: class LibvirtStorageAdaptor
[ERROR]
/root/cs_master/cloudstack/plugins/hypervisors/kvm/src/com/cloud/hypervisor/kvm/storage/LibvirtStorageAdaptor.java:[1138,21]
error: cannot find symbol
[ERROR] symbol:   class RbdException
[ERROR] location: class LibvirtStorageAdaptor
[ERROR]
/root/cs_master/cloudstack/plugins/hypervisors/kvm/src/com/cloud/hypervisor/kvm/storage/KVMStorageProcessor.java:[703,20]
error: cannot find symbol
[ERROR] symbol:   class Rados
[ERROR] location: class KVMStorageProcessor
[ERROR]
/root/cs_master/cloudstack/plugins/hypervisors/kvm/src/com/cloud/hypervisor/kvm/storage/KVMStorageProcessor.java:[703,34]
error: cannot find symbol
[ERROR] symbol:   class Rados
[ERROR] location: class KVMStorageProcessor
[ERROR]
/root/cs_master/cloudstack/plugins/hypervisors/kvm/src/com/cloud/hypervisor/kvm/storage/KVMStorageProcessor.java:[710,20]
error: cannot find symbol
[ERROR] symbol:   class IoCTX
[ERROR] location: class KVMStorageProcessor
[ERROR]
/root/cs_master/cloudstack/plugins/hypervisors/kvm/src/com/cloud/hypervisor/kvm/storage/KVMStorageProcessor.java:[711,20]
error: cannot find symbol
[ERROR] symbol:   class Rbd
[ERROR] location: class KVMStorageProcessor
[ERROR]
/root/cs_master/cloudstack/plugins/hypervisors/kvm/src/com/cloud/hypervisor/kvm/storage/KVMStorageProcessor.java:[711,34]
error: cannot find symbol
[ERROR] symbol:   class Rbd
[ERROR] location: class KVMStorageProcessor
[ERROR]
/root/cs_master/cloudstack/plugins/hypervisors/kvm/src/com/cloud/hypervisor/kvm/storage/KVMStorageProcessor.java:[712,20]
error: cannot find symbol
[ERROR] symbol:   class RbdImage
[ERROR] location: class KVMStorageProcessor
[ERROR]
/root/cs_master/cloudstack/plugins/hypervisors/kvm/src/com/cloud/hypervisor/kvm/storage/KVMStorageProcessor.java:[740,25]
error: cannot find symbol
[ERROR] symbol:   class RadosException
[ERROR] location: class KVMStorageProcessor
[ERROR]
/root/cs_master/cloudstack/plugins/hypervisors/kvm/src/com/cloud/hypervisor/kvm/storage/KVMStorageProcessor.java:[743,25]
error: cannot find symbol
[ERROR] symbol:   class RbdException
[ERROR] location: class KVMStorageProcessor
[ERROR]
/root/cs_master/cloudstack/plugins/hypervisors/kvm/src/com/cloud/hypervisor/kvm/storage/KVMStorageProcessor.java:[1149,24]
error: cannot find symbol
[ERROR] symbol:   class Rados
[ERROR] location: class KVMStorageProcessor
[ERROR]
/root/cs_master/cloudstack/plugins/hypervisors/kvm/src/com/cloud/hypervisor/kvm/storage/KVMStorageProcessor.java:[1149,38]
error: cannot find symbol
[ERROR] symbol:   class Rados
[ERROR] location: class KVMStorageProcessor
[ERROR]
/root/cs_master/cloudstack/plugins/hypervisors/kvm/src/com/cloud/hypervisor/kvm/storage/KVMStorageProcessor.java:[1156,24]
error: cannot find symbol
[ERROR] symbol:   class IoCTX
[ERROR] location: class KVMStorageProcessor
[ERROR]
/root/cs_master/cloudstack/plugins/hypervisors/kvm/src/com/cloud/hypervisor/kvm/storage/KVMStorageProcessor.java:[1157,24]
error: cannot find symbol
[ERROR] symbol:   class Rbd
[ERROR] location: class KVMStorageProcessor
[ERROR]
/root/cs_master/cloudstack/plugins/hypervisors/kvm/src/com/cloud/hypervisor/kvm/storage/KVMStorageProcessor.java:[1157,38]
error: cannot find symbol
[ERROR] symbol:   class Rbd
[ERROR] location: class KVMStorageProcessor
[ERROR]
/root/cs_master/cloudstack/plugins/hypervisors/kvm/src/com/cloud/hypervisor/kvm/storage/KVMStorageProcessor.java:[1158,24]
error: cannot find symbol
[ERROR] -> [Help 1]
[ERROR]
[ERROR] To see the full stack trace of the errors, re-run Maven with the -e
switch.
[ERROR] Re-run Maven using the -X switch to enable full debug logging.
[ERROR]
[ERROR] For more information about the errors and possible solutions,
please read the following articles:
[ERROR] [Help 1]
http://cwiki.apache.org/confluence/display/MAVEN/MojoFailureException
[ERROR]
[ERROR] After correcting the problems, you can resume the build with the
command
[ERROR]   mvn <goals> -rf :cloud-plugin-hypervisor-kvm



On Wed, Apr 9, 2014 at 4:01 PM, Sanjay Tripathi
<sanjay.tripathi@citrix.com>wrote:

> Hi,
>
> Can you guys pull the latest code. Its working now.
>
> --Sanjay
>
> From: williamstevens@gmail.com [mailto:williamstevens@gmail.com] On
> Behalf Of Will Stevens
> Sent: Wednesday, April 9, 2014 11:38 PM
> To: Syed Ahmed
> Cc: dev@cloudstack.apache.org; hugo@apache.org; muralimmreddy@gmail.com;
> Sanjay Tripathi
> Subject: Re: Build failed in Jenkins: build-master-slowbuild #562
>
> Master does not compile right now so I don't think that will help.
>
> Ws
>
> On Wednesday, April 9, 2014, Syed Ahmed <sahmed@cloudops.com<mailto:
> sahmed@cloudops.com>> wrote:
> > So I just asked pierre-luc to build a simple cloudkstack without
> advanced networking. I will try to build master on that setup.
> >
> > This means I cannot add the LB specific part but I could still something
> done
> >
> > Thanks for your help.
> >
> > Thanks,
> > -Syed
> >
> >
> > On Wed 09 Apr 2014 01:58:18 PM EDT, Will Stevens wrote:
> >
> > Anyone working on this in the hackathon?  :)
> >
> > I am trying to get dev envs up on master for some people in the hackathon
> > and I currently am not able to build master because of this.
> >
> >
> > On Wed, Apr 9, 2014 at 12:09 PM, <jenkins@cloudstack.org<mailto:
> jenkins@cloudstack.org>> wrote:
> >
> > See <http://jenkins.buildacloud.org/job/build-master-slowbuild/562/>
> >
> > ------------------------------------------
> > [...truncated 1839 lines...]
> > [INFO] Fork Value is true
> >       [java] Warnings generated: 1
> > [INFO] Done FindBugs Analysis....
> > [INFO]
> > [INFO] <<< findbugs-maven-plugin:2.5.3:check (cloudstack-findbugs) @
> > cloud-framework-config <<<
> > [INFO]
> > [INFO] --- findbugs-maven-plugin:2.5.3:check (cloudstack-findbugs) @
> > cloud-framework-config ---
> > [INFO] BugInstance size is 1
> > [INFO] Error size is 0
> > [INFO] Total bugs: 1
> > [INFO] org.apache.cloudstack.framework.config.ConfigKey.equals(Object)
> > checks for operand being a String
> > ["org.apache.cloudstack.framework.config.ConfigKey"] At
> > ConfigKey.java:[lines 40-183]
> > [INFO]
> > [INFO] --- cobertura-maven-plugin:2.6:instrument (default-cli) @
> > cloud-framework-config ---
> > [INFO] Cobertura 2.0.3 - GNU GPL License (NO WARRANTY) - See COPYRIGHT
> file
> >
> > [ERROR] Apr 09, 2014 6:09:22 PM
> > net.sourceforge.cobertura.coveragedata.CoverageDataFileHandler
> > saveCoverageData
> > INFO: Cobertura: Saved information on 11 classes.
> >
> > [INFO] Instrumentation was successful.
> > [INFO] NOT adding cobertura ser file to attached artifacts list.
> > [INFO]
> > [INFO] --- maven-resources-plugin:2.5:testResources
> > (default-testResources) @ cloud-framework-config ---
> > [debug] execute contextualize
> > [INFO] Using 'UTF-8' encoding to copy filtered resources.
> > [INFO] skip non existing resourceDirectory <
> >
> http://jenkins.buildacloud.org/job/build-master-slowbuild/ws/framework/config/test/resources
> >
> > [INFO] Copying 3 resources
> > [INFO] Copying 3 resources
> > [INFO]
> > [INFO] --- maven-compiler-plugin:2.5.1:testCompile (default-testCompile)
> @
> > cloud-framework-config ---
> > [INFO] Nothing to compile - all classes are up to date
> > [INFO]
> > [INFO] --- maven-surefire-plugin:2.12:test (default-test) @
> > cloud-framework-config ---
> > [INFO] Surefire report directory: <
> >
> http://jenkins.buildacloud.org/job/build-master-slowbuild/ws/framework/config/target/surefire-reports
> >
> >
> > -------------------------------------------------------
> >   T E S T S
> > -------------------------------------------------------
> > Running org.apache.cloudstack.framework.config.impl.ConfigDepotAdminTest
> > Tests run: 1, Failures: 0, Errors: 0, Skipped: 0, Time elapsed: 0.461 sec
> >
> > Results :
> >
> > Tests run: 1, Failures: 0, Errors: 0, Skipped: 0
> >
> > [INFO]
> > [INFO] <<< cobertura-maven-plugin:2.6:cobertura (default-cli) @
> > cloud-framework-config <<<
> > [INFO]
> > [INFO] --- cobertura-maven-plugin:2.6:cobertura (default-cli) @
> > cloud-framework-config ---
> > [INFO] Cobertura 2.0.3 - GNU GPL License (NO WARRANTY) - See COPYRIGHT
> file
> > [cobertura] INFO  [main]
> > net.sourceforge.cobertura.reporting.html.HTMLReport - Data file does not
> > contain instrumentation information for the file
> > org/apache/cloudstack/config/Configuration.java.  Ensure this class was
> > instrumented, and this data file contains the instrumentation
> information.
> > [cobertura] INFO  [main]
> > net.sourceforge.cobertura.reporting.html.HTMLReport - Data file does not
> > contain instrumentation information for the file
> > org/apache/cloudstack/framework/config/ConfigDepot.java.  Ensure this
> class
> > was instrumented, and this data file contains the instrumentation
> > information.
> > [cobertura] INFO  [main]
> > net.sourceforge.cobertura.re<http://net.sourceforge.cobertura.re>
>

Mime
  • Unnamed multipart/alternative (inline, None, 0 bytes)
View raw message