cloudstack-dev mailing list archives

Site index · List index
Message view « Date » · « Thread »
Top « Date » · « Thread »
From jenk...@cloudstack.org
Subject Build failed in Jenkins: build-master #600
Date Wed, 09 Apr 2014 12:58:10 GMT
See <http://jenkins.buildacloud.org/job/build-master/600/changes>

Changes:

[sanjay.tripathi] CLOUDSTACK-6366: add vgpuTypes details  in vgpu_types table.

------------------------------------------
[...truncated 614 lines...]
[INFO] 
[INFO] --- maven-compiler-plugin:2.5.1:testCompile (default-testCompile) @ cloud-framework-db
---
[INFO] Compiling 15 source files to <http://jenkins.buildacloud.org/job/build-master/ws/framework/db/target/test-classes>
[INFO] 
[INFO] --- maven-surefire-plugin:2.12:test (default-test) @ cloud-framework-db ---
[INFO] Surefire report directory: <http://jenkins.buildacloud.org/job/build-master/ws/framework/db/target/surefire-reports>

-------------------------------------------------------
 T E S T S
-------------------------------------------------------
Running com.cloud.utils.DbUtilTest
Failed to find db.properties
log4j:WARN No appenders could be found for logger (com.cloud.utils.db.DbProperties).
log4j:WARN Please initialize the log4j system properly.
log4j:WARN See http://logging.apache.org/log4j/1.2/faq.html#noconfig for more info.
Tests run: 15, Failures: 0, Errors: 0, Skipped: 2, Time elapsed: 0.702 sec

Results :

Tests run: 15, Failures: 0, Errors: 0, Skipped: 2

[INFO]                                                                         
[INFO] ------------------------------------------------------------------------
[INFO] Building Apache CloudStack Framework - Configuration 4.5.0-SNAPSHOT
[INFO] ------------------------------------------------------------------------
[INFO] 
[INFO] --- maven-clean-plugin:2.5:clean (default-clean) @ cloud-framework-config ---
[INFO] Deleting <http://jenkins.buildacloud.org/job/build-master/ws/framework/config/target>
(includes = [**/*], excludes = [])
[INFO] Deleting <http://jenkins.buildacloud.org/job/build-master/ws/framework/config>
(includes = [target, dist], excludes = [])
[INFO] 
[INFO] --- maven-checkstyle-plugin:2.11:check (cloudstack-checkstyle) @ cloud-framework-config
---
[INFO] Starting audit...
Audit done.

[INFO] 
[INFO] --- maven-remote-resources-plugin:1.3:process (default) @ cloud-framework-config ---
[INFO] 
[INFO] --- maven-resources-plugin:2.5:resources (default-resources) @ cloud-framework-config
---
[debug] execute contextualize
[INFO] Using 'UTF-8' encoding to copy filtered resources.
[INFO] Copying 2 resources
[INFO] Copying 3 resources
[INFO] 
[INFO] --- maven-compiler-plugin:2.5.1:compile (default-compile) @ cloud-framework-config
---
[INFO] Compiling 10 source files to <http://jenkins.buildacloud.org/job/build-master/ws/framework/config/target/classes>
[INFO] 
[INFO] --- maven-resources-plugin:2.5:testResources (default-testResources) @ cloud-framework-config
---
[debug] execute contextualize
[INFO] Using 'UTF-8' encoding to copy filtered resources.
[INFO] skip non existing resourceDirectory <http://jenkins.buildacloud.org/job/build-master/ws/framework/config/test/resources>
[INFO] Copying 3 resources
[INFO] 
[INFO] --- maven-compiler-plugin:2.5.1:testCompile (default-testCompile) @ cloud-framework-config
---
[INFO] Compiling 1 source file to <http://jenkins.buildacloud.org/job/build-master/ws/framework/config/target/test-classes>
[INFO] 
[INFO] --- maven-surefire-plugin:2.12:test (default-test) @ cloud-framework-config ---
[INFO] Surefire report directory: <http://jenkins.buildacloud.org/job/build-master/ws/framework/config/target/surefire-reports>

-------------------------------------------------------
 T E S T S
-------------------------------------------------------
Running org.apache.cloudstack.framework.config.impl.ConfigDepotAdminTest
log4j:WARN No appenders could be found for logger (org.apache.cloudstack.framework.config.impl.ConfigDepotImpl).
log4j:WARN Please initialize the log4j system properly.
log4j:WARN See http://logging.apache.org/log4j/1.2/faq.html#noconfig for more info.
Tests run: 1, Failures: 0, Errors: 0, Skipped: 0, Time elapsed: 0.443 sec

Results :

Tests run: 1, Failures: 0, Errors: 0, Skipped: 0

[INFO]                                                                         
[INFO] ------------------------------------------------------------------------
[INFO] Building Apache CloudStack API 4.5.0-SNAPSHOT
[INFO] ------------------------------------------------------------------------
[INFO] 
[INFO] --- maven-clean-plugin:2.5:clean (default-clean) @ cloud-api ---
[INFO] Deleting <http://jenkins.buildacloud.org/job/build-master/ws/api/target> (includes
= [**/*], excludes = [])
[INFO] Deleting <http://jenkins.buildacloud.org/job/build-master/ws/api> (includes =
[target, dist], excludes = [])
[INFO] 
[INFO] --- maven-checkstyle-plugin:2.11:check (cloudstack-checkstyle) @ cloud-api ---
[INFO] Starting audit...
Audit done.

[INFO] 
[INFO] --- maven-remote-resources-plugin:1.3:process (default) @ cloud-api ---
[INFO] 
[INFO] --- maven-resources-plugin:2.5:resources (default-resources) @ cloud-api ---
[debug] execute contextualize
[INFO] Using 'UTF-8' encoding to copy filtered resources.
[INFO] Copying 4 resources
[INFO] Copying 3 resources
[INFO] 
[INFO] --- maven-compiler-plugin:2.5.1:compile (default-compile) @ cloud-api ---
[INFO] Compiling 925 source files to <http://jenkins.buildacloud.org/job/build-master/ws/api/target/classes>
[INFO] -------------------------------------------------------------
[ERROR] COMPILATION ERROR : 
[INFO] -------------------------------------------------------------
[ERROR] <http://jenkins.buildacloud.org/job/build-master/ws/api/src/com/cloud/agent/api/VgpuTypesInfo.java>:[17,7]
error: duplicate class: VgpuTypesInfo
[ERROR] <http://jenkins.buildacloud.org/job/build-master/ws/api/src/com/cloud/agent/api/to/GPUDeviceTO.java>:[21,26]
error: cannot access VgpuTypesInfo
[ERROR]   bad source file: <http://jenkins.buildacloud.org/job/build-master/ws/api/src/com/cloud/agent/api/VgpuTypesInfo.java>
    file does not contain class com.cloud.agent.api.VgpuTypesInfo
    Please remove or make sure it appears in the correct subdirectory of the sourcepath.
<http://jenkins.buildacloud.org/job/build-master/ws/api/src/com/cloud/agent/api/to/GPUDeviceTO.java>:[27,44]
error: cannot find symbol
[ERROR]   symbol:   class VgpuTypesInfo
  location: class GPUDeviceTO
<http://jenkins.buildacloud.org/job/build-master/ws/api/src/com/cloud/agent/api/to/GPUDeviceTO.java>:[29,90]
error: cannot find symbol
[ERROR]   symbol:   class VgpuTypesInfo
  location: class GPUDeviceTO
<http://jenkins.buildacloud.org/job/build-master/ws/api/src/com/cloud/agent/api/to/GPUDeviceTO.java>:[51,43]
error: cannot find symbol
[ERROR]   symbol:   class VgpuTypesInfo
  location: class GPUDeviceTO
<http://jenkins.buildacloud.org/job/build-master/ws/api/src/com/cloud/agent/api/to/GPUDeviceTO.java>:[55,64]
error: cannot find symbol
[INFO] 6 errors 
[INFO] -------------------------------------------------------------
[INFO] ------------------------------------------------------------------------
[INFO] Reactor Summary:
[INFO] 
[INFO] Apache CloudStack Developer Tools - Checkstyle Configuration  SUCCESS [0.714s]
[INFO] Apache CloudStack ................................. SUCCESS [0.666s]
[INFO] Apache CloudStack Maven Conventions Parent ........ SUCCESS [1.355s]
[INFO] Apache CloudStack Framework - Managed Context ..... SUCCESS [2.798s]
[INFO] Apache CloudStack Utils ........................... SUCCESS [10.466s]
[INFO] Apache CloudStack Framework ....................... SUCCESS [0.060s]
[INFO] Apache CloudStack Framework - Event Notification .. SUCCESS [5.992s]
[INFO] Apache CloudStack Framework - Configuration ....... SUCCESS [3.644s]
[INFO] Apache CloudStack API ............................. FAILURE [5.935s]
[INFO] Apache CloudStack Framework - REST ................ SKIPPED
[INFO] Apache CloudStack Framework - IPC ................. SKIPPED
[INFO] Apache CloudStack Cloud Engine .................... SKIPPED
[INFO] Apache CloudStack Cloud Engine API ................ SKIPPED
[INFO] Apache CloudStack Framework - Security ............ SKIPPED
[INFO] Apache CloudStack Core ............................ SKIPPED
[INFO] Apache CloudStack Agents .......................... SKIPPED
[INFO] Apache CloudStack Framework - Clustering .......... SKIPPED
[INFO] Apache CloudStack Framework - Jobs ................ SKIPPED
[INFO] Apache CloudStack Cloud Engine Schema Component ... SKIPPED
[INFO] Apache CloudStack Framework - Event Notification .. SKIPPED
[INFO] Apache CloudStack Cloud Engine Internal Components API  SKIPPED
[INFO] Apache CloudStack Server .......................... SKIPPED
[INFO] Apache CloudStack Usage Server .................... SKIPPED
[INFO] Apache CloudStack Cloud Engine Orchestration Component  SKIPPED
[INFO] Apache CloudStack Cloud Services .................. SKIPPED
[INFO] Apache CloudStack Secondary Storage ............... SKIPPED
[INFO] Apache CloudStack Secondary Storage Service ....... SKIPPED
[INFO] Apache CloudStack Engine Storage Component ........ SKIPPED
[INFO] Apache CloudStack Engine Storage Volume Component . SKIPPED
[INFO] Apache CloudStack Engine Storage Image Component .. SKIPPED
[INFO] Apache CloudStack Engine Storage Data Motion Component  SKIPPED
[INFO] Apache CloudStack Engine Storage Cache Component .. SKIPPED
[INFO] Apache CloudStack Engine Storage Snapshot Component  SKIPPED
[INFO] Apache CloudStack Cloud Engine API ................ SKIPPED
[INFO] Apache CloudStack Cloud Engine Service ............ SKIPPED
[INFO] Apache CloudStack Plugin POM ...................... SKIPPED
[INFO] Apache CloudStack Plugin - API Rate Limit ......... SKIPPED
[INFO] Apache CloudStack Plugin - API Discovery .......... SKIPPED
[INFO] Apache CloudStack Plugin - ACL Static Role Based .. SKIPPED
[INFO] Apache CloudStack Plugin - Host Anti-Affinity Processor  SKIPPED
[INFO] Apache CloudStack Plugin - Explicit Dedication Processor  SKIPPED
[INFO] Apache CloudStack Plugin - User Concentrated Pod Deployment Planner  SKIPPED
[INFO] Apache CloudStack Plugin - User Dispersing Deployment Planner  SKIPPED
[INFO] Apache CloudStack Plugin - Implicit Dedication Planner  SKIPPED
[INFO] Apache CloudStack Plugin - Skip Heurestics Planner  SKIPPED
[INFO] Apache CloudStack Plugin - Host Allocator Random .. SKIPPED
[INFO] Apache CloudStack Plugin - Dedicated Resources .... SKIPPED
[INFO] Apache CloudStack Plugin - Hypervisor OracleVM .... SKIPPED
[INFO] Apache CloudStack Plugin - Open vSwitch ........... SKIPPED
[INFO] Apache CloudStack Plugin - Hypervisor Xen ......... SKIPPED
[INFO] Apache CloudStack Plugin - Hypervisor KVM ......... SKIPPED
[INFO] Apache CloudStack Plugin - RabbitMQ Event Bus ..... SKIPPED
[INFO] Apache CloudStack Plugin - In Memory Event Bus .... SKIPPED
[INFO] Apache CloudStack Plugin - Hypervisor Baremetal ... SKIPPED
[INFO] Apache CloudStack Plugin - Hypervisor UCS ......... SKIPPED
[INFO] Apache CloudStack Plugin - Hypervisor Hyper-V ..... SKIPPED
[INFO] Apache CloudStack Plugin - Network Elastic Load Balancer  SKIPPED
[INFO] Apache CloudStack Plugin - Network Internal Load Balancer  SKIPPED
[INFO] Apache CloudStack Framework - Spring Life Cycle ... SKIPPED
[INFO] Apache CloudStack Plugin - Network Juniper Contrail  SKIPPED
[INFO] Apache CloudStack Plugin - Palo Alto .............. SKIPPED
[INFO] Apache CloudStack Plugin - Network Netscaler ...... SKIPPED
[INFO] Apache CloudStack Plugin - Network Nicira NVP ..... SKIPPED
[INFO] Apache CloudStack Plugin - BigSwitch Virtual Network Segment  SKIPPED
[INFO] Apache CloudStack Plugin - Midokura Midonet ....... SKIPPED
[INFO] Apache CloudStack Plugin - Stratosphere SSP ....... SKIPPED
[INFO] Apache CloudStack Plugin - Network Opendaylight ... SKIPPED
[INFO] Apache CloudStack Plugin - Storage Allocator Random  SKIPPED
[INFO] Apache CloudStack Plugin - User Authenticator LDAP  SKIPPED
[INFO] Apache CloudStack Plugin - User Authenticator MD5 . SKIPPED
[INFO] Apache CloudStack Plugin - User Authenticator Plain Text  SKIPPED
[INFO] Apache CloudStack Plugin - User Authenticator SHA256 Salted  SKIPPED
[INFO] Apache CloudStack Plugin - Dns Notifier Example ... SKIPPED
[INFO] Apache CloudStack Plugin - Storage Image S3 ....... SKIPPED
[INFO] Apache CloudStack Plugin - Storage Image Swift provider  SKIPPED
[INFO] Apache CloudStack Plugin - Storage Image default provider  SKIPPED
[INFO] Apache CloudStack Plugin - Storage Image sample provider  SKIPPED
[INFO] Apache CloudStack Plugin - Storage Volume Nexenta Provider  SKIPPED
[INFO] Apache CloudStack Plugin - Storage Volume SolidFire Provider  SKIPPED
[INFO] Apache CloudStack Plugin - Storage Volume default provider  SKIPPED
[INFO] Apache CloudStack Plugin - Storage Volume CloudByte Provider  SKIPPED
[INFO] Apache CloudStack Plugin - Storage Volume sample provider  SKIPPED
[INFO] Apache CloudStack Plugin - SNMP Alerts ............ SKIPPED
[INFO] Apache CloudStack Plugin - Syslog Alerts .......... SKIPPED
[INFO] Apache CloudStack Plugin - Network VXLAN .......... SKIPPED
[INFO] Apache CloudStack Framework - Spring Module ....... SKIPPED
[INFO] Apache CloudStack IAM Service ..................... SKIPPED
[INFO] Apache CloudStack IAM - Server .................... SKIPPED
[INFO] Apache CloudStack IAM - Plugin .................... SKIPPED
[INFO] Apache CloudStack Secondary Storage Controller .... SKIPPED
[INFO] Apache CloudStack Console Proxy - RDP Client ...... SKIPPED
[INFO] Apache CloudStack Console Proxy ................... SKIPPED
[INFO] Apache CloudStack Console Proxy - Server .......... SKIPPED
[INFO] Apache CloudStack System VM ....................... SKIPPED
[INFO] Apache CloudStack Client UI ....................... SKIPPED
[INFO] Apache CloudStack Framework - QuickCloud .......... SKIPPED
[INFO] Apache CloudStack AWS API Bridge .................. SKIPPED
[INFO] ------------------------------------------------------------------------
[INFO] BUILD FAILURE
[INFO] ------------------------------------------------------------------------
[INFO] Total time: 33.831s
[INFO] Finished at: Wed Apr 09 14:58:07 CEST 2014
[INFO] Final Memory: 48M/334M
[INFO] ------------------------------------------------------------------------
[ERROR] Failed to execute goal org.apache.maven.plugins:maven-compiler-plugin:2.5.1:compile
(default-compile) on project cloud-api: Compilation failure: Compilation failure:
[ERROR] <http://jenkins.buildacloud.org/job/build-master/ws/api/src/com/cloud/agent/api/VgpuTypesInfo.java>:[17,7]
error: duplicate class: VgpuTypesInfo
[ERROR] <http://jenkins.buildacloud.org/job/build-master/ws/api/src/com/cloud/agent/api/to/GPUDeviceTO.java>:[21,26]
error: cannot access VgpuTypesInfo
[ERROR] bad source file: <http://jenkins.buildacloud.org/job/build-master/ws/api/src/com/cloud/agent/api/VgpuTypesInfo.java>
[ERROR] file does not contain class com.cloud.agent.api.VgpuTypesInfo
[ERROR] Please remove or make sure it appears in the correct subdirectory of the sourcepath.
[ERROR] <http://jenkins.buildacloud.org/job/build-master/ws/api/src/com/cloud/agent/api/to/GPUDeviceTO.java>:[27,44]
error: cannot find symbol
[ERROR] symbol:   class VgpuTypesInfo
[ERROR] location: class GPUDeviceTO
[ERROR] <http://jenkins.buildacloud.org/job/build-master/ws/api/src/com/cloud/agent/api/to/GPUDeviceTO.java>:[29,90]
error: cannot find symbol
[ERROR] symbol:   class VgpuTypesInfo
[ERROR] location: class GPUDeviceTO
[ERROR] <http://jenkins.buildacloud.org/job/build-master/ws/api/src/com/cloud/agent/api/to/GPUDeviceTO.java>:[51,43]
error: cannot find symbol
[ERROR] symbol:   class VgpuTypesInfo
[ERROR] location: class GPUDeviceTO
[ERROR] <http://jenkins.buildacloud.org/job/build-master/ws/api/src/com/cloud/agent/api/to/GPUDeviceTO.java>:[55,64]
error: cannot find symbol
[ERROR] -> [Help 1]
[ERROR] 
[ERROR] To see the full stack trace of the errors, re-run Maven with the -e switch.
[ERROR] Re-run Maven using the -X switch to enable full debug logging.
[ERROR] 
[ERROR] For more information about the errors and possible solutions, please read the following
articles:
[ERROR] [Help 1] http://cwiki.apache.org/confluence/display/MAVEN/MojoFailureException
[ERROR] 
[ERROR] After correcting the problems, you can resume the build with the command
[ERROR]   mvn <goals> -rf :cloud-api
Build step 'Invoke top-level Maven targets' marked build as failure

Mime
View raw message