cloudstack-dev mailing list archives

Site index · List index
Message view « Date » · « Thread »
Top « Date » · « Thread »
From jenk...@cloudstack.org
Subject Build failed in Jenkins: cloudstack-4.4-maven-build #151
Date Wed, 09 Apr 2014 12:55:38 GMT
See <http://jenkins.buildacloud.org/job/cloudstack-4.4-maven-build/151/changes>

Changes:

[muralimmreddy] CLOUDSTACK-6253: Optimizing VR alerts getting algorithm In addition to this
a new configuration parameter is added router.alerts.check.interval defaulted to 30minutes
to check for alerts in Virtual Router

[sanjay.tripathi] CLOUDSTACK-6366: add vgpuTypes details  in vgpu_types table.

------------------------------------------
[...truncated 1000 lines...]
[INFO] Apache CloudStack Framework - QuickCloud .......... SKIPPED
[INFO] ------------------------------------------------------------------------
[INFO] BUILD FAILURE
[INFO] ------------------------------------------------------------------------
[INFO] Total time: 2:34.295s
[INFO] Finished at: Wed Apr 09 08:45:02 EDT 2014
[INFO] Final Memory: 42M/173M
[INFO] ------------------------------------------------------------------------
[ERROR] Failed to execute goal org.apache.maven.plugins:maven-compiler-plugin:2.5.1:compile
(default-compile) on project cloud-api: Compilation failure: Compilation failure:
[ERROR] <http://jenkins.buildacloud.org/job/cloudstack-4.4-maven-build/ws/api/src/com/cloud/agent/api/VgpuTypesInfo.java>:[17,7]
error: duplicate class: VgpuTypesInfo
[ERROR] <http://jenkins.buildacloud.org/job/cloudstack-4.4-maven-build/ws/api/src/com/cloud/agent/api/to/GPUDeviceTO.java>:[21,26]
error: cannot access VgpuTypesInfo
[ERROR] bad source file: <http://jenkins.buildacloud.org/job/cloudstack-4.4-maven-build/ws/api/src/com/cloud/agent/api/VgpuTypesInfo.java>
[ERROR] file does not contain class com.cloud.agent.api.VgpuTypesInfo
[ERROR] Please remove or make sure it appears in the correct subdirectory of the sourcepath.
[ERROR] <http://jenkins.buildacloud.org/job/cloudstack-4.4-maven-build/ws/api/src/org/apache/cloudstack/api/response/CapabilityResponse.java>:[29,11]
error: cannot find symbol
[ERROR] symbol:   method description()
[ERROR] location: @interface Param
[ERROR] <http://jenkins.buildacloud.org/job/cloudstack-4.4-maven-build/ws/api/src/org/apache/cloudstack/api/response/CapabilityResponse.java>:[33,11]
error: cannot find symbol
[ERROR] symbol:   method description()
[ERROR] location: @interface Param
[ERROR] <http://jenkins.buildacloud.org/job/cloudstack-4.4-maven-build/ws/api/src/org/apache/cloudstack/api/response/CapabilityResponse.java>:[37,11]
error: cannot find symbol
[ERROR] symbol:   method description()
[ERROR] location: @interface Param
[ERROR] <http://jenkins.buildacloud.org/job/cloudstack-4.4-maven-build/ws/api/src/org/apache/cloudstack/api/BaseResponse.java>:[53,11]
error: cannot find symbol
[ERROR] symbol:   method description()
[ERROR] location: @interface Param
[ERROR] <http://jenkins.buildacloud.org/job/cloudstack-4.4-maven-build/ws/api/src/org/apache/cloudstack/api/BaseResponse.java>:[57,11]
error: cannot find symbol
[ERROR] symbol:   method description()
[ERROR] location: @interface Param
[ERROR] <http://jenkins.buildacloud.org/job/cloudstack-4.4-maven-build/ws/api/src/org/apache/cloudstack/api/command/user/vm/DestroyVMCmd.java>:[55,9]
error: cannot find symbol
[ERROR] symbol:   method accessType()
[ERROR] location: @interface ACL
[ERROR] <http://jenkins.buildacloud.org/job/cloudstack-4.4-maven-build/ws/api/src/org/apache/cloudstack/api/command/user/vm/DestroyVMCmd.java>:[55,32]
error: attribute value must be constant
[ERROR] <http://jenkins.buildacloud.org/job/cloudstack-4.4-maven-build/ws/api/src/org/apache/cloudstack/api/command/user/vm/ResetVMPasswordCmd.java>:[53,9]
error: cannot find symbol
[ERROR] symbol:   method accessType()
[ERROR] location: @interface ACL
[ERROR] <http://jenkins.buildacloud.org/job/cloudstack-4.4-maven-build/ws/api/src/org/apache/cloudstack/api/command/user/vm/ResetVMPasswordCmd.java>:[53,32]
error: attribute value must be constant
[ERROR] <http://jenkins.buildacloud.org/job/cloudstack-4.4-maven-build/ws/api/src/org/apache/cloudstack/api/command/user/vm/ResetVMSSHKeyCmd.java>:[56,9]
error: cannot find symbol
[ERROR] symbol:   method accessType()
[ERROR] location: @interface ACL
[ERROR] <http://jenkins.buildacloud.org/job/cloudstack-4.4-maven-build/ws/api/src/org/apache/cloudstack/api/command/user/vm/ResetVMSSHKeyCmd.java>:[56,32]
error: attribute value must be constant
[ERROR] <http://jenkins.buildacloud.org/job/cloudstack-4.4-maven-build/ws/api/src/org/apache/cloudstack/api/command/user/vm/StartVMCmd.java>:[58,9]
error: cannot find symbol
[ERROR] symbol:   method accessType()
[ERROR] location: @interface ACL
[ERROR] <http://jenkins.buildacloud.org/job/cloudstack-4.4-maven-build/ws/api/src/org/apache/cloudstack/api/command/user/vm/StartVMCmd.java>:[58,32]
error: attribute value must be constant
[ERROR] <http://jenkins.buildacloud.org/job/cloudstack-4.4-maven-build/ws/api/src/org/apache/cloudstack/api/command/user/vm/RebootVMCmd.java>:[50,9]
error: cannot find symbol
[ERROR] symbol:   method accessType()
[ERROR] location: @interface ACL
[ERROR] <http://jenkins.buildacloud.org/job/cloudstack-4.4-maven-build/ws/api/src/org/apache/cloudstack/api/command/user/vm/RebootVMCmd.java>:[50,32]
error: attribute value must be constant
[ERROR] <http://jenkins.buildacloud.org/job/cloudstack-4.4-maven-build/ws/api/src/org/apache/cloudstack/api/command/user/vm/UpdateVMCmd.java>:[62,9]
error: cannot find symbol
[ERROR] symbol:   method accessType()
[ERROR] location: @interface ACL
[ERROR] <http://jenkins.buildacloud.org/job/cloudstack-4.4-maven-build/ws/api/src/org/apache/cloudstack/api/command/user/vm/UpdateVMCmd.java>:[62,32]
error: attribute value must be constant
[ERROR] <http://jenkins.buildacloud.org/job/cloudstack-4.4-maven-build/ws/api/src/org/apache/cloudstack/api/command/user/vm/AddNicToVMCmd.java>:[52,9]
error: cannot find symbol
[ERROR] symbol:   method accessType()
[ERROR] location: @interface ACL
[ERROR] <http://jenkins.buildacloud.org/job/cloudstack-4.4-maven-build/ws/api/src/org/apache/cloudstack/api/command/user/vm/AddNicToVMCmd.java>:[52,32]
error: attribute value must be constant
[ERROR] <http://jenkins.buildacloud.org/job/cloudstack-4.4-maven-build/ws/api/src/org/apache/cloudstack/api/command/user/vm/RemoveNicFromVMCmd.java>:[52,9]
error: cannot find symbol
[ERROR] symbol:   method accessType()
[ERROR] location: @interface ACL
[ERROR] <http://jenkins.buildacloud.org/job/cloudstack-4.4-maven-build/ws/api/src/org/apache/cloudstack/api/command/user/vm/RemoveNicFromVMCmd.java>:[52,32]
error: attribute value must be constant
[ERROR] <http://jenkins.buildacloud.org/job/cloudstack-4.4-maven-build/ws/api/src/org/apache/cloudstack/api/command/user/vm/UpdateDefaultNicForVMCmd.java>:[53,9]
error: cannot find symbol
[ERROR] symbol:   method accessType()
[ERROR] location: @interface ACL
[ERROR] <http://jenkins.buildacloud.org/job/cloudstack-4.4-maven-build/ws/api/src/org/apache/cloudstack/api/command/user/vm/UpdateDefaultNicForVMCmd.java>:[53,32]
error: attribute value must be constant
[ERROR] <http://jenkins.buildacloud.org/job/cloudstack-4.4-maven-build/ws/api/src/org/apache/cloudstack/api/command/user/vm/DeployVMCmd.java>:[108,9]
error: cannot find symbol
[ERROR] symbol:   method accessType()
[ERROR] location: @interface ACL
[ERROR] <http://jenkins.buildacloud.org/job/cloudstack-4.4-maven-build/ws/api/src/org/apache/cloudstack/api/command/user/vm/DeployVMCmd.java>:[108,32]
error: attribute value must be constant
[ERROR] <http://jenkins.buildacloud.org/job/cloudstack-4.4-maven-build/ws/api/src/org/apache/cloudstack/api/command/user/vmgroup/DeleteVMGroupCmd.java>:[45,9]
error: cannot find symbol
[ERROR] symbol:   method accessType()
[ERROR] location: @interface ACL
[ERROR] <http://jenkins.buildacloud.org/job/cloudstack-4.4-maven-build/ws/api/src/org/apache/cloudstack/api/command/user/vmgroup/DeleteVMGroupCmd.java>:[45,32]
error: attribute value must be constant
[ERROR] <http://jenkins.buildacloud.org/job/cloudstack-4.4-maven-build/ws/api/src/org/apache/cloudstack/api/command/user/vm/UpgradeVMCmd.java>:[58,9]
error: cannot find symbol
[ERROR] symbol:   method accessType()
[ERROR] location: @interface ACL
[ERROR] <http://jenkins.buildacloud.org/job/cloudstack-4.4-maven-build/ws/api/src/org/apache/cloudstack/api/command/user/vm/UpgradeVMCmd.java>:[58,32]
error: attribute value must be constant
[ERROR] <http://jenkins.buildacloud.org/job/cloudstack-4.4-maven-build/ws/api/src/org/apache/cloudstack/api/command/user/vm/RestoreVMCmd.java>:[50,9]
error: cannot find symbol
[ERROR] symbol:   method accessType()
[ERROR] location: @interface ACL
[ERROR] <http://jenkins.buildacloud.org/job/cloudstack-4.4-maven-build/ws/api/src/org/apache/cloudstack/api/command/user/vm/RestoreVMCmd.java>:[50,32]
error: attribute value must be constant
[ERROR] <http://jenkins.buildacloud.org/job/cloudstack-4.4-maven-build/ws/api/src/org/apache/cloudstack/api/command/user/vm/ScaleVMCmd.java>:[60,9]
error: cannot find symbol
[ERROR] symbol:   method accessType()
[ERROR] location: @interface ACL
[ERROR] <http://jenkins.buildacloud.org/job/cloudstack-4.4-maven-build/ws/api/src/org/apache/cloudstack/api/command/user/vm/ScaleVMCmd.java>:[60,32]
error: attribute value must be constant
[ERROR] <http://jenkins.buildacloud.org/job/cloudstack-4.4-maven-build/ws/api/src/org/apache/cloudstack/api/command/admin/vm/ExpungeVMCmd.java>:[54,9]
error: cannot find symbol
[ERROR] symbol:   method accessType()
[ERROR] location: @interface ACL
[ERROR] <http://jenkins.buildacloud.org/job/cloudstack-4.4-maven-build/ws/api/src/org/apache/cloudstack/api/command/admin/vm/ExpungeVMCmd.java>:[54,32]
error: attribute value must be constant
[ERROR] <http://jenkins.buildacloud.org/job/cloudstack-4.4-maven-build/ws/api/src/org/apache/cloudstack/api/command/admin/systemvm/StopSystemVmCmd.java>:[50,9]
error: cannot find symbol
[ERROR] symbol:   method accessType()
[ERROR] location: @interface ACL
[ERROR] <http://jenkins.buildacloud.org/job/cloudstack-4.4-maven-build/ws/api/src/org/apache/cloudstack/api/command/admin/systemvm/StopSystemVmCmd.java>:[50,32]
error: attribute value must be constant
[ERROR] <http://jenkins.buildacloud.org/job/cloudstack-4.4-maven-build/ws/api/src/org/apache/cloudstack/api/command/admin/systemvm/RebootSystemVmCmd.java>:[47,9]
error: cannot find symbol
[ERROR] symbol:   method accessType()
[ERROR] location: @interface ACL
[ERROR] <http://jenkins.buildacloud.org/job/cloudstack-4.4-maven-build/ws/api/src/org/apache/cloudstack/api/command/admin/systemvm/RebootSystemVmCmd.java>:[47,32]
error: attribute value must be constant
[ERROR] <http://jenkins.buildacloud.org/job/cloudstack-4.4-maven-build/ws/api/src/org/apache/cloudstack/api/command/admin/systemvm/DestroySystemVmCmd.java>:[44,9]
error: cannot find symbol
[ERROR] symbol:   method accessType()
[ERROR] location: @interface ACL
[ERROR] <http://jenkins.buildacloud.org/job/cloudstack-4.4-maven-build/ws/api/src/org/apache/cloudstack/api/command/admin/systemvm/DestroySystemVmCmd.java>:[44,32]
error: attribute value must be constant
[ERROR] <http://jenkins.buildacloud.org/job/cloudstack-4.4-maven-build/ws/api/src/org/apache/cloudstack/api/command/admin/systemvm/UpgradeSystemVMCmd.java>:[55,9]
error: cannot find symbol
[ERROR] symbol:   method accessType()
[ERROR] location: @interface ACL
[ERROR] <http://jenkins.buildacloud.org/job/cloudstack-4.4-maven-build/ws/api/src/org/apache/cloudstack/api/command/admin/systemvm/UpgradeSystemVMCmd.java>:[55,32]
error: attribute value must be constant
[ERROR] <http://jenkins.buildacloud.org/job/cloudstack-4.4-maven-build/ws/api/src/org/apache/cloudstack/api/command/user/vmgroup/UpdateVMGroupCmd.java>:[44,9]
error: cannot find symbol
[ERROR] symbol:   method accessType()
[ERROR] location: @interface ACL
[ERROR] <http://jenkins.buildacloud.org/job/cloudstack-4.4-maven-build/ws/api/src/org/apache/cloudstack/api/command/user/vmgroup/UpdateVMGroupCmd.java>:[44,32]
error: attribute value must be constant
[ERROR] <http://jenkins.buildacloud.org/job/cloudstack-4.4-maven-build/ws/api/src/org/apache/cloudstack/api/command/user/vm/GetVMPasswordCmd.java>:[46,9]
error: cannot find symbol
[ERROR] symbol:   method accessType()
[ERROR] location: @interface ACL
[ERROR] <http://jenkins.buildacloud.org/job/cloudstack-4.4-maven-build/ws/api/src/org/apache/cloudstack/api/command/user/vm/GetVMPasswordCmd.java>:[46,32]
error: attribute value must be constant
[ERROR] <http://jenkins.buildacloud.org/job/cloudstack-4.4-maven-build/ws/api/src/org/apache/cloudstack/api/command/admin/systemvm/ScaleSystemVMCmd.java>:[60,9]
error: cannot find symbol
[ERROR] symbol:   method accessType()
[ERROR] location: @interface ACL
[ERROR] <http://jenkins.buildacloud.org/job/cloudstack-4.4-maven-build/ws/api/src/org/apache/cloudstack/api/command/admin/systemvm/ScaleSystemVMCmd.java>:[60,32]
error: attribute value must be constant
[ERROR] <http://jenkins.buildacloud.org/job/cloudstack-4.4-maven-build/ws/api/src/org/apache/cloudstack/api/command/user/volume/ResizeVolumeCmd.java>:[54,9]
error: cannot find symbol
[ERROR] symbol:   method accessType()
[ERROR] location: @interface ACL
[ERROR] <http://jenkins.buildacloud.org/job/cloudstack-4.4-maven-build/ws/api/src/org/apache/cloudstack/api/command/user/volume/ResizeVolumeCmd.java>:[54,32]
error: attribute value must be constant
[ERROR] <http://jenkins.buildacloud.org/job/cloudstack-4.4-maven-build/ws/api/src/org/apache/cloudstack/api/command/user/volume/AttachVolumeCmd.java>:[56,9]
error: cannot find symbol
[ERROR] symbol:   method accessType()
[ERROR] location: @interface ACL
[ERROR] <http://jenkins.buildacloud.org/job/cloudstack-4.4-maven-build/ws/api/src/org/apache/cloudstack/api/command/user/volume/AttachVolumeCmd.java>:[56,32]
error: attribute value must be constant
[ERROR] <http://jenkins.buildacloud.org/job/cloudstack-4.4-maven-build/ws/api/src/org/apache/cloudstack/api/command/user/volume/AttachVolumeCmd.java>:[60,9]
error: cannot find symbol
[ERROR] symbol:   method accessType()
[ERROR] location: @interface ACL
[ERROR] <http://jenkins.buildacloud.org/job/cloudstack-4.4-maven-build/ws/api/src/org/apache/cloudstack/api/command/user/volume/AttachVolumeCmd.java>:[60,32]
error: attribute value must be constant
[ERROR] <http://jenkins.buildacloud.org/job/cloudstack-4.4-maven-build/ws/api/src/org/apache/cloudstack/api/command/user/volume/DetachVolumeCmd.java>:[58,9]
error: cannot find symbol
[ERROR] symbol:   method accessType()
[ERROR] location: @interface ACL
[ERROR] <http://jenkins.buildacloud.org/job/cloudstack-4.4-maven-build/ws/api/src/org/apache/cloudstack/api/command/user/volume/DetachVolumeCmd.java>:[58,32]
error: attribute value must be constant
[ERROR] <http://jenkins.buildacloud.org/job/cloudstack-4.4-maven-build/ws/api/src/org/apache/cloudstack/api/command/user/volume/ExtractVolumeCmd.java>:[52,9]
error: cannot find symbol
[ERROR] symbol:   method accessType()
[ERROR] location: @interface ACL
[ERROR] <http://jenkins.buildacloud.org/job/cloudstack-4.4-maven-build/ws/api/src/org/apache/cloudstack/api/command/user/volume/ExtractVolumeCmd.java>:[52,32]
error: attribute value must be constant
[ERROR] <http://jenkins.buildacloud.org/job/cloudstack-4.4-maven-build/ws/api/src/org/apache/cloudstack/api/command/user/network/RestartNetworkCmd.java>:[53,9]
error: cannot find symbol
[ERROR] symbol:   method accessType()
[ERROR] location: @interface ACL
[ERROR] <http://jenkins.buildacloud.org/job/cloudstack-4.4-maven-build/ws/api/src/org/apache/cloudstack/api/command/user/network/RestartNetworkCmd.java>:[53,32]
error: attribute value must be constant
[ERROR] <http://jenkins.buildacloud.org/job/cloudstack-4.4-maven-build/ws/api/src/org/apache/cloudstack/api/command/user/securitygroup/RevokeSecurityGroupIngressCmd.java>:[49,9]
error: cannot find symbol
[ERROR] symbol:   method accessType()
[ERROR] location: @interface ACL
[ERROR] <http://jenkins.buildacloud.org/job/cloudstack-4.4-maven-build/ws/api/src/org/apache/cloudstack/api/command/user/securitygroup/RevokeSecurityGroupIngressCmd.java>:[49,32]
error: attribute value must be constant
[ERROR] <http://jenkins.buildacloud.org/job/cloudstack-4.4-maven-build/ws/api/src/org/apache/cloudstack/api/command/user/securitygroup/RevokeSecurityGroupIngressCmd.java>:[49,47]
error: cannot find symbol
[ERROR] symbol:   method pointerToEntity()
[ERROR] location: @interface ACL
[ERROR] <http://jenkins.buildacloud.org/job/cloudstack-4.4-maven-build/ws/api/src/org/apache/cloudstack/api/command/user/securitygroup/DeleteSecurityGroupCmd.java>:[61,9]
error: cannot find symbol
[ERROR] symbol:   method accessType()
[ERROR] location: @interface ACL
[ERROR] <http://jenkins.buildacloud.org/job/cloudstack-4.4-maven-build/ws/api/src/org/apache/cloudstack/api/command/user/securitygroup/DeleteSecurityGroupCmd.java>:[61,32]
error: attribute value must be constant
[ERROR] <http://jenkins.buildacloud.org/job/cloudstack-4.4-maven-build/ws/api/src/org/apache/cloudstack/api/command/user/securitygroup/AuthorizeSecurityGroupIngressCmd.java>:[94,9]
error: cannot find symbol
[ERROR] symbol:   method accessType()
[ERROR] location: @interface ACL
[ERROR] <http://jenkins.buildacloud.org/job/cloudstack-4.4-maven-build/ws/api/src/org/apache/cloudstack/api/command/user/securitygroup/AuthorizeSecurityGroupIngressCmd.java>:[94,32]
error: attribute value must be constant
[ERROR] <http://jenkins.buildacloud.org/job/cloudstack-4.4-maven-build/ws/api/src/org/apache/cloudstack/api/command/user/securitygroup/AuthorizeSecurityGroupIngressCmd.java>:[98,9]
error: cannot find symbol
[ERROR] symbol:   method accessType()
[ERROR] location: @interface ACL
[ERROR] <http://jenkins.buildacloud.org/job/cloudstack-4.4-maven-build/ws/api/src/org/apache/cloudstack/api/command/user/securitygroup/AuthorizeSecurityGroupIngressCmd.java>:[98,32]
error: attribute value must be constant
[ERROR] <http://jenkins.buildacloud.org/job/cloudstack-4.4-maven-build/ws/api/src/org/apache/cloudstack/api/command/user/securitygroup/AuthorizeSecurityGroupEgressCmd.java>:[94,9]
error: cannot find symbol
[ERROR] symbol:   method accessType()
[ERROR] location: @interface ACL
[ERROR] <http://jenkins.buildacloud.org/job/cloudstack-4.4-maven-build/ws/api/src/org/apache/cloudstack/api/command/user/securitygroup/AuthorizeSecurityGroupEgressCmd.java>:[94,32]
error: attribute value must be constant
[ERROR] <http://jenkins.buildacloud.org/job/cloudstack-4.4-maven-build/ws/api/src/org/apache/cloudstack/api/command/user/securitygroup/AuthorizeSecurityGroupEgressCmd.java>:[98,9]
error: cannot find symbol
[ERROR] symbol:   method accessType()
[ERROR] location: @interface ACL
[ERROR] <http://jenkins.buildacloud.org/job/cloudstack-4.4-maven-build/ws/api/src/org/apache/cloudstack/api/command/user/securitygroup/AuthorizeSecurityGroupEgressCmd.java>:[98,32]
error: attribute value must be constant
[ERROR] <http://jenkins.buildacloud.org/job/cloudstack-4.4-maven-build/ws/api/src/org/apache/cloudstack/api/response/UserResponse.java>:[33,11]
error: cannot find symbol
[ERROR] symbol:   method description()
[ERROR] location: @interface Param
[ERROR] <http://jenkins.buildacloud.org/job/cloudstack-4.4-maven-build/ws/api/src/org/apache/cloudstack/api/response/UserResponse.java>:[37,11]
error: cannot find symbol
[ERROR] symbol:   method description()
[ERROR] location: @interface Param
[ERROR] <http://jenkins.buildacloud.org/job/cloudstack-4.4-maven-build/ws/api/src/org/apache/cloudstack/api/response/UserResponse.java>:[41,11]
error: cannot find symbol
[ERROR] symbol:   method description()
[ERROR] location: @interface Param
[ERROR] <http://jenkins.buildacloud.org/job/cloudstack-4.4-maven-build/ws/api/src/org/apache/cloudstack/api/response/UserResponse.java>:[45,11]
error: cannot find symbol
[ERROR] symbol:   method description()
[ERROR] location: @interface Param
[ERROR] <http://jenkins.buildacloud.org/job/cloudstack-4.4-maven-build/ws/api/src/org/apache/cloudstack/api/response/UserResponse.java>:[49,11]
error: cannot find symbol
[ERROR] symbol:   method description()
[ERROR] location: @interface Param
[ERROR] <http://jenkins.buildacloud.org/job/cloudstack-4.4-maven-build/ws/api/src/org/apache/cloudstack/api/response/UserResponse.java>:[53,11]
error: cannot find symbol
[ERROR] symbol:   method description()
[ERROR] location: @interface Param
[ERROR] <http://jenkins.buildacloud.org/job/cloudstack-4.4-maven-build/ws/api/src/org/apache/cloudstack/api/response/UserResponse.java>:[57,11]
error: cannot find symbol
[ERROR] symbol:   method description()
[ERROR] location: @interface Param
[ERROR] <http://jenkins.buildacloud.org/job/cloudstack-4.4-maven-build/ws/api/src/org/apache/cloudstack/api/response/UserResponse.java>:[61,11]
error: cannot find symbol
[ERROR] symbol:   method description()
[ERROR] location: @interface Param
[ERROR] <http://jenkins.buildacloud.org/job/cloudstack-4.4-maven-build/ws/api/src/org/apache/cloudstack/api/response/UserResponse.java>:[65,11]
error: cannot find symbol
[ERROR] symbol:   method description()
[ERROR] location: @interface Param
[ERROR] <http://jenkins.buildacloud.org/job/cloudstack-4.4-maven-build/ws/api/src/org/apache/cloudstack/api/response/UserResponse.java>:[69,11]
error: cannot find symbol
[ERROR] symbol:   method description()
[ERROR] location: @interface Param
[ERROR] <http://jenkins.buildacloud.org/job/cloudstack-4.4-maven-build/ws/api/src/org/apache/cloudstack/api/response/UserResponse.java>:[73,11]
error: cannot find symbol
[ERROR] symbol:   method description()
[ERROR] location: @interface Param
[ERROR] <http://jenkins.buildacloud.org/job/cloudstack-4.4-maven-build/ws/api/src/org/apache/cloudstack/api/response/UserResponse.java>:[77,11]
error: cannot find symbol
[ERROR] symbol:   method description()
[ERROR] location: @interface Param
[ERROR] <http://jenkins.buildacloud.org/job/cloudstack-4.4-maven-build/ws/api/src/org/apache/cloudstack/api/response/UserResponse.java>:[81,11]
error: cannot find symbol
[ERROR] symbol:   method description()
[ERROR] location: @interface Param
[ERROR] <http://jenkins.buildacloud.org/job/cloudstack-4.4-maven-build/ws/api/src/org/apache/cloudstack/api/response/UserResponse.java>:[85,11]
error: cannot find symbol
[ERROR] symbol:   method description()
[ERROR] location: @interface Param
[ERROR] <http://jenkins.buildacloud.org/job/cloudstack-4.4-maven-build/ws/api/src/org/apache/cloudstack/api/response/UserResponse.java>:[89,11]
error: cannot find symbol
[ERROR] symbol:   method description()
[ERROR] location: @interface Param
[ERROR] <http://jenkins.buildacloud.org/job/cloudstack-4.4-maven-build/ws/api/src/org/apache/cloudstack/api/response/UserResponse.java>:[93,11]
error: cannot find symbol
[ERROR] symbol:   method description()
[ERROR] location: @interface Param
[ERROR] <http://jenkins.buildacloud.org/job/cloudstack-4.4-maven-build/ws/api/src/org/apache/cloudstack/api/response/UserResponse.java>:[97,11]
error: cannot find symbol
[ERROR] symbol:   method description()
[ERROR] location: @interface Param
[ERROR] <http://jenkins.buildacloud.org/job/cloudstack-4.4-maven-build/ws/api/src/org/apache/cloudstack/api/response/UserResponse.java>:[97,69]
error: cannot find symbol
[ERROR] symbol:   method since()
[ERROR] location: @interface Param
[ERROR] <http://jenkins.buildacloud.org/job/cloudstack-4.4-maven-build/ws/api/src/org/apache/cloudstack/api/response/AccountResponse.java>:[35,11]
error: cannot find symbol
[ERROR] symbol:   method description()
[ERROR] location: @interface Param
[ERROR] <http://jenkins.buildacloud.org/job/cloudstack-4.4-maven-build/ws/api/src/org/apache/cloudstack/api/response/AccountResponse.java>:[39,11]
error: cannot find symbol
[ERROR] symbol:   method description()
[ERROR] location: @interface Param
[ERROR] <http://jenkins.buildacloud.org/job/cloudstack-4.4-maven-build/ws/api/src/org/apache/cloudstack/api/response/AccountResponse.java>:[43,11]
error: cannot find symbol
[ERROR] symbol:   method description()
[ERROR] location: @interface Param
[ERROR] <http://jenkins.buildacloud.org/job/cloudstack-4.4-maven-build/ws/api/src/org/apache/cloudstack/api/response/AccountResponse.java>:[47,11]
error: cannot find symbol
[ERROR] symbol:   method description()
[ERROR] location: @interface Param
[ERROR] <http://jenkins.buildacloud.org/job/cloudstack-4.4-maven-build/ws/api/src/org/apache/cloudstack/api/response/AccountResponse.java>:[51,11]
error: cannot find symbol
[ERROR] symbol:   method description()
[ERROR] location: @interface Param
[ERROR] <http://jenkins.buildacloud.org/job/cloudstack-4.4-maven-build/ws/api/src/org/apache/cloudstack/api/response/AccountResponse.java>:[55,11]
error: cannot find symbol
[ERROR] -> [Help 1]
[ERROR] 
[ERROR] To see the full stack trace of the errors, re-run Maven with the -e switch.
[ERROR] Re-run Maven using the -X switch to enable full debug logging.
[ERROR] 
[ERROR] For more information about the errors and possible solutions, please read the following
articles:
[ERROR] [Help 1] http://cwiki.apache.org/confluence/display/MAVEN/MojoFailureException
[ERROR] 
[ERROR] After correcting the problems, you can resume the build with the command
[ERROR]   mvn <goals> -rf :cloud-api
Build step 'Invoke top-level Maven targets' marked build as failure

Mime
View raw message