cloudstack-dev mailing list archives

Site index · List index
Message view « Date » · « Thread »
Top « Date » · « Thread »
From jenk...@cloudstack.org
Subject Build failed in Jenkins: build-master-slowbuild #569
Date Thu, 10 Apr 2014 13:46:57 GMT
See <http://jenkins.buildacloud.org/job/build-master-slowbuild/569/changes>

Changes:

[wido] kvm: Add more debugging information when a volume is deleted.

------------------------------------------
[...truncated 16800 lines...]
[ERROR] <http://jenkins.buildacloud.org/job/build-master-slowbuild/ws/plugins/hypervisors/kvm/src/com/cloud/hypervisor/kvm/resource/LibvirtComputingResource.java>:[22,19]
error: package com.ceph.rbd does not exist
[ERROR] <http://jenkins.buildacloud.org/job/build-master-slowbuild/ws/plugins/hypervisors/kvm/src/com/cloud/hypervisor/kvm/resource/LibvirtComputingResource.java>:[23,19]
error: package com.ceph.rbd does not exist
[ERROR] <http://jenkins.buildacloud.org/job/build-master-slowbuild/ws/plugins/hypervisors/kvm/src/com/cloud/hypervisor/kvm/resource/LibvirtComputingResource.java>:[24,19]
error: package com.ceph.rbd does not exist
[ERROR] <http://jenkins.buildacloud.org/job/build-master-slowbuild/ws/plugins/hypervisors/kvm/src/com/cloud/hypervisor/kvm/storage/LibvirtStorageAdaptor.java>:[34,21]
error: package com.ceph.rados does not exist
[ERROR] <http://jenkins.buildacloud.org/job/build-master-slowbuild/ws/plugins/hypervisors/kvm/src/com/cloud/hypervisor/kvm/storage/LibvirtStorageAdaptor.java>:[35,21]
error: package com.ceph.rados does not exist
[ERROR] <http://jenkins.buildacloud.org/job/build-master-slowbuild/ws/plugins/hypervisors/kvm/src/com/cloud/hypervisor/kvm/storage/LibvirtStorageAdaptor.java>:[36,21]
error: package com.ceph.rados does not exist
[ERROR] <http://jenkins.buildacloud.org/job/build-master-slowbuild/ws/plugins/hypervisors/kvm/src/com/cloud/hypervisor/kvm/storage/LibvirtStorageAdaptor.java>:[37,19]
error: package com.ceph.rbd does not exist
[ERROR] <http://jenkins.buildacloud.org/job/build-master-slowbuild/ws/plugins/hypervisors/kvm/src/com/cloud/hypervisor/kvm/storage/LibvirtStorageAdaptor.java>:[38,19]
error: package com.ceph.rbd does not exist
[ERROR] <http://jenkins.buildacloud.org/job/build-master-slowbuild/ws/plugins/hypervisors/kvm/src/com/cloud/hypervisor/kvm/storage/LibvirtStorageAdaptor.java>:[39,19]
error: package com.ceph.rbd does not exist
[ERROR] <http://jenkins.buildacloud.org/job/build-master-slowbuild/ws/plugins/hypervisors/kvm/src/com/cloud/hypervisor/kvm/storage/LibvirtStorageAdaptor.java>:[40,23]
error: package com.ceph.rbd.jna does not exist
[ERROR] <http://jenkins.buildacloud.org/job/build-master-slowbuild/ws/plugins/hypervisors/kvm/src/com/cloud/hypervisor/kvm/storage/KVMStorageProcessor.java>:[50,21]
error: package com.ceph.rados does not exist
[ERROR] <http://jenkins.buildacloud.org/job/build-master-slowbuild/ws/plugins/hypervisors/kvm/src/com/cloud/hypervisor/kvm/storage/KVMStorageProcessor.java>:[51,21]
error: package com.ceph.rados does not exist
[ERROR] <http://jenkins.buildacloud.org/job/build-master-slowbuild/ws/plugins/hypervisors/kvm/src/com/cloud/hypervisor/kvm/storage/KVMStorageProcessor.java>:[52,21]
error: package com.ceph.rados does not exist
[ERROR] <http://jenkins.buildacloud.org/job/build-master-slowbuild/ws/plugins/hypervisors/kvm/src/com/cloud/hypervisor/kvm/storage/KVMStorageProcessor.java>:[53,19]
error: package com.ceph.rbd does not exist
[ERROR] <http://jenkins.buildacloud.org/job/build-master-slowbuild/ws/plugins/hypervisors/kvm/src/com/cloud/hypervisor/kvm/storage/KVMStorageProcessor.java>:[54,19]
error: package com.ceph.rbd does not exist
[ERROR] <http://jenkins.buildacloud.org/job/build-master-slowbuild/ws/plugins/hypervisors/kvm/src/com/cloud/hypervisor/kvm/storage/KVMStorageProcessor.java>:[55,19]
error: package com.ceph.rbd does not exist
[ERROR] <http://jenkins.buildacloud.org/job/build-master-slowbuild/ws/plugins/hypervisors/kvm/src/com/cloud/hypervisor/kvm/resource/LibvirtComputingResource.java>:[2372,24]
error: cannot find symbol
[ERROR] symbol:   class Rados
[ERROR] location: class LibvirtComputingResource
[ERROR] <http://jenkins.buildacloud.org/job/build-master-slowbuild/ws/plugins/hypervisors/kvm/src/com/cloud/hypervisor/kvm/resource/LibvirtComputingResource.java>:[2372,38]
error: cannot find symbol
[ERROR] symbol:   class Rados
[ERROR] location: class LibvirtComputingResource
[ERROR] <http://jenkins.buildacloud.org/job/build-master-slowbuild/ws/plugins/hypervisors/kvm/src/com/cloud/hypervisor/kvm/resource/LibvirtComputingResource.java>:[2379,24]
error: cannot find symbol
[ERROR] symbol:   class IoCTX
[ERROR] location: class LibvirtComputingResource
[ERROR] <http://jenkins.buildacloud.org/job/build-master-slowbuild/ws/plugins/hypervisors/kvm/src/com/cloud/hypervisor/kvm/resource/LibvirtComputingResource.java>:[2380,24]
error: cannot find symbol
[ERROR] symbol:   class Rbd
[ERROR] location: class LibvirtComputingResource
[ERROR] <http://jenkins.buildacloud.org/job/build-master-slowbuild/ws/plugins/hypervisors/kvm/src/com/cloud/hypervisor/kvm/resource/LibvirtComputingResource.java>:[2380,38]
error: cannot find symbol
[ERROR] symbol:   class Rbd
[ERROR] location: class LibvirtComputingResource
[ERROR] <http://jenkins.buildacloud.org/job/build-master-slowbuild/ws/plugins/hypervisors/kvm/src/com/cloud/hypervisor/kvm/resource/LibvirtComputingResource.java>:[2381,24]
error: cannot find symbol
[ERROR] symbol:   class RbdImage
[ERROR] location: class LibvirtComputingResource
[ERROR] <http://jenkins.buildacloud.org/job/build-master-slowbuild/ws/plugins/hypervisors/kvm/src/com/cloud/hypervisor/kvm/resource/LibvirtComputingResource.java>:[2455,20]
error: cannot find symbol
[ERROR] symbol:   class Rados
[ERROR] location: class LibvirtComputingResource
[ERROR] <http://jenkins.buildacloud.org/job/build-master-slowbuild/ws/plugins/hypervisors/kvm/src/com/cloud/hypervisor/kvm/resource/LibvirtComputingResource.java>:[2455,34]
error: cannot find symbol
[ERROR] symbol:   class Rados
[ERROR] location: class LibvirtComputingResource
[ERROR] <http://jenkins.buildacloud.org/job/build-master-slowbuild/ws/plugins/hypervisors/kvm/src/com/cloud/hypervisor/kvm/resource/LibvirtComputingResource.java>:[2462,20]
error: cannot find symbol
[ERROR] symbol:   class IoCTX
[ERROR] location: class LibvirtComputingResource
[ERROR] <http://jenkins.buildacloud.org/job/build-master-slowbuild/ws/plugins/hypervisors/kvm/src/com/cloud/hypervisor/kvm/resource/LibvirtComputingResource.java>:[2463,20]
error: cannot find symbol
[ERROR] symbol:   class Rbd
[ERROR] location: class LibvirtComputingResource
[ERROR] <http://jenkins.buildacloud.org/job/build-master-slowbuild/ws/plugins/hypervisors/kvm/src/com/cloud/hypervisor/kvm/resource/LibvirtComputingResource.java>:[2463,34]
error: cannot find symbol
[ERROR] symbol:   class Rbd
[ERROR] location: class LibvirtComputingResource
[ERROR] <http://jenkins.buildacloud.org/job/build-master-slowbuild/ws/plugins/hypervisors/kvm/src/com/cloud/hypervisor/kvm/resource/LibvirtComputingResource.java>:[2464,20]
error: cannot find symbol
[ERROR] symbol:   class RbdImage
[ERROR] location: class LibvirtComputingResource
[ERROR] <http://jenkins.buildacloud.org/job/build-master-slowbuild/ws/plugins/hypervisors/kvm/src/com/cloud/hypervisor/kvm/resource/LibvirtComputingResource.java>:[2484,25]
error: cannot find symbol
[ERROR] symbol:   class RadosException
[ERROR] location: class LibvirtComputingResource
[ERROR] <http://jenkins.buildacloud.org/job/build-master-slowbuild/ws/plugins/hypervisors/kvm/src/com/cloud/hypervisor/kvm/resource/LibvirtComputingResource.java>:[2487,25]
error: cannot find symbol
[ERROR] symbol:   class RbdException
[ERROR] location: class LibvirtComputingResource
[ERROR] <http://jenkins.buildacloud.org/job/build-master-slowbuild/ws/plugins/hypervisors/kvm/src/com/cloud/hypervisor/kvm/storage/LibvirtStorageAdaptor.java>:[640,16]
error: cannot find symbol
[ERROR] symbol:   class Rados
[ERROR] location: class LibvirtStorageAdaptor
[ERROR] <http://jenkins.buildacloud.org/job/build-master-slowbuild/ws/plugins/hypervisors/kvm/src/com/cloud/hypervisor/kvm/storage/LibvirtStorageAdaptor.java>:[640,30]
error: cannot find symbol
[ERROR] symbol:   class Rados
[ERROR] location: class LibvirtStorageAdaptor
[ERROR] <http://jenkins.buildacloud.org/job/build-master-slowbuild/ws/plugins/hypervisors/kvm/src/com/cloud/hypervisor/kvm/storage/LibvirtStorageAdaptor.java>:[647,16]
error: cannot find symbol
[ERROR] symbol:   class IoCTX
[ERROR] location: class LibvirtStorageAdaptor
[ERROR] <http://jenkins.buildacloud.org/job/build-master-slowbuild/ws/plugins/hypervisors/kvm/src/com/cloud/hypervisor/kvm/storage/LibvirtStorageAdaptor.java>:[648,16]
error: cannot find symbol
[ERROR] symbol:   class Rbd
[ERROR] location: class LibvirtStorageAdaptor
[ERROR] <http://jenkins.buildacloud.org/job/build-master-slowbuild/ws/plugins/hypervisors/kvm/src/com/cloud/hypervisor/kvm/storage/LibvirtStorageAdaptor.java>:[648,30]
error: cannot find symbol
[ERROR] symbol:   class Rbd
[ERROR] location: class LibvirtStorageAdaptor
[ERROR] <http://jenkins.buildacloud.org/job/build-master-slowbuild/ws/plugins/hypervisors/kvm/src/com/cloud/hypervisor/kvm/storage/LibvirtStorageAdaptor.java>:[652,21]
error: cannot find symbol
[ERROR] symbol:   class RadosException
[ERROR] location: class LibvirtStorageAdaptor
[ERROR] <http://jenkins.buildacloud.org/job/build-master-slowbuild/ws/plugins/hypervisors/kvm/src/com/cloud/hypervisor/kvm/storage/LibvirtStorageAdaptor.java>:[654,21]
error: cannot find symbol
[ERROR] symbol:   class RbdException
[ERROR] location: class LibvirtStorageAdaptor
[ERROR] <http://jenkins.buildacloud.org/job/build-master-slowbuild/ws/plugins/hypervisors/kvm/src/com/cloud/hypervisor/kvm/storage/LibvirtStorageAdaptor.java>:[752,16]
error: cannot find symbol
[ERROR] symbol:   class Rados
[ERROR] location: class LibvirtStorageAdaptor
[ERROR] <http://jenkins.buildacloud.org/job/build-master-slowbuild/ws/plugins/hypervisors/kvm/src/com/cloud/hypervisor/kvm/storage/LibvirtStorageAdaptor.java>:[752,30]
error: cannot find symbol
[ERROR] symbol:   class Rados
[ERROR] location: class LibvirtStorageAdaptor
[ERROR] <http://jenkins.buildacloud.org/job/build-master-slowbuild/ws/plugins/hypervisors/kvm/src/com/cloud/hypervisor/kvm/storage/LibvirtStorageAdaptor.java>:[759,16]
error: cannot find symbol
[ERROR] symbol:   class IoCTX
[ERROR] location: class LibvirtStorageAdaptor
[ERROR] <http://jenkins.buildacloud.org/job/build-master-slowbuild/ws/plugins/hypervisors/kvm/src/com/cloud/hypervisor/kvm/storage/LibvirtStorageAdaptor.java>:[760,16]
error: cannot find symbol
[ERROR] symbol:   class Rbd
[ERROR] location: class LibvirtStorageAdaptor
[ERROR] <http://jenkins.buildacloud.org/job/build-master-slowbuild/ws/plugins/hypervisors/kvm/src/com/cloud/hypervisor/kvm/storage/LibvirtStorageAdaptor.java>:[760,30]
error: cannot find symbol
[ERROR] symbol:   class Rbd
[ERROR] location: class LibvirtStorageAdaptor
[ERROR] <http://jenkins.buildacloud.org/job/build-master-slowbuild/ws/plugins/hypervisors/kvm/src/com/cloud/hypervisor/kvm/storage/LibvirtStorageAdaptor.java>:[761,16]
error: cannot find symbol
[ERROR] symbol:   class RbdImage
[ERROR] location: class LibvirtStorageAdaptor
[ERROR] <http://jenkins.buildacloud.org/job/build-master-slowbuild/ws/plugins/hypervisors/kvm/src/com/cloud/hypervisor/kvm/storage/LibvirtStorageAdaptor.java>:[763,21]
error: cannot find symbol
[ERROR] symbol:   class RbdSnapInfo
[ERROR] location: class LibvirtStorageAdaptor
[ERROR] <http://jenkins.buildacloud.org/job/build-master-slowbuild/ws/plugins/hypervisors/kvm/src/com/cloud/hypervisor/kvm/storage/LibvirtStorageAdaptor.java>:[764,21]
error: cannot find symbol
[ERROR] symbol:   class RbdSnapInfo
[ERROR] location: class LibvirtStorageAdaptor
[ERROR] <http://jenkins.buildacloud.org/job/build-master-slowbuild/ws/plugins/hypervisors/kvm/src/com/cloud/hypervisor/kvm/storage/LibvirtStorageAdaptor.java>:[780,21]
error: cannot find symbol
[ERROR] symbol:   class RadosException
[ERROR] location: class LibvirtStorageAdaptor
[ERROR] <http://jenkins.buildacloud.org/job/build-master-slowbuild/ws/plugins/hypervisors/kvm/src/com/cloud/hypervisor/kvm/storage/LibvirtStorageAdaptor.java>:[782,21]
error: cannot find symbol
[ERROR] symbol:   class RbdException
[ERROR] location: class LibvirtStorageAdaptor
[ERROR] <http://jenkins.buildacloud.org/job/build-master-slowbuild/ws/plugins/hypervisors/kvm/src/com/cloud/hypervisor/kvm/storage/LibvirtStorageAdaptor.java>:[895,28]
error: cannot find symbol
[ERROR] symbol:   class Rados
[ERROR] location: class LibvirtStorageAdaptor
[ERROR] <http://jenkins.buildacloud.org/job/build-master-slowbuild/ws/plugins/hypervisors/kvm/src/com/cloud/hypervisor/kvm/storage/LibvirtStorageAdaptor.java>:[895,42]
error: cannot find symbol
[ERROR] symbol:   class Rados
[ERROR] location: class LibvirtStorageAdaptor
[ERROR] <http://jenkins.buildacloud.org/job/build-master-slowbuild/ws/plugins/hypervisors/kvm/src/com/cloud/hypervisor/kvm/storage/LibvirtStorageAdaptor.java>:[902,28]
error: cannot find symbol
[ERROR] symbol:   class IoCTX
[ERROR] location: class LibvirtStorageAdaptor
[ERROR] <http://jenkins.buildacloud.org/job/build-master-slowbuild/ws/plugins/hypervisors/kvm/src/com/cloud/hypervisor/kvm/storage/LibvirtStorageAdaptor.java>:[903,28]
error: cannot find symbol
[ERROR] symbol:   class Rbd
[ERROR] location: class LibvirtStorageAdaptor
[ERROR] <http://jenkins.buildacloud.org/job/build-master-slowbuild/ws/plugins/hypervisors/kvm/src/com/cloud/hypervisor/kvm/storage/LibvirtStorageAdaptor.java>:[903,42]
error: cannot find symbol
[ERROR] symbol:   class Rbd
[ERROR] location: class LibvirtStorageAdaptor
[ERROR] <http://jenkins.buildacloud.org/job/build-master-slowbuild/ws/plugins/hypervisors/kvm/src/com/cloud/hypervisor/kvm/storage/LibvirtStorageAdaptor.java>:[904,28]
error: cannot find symbol
[ERROR] symbol:   class RbdImage
[ERROR] location: class LibvirtStorageAdaptor
[ERROR] <http://jenkins.buildacloud.org/job/build-master-slowbuild/ws/plugins/hypervisors/kvm/src/com/cloud/hypervisor/kvm/storage/LibvirtStorageAdaptor.java>:[912,32]
error: cannot find symbol
[ERROR] symbol:   class RbdImage
[ERROR] location: class LibvirtStorageAdaptor
[ERROR] <http://jenkins.buildacloud.org/job/build-master-slowbuild/ws/plugins/hypervisors/kvm/src/com/cloud/hypervisor/kvm/storage/LibvirtStorageAdaptor.java>:[933,28]
error: cannot find symbol
[ERROR] symbol:   class Rados
[ERROR] location: class LibvirtStorageAdaptor
[ERROR] <http://jenkins.buildacloud.org/job/build-master-slowbuild/ws/plugins/hypervisors/kvm/src/com/cloud/hypervisor/kvm/storage/LibvirtStorageAdaptor.java>:[933,45]
error: cannot find symbol
[ERROR] symbol:   class Rados
[ERROR] location: class LibvirtStorageAdaptor
[ERROR] <http://jenkins.buildacloud.org/job/build-master-slowbuild/ws/plugins/hypervisors/kvm/src/com/cloud/hypervisor/kvm/storage/LibvirtStorageAdaptor.java>:[940,28]
error: cannot find symbol
[ERROR] symbol:   class Rados
[ERROR] location: class LibvirtStorageAdaptor
[ERROR] <http://jenkins.buildacloud.org/job/build-master-slowbuild/ws/plugins/hypervisors/kvm/src/com/cloud/hypervisor/kvm/storage/LibvirtStorageAdaptor.java>:[940,46]
error: cannot find symbol
[ERROR] symbol:   class Rados
[ERROR] location: class LibvirtStorageAdaptor
[ERROR] <http://jenkins.buildacloud.org/job/build-master-slowbuild/ws/plugins/hypervisors/kvm/src/com/cloud/hypervisor/kvm/storage/LibvirtStorageAdaptor.java>:[947,28]
error: cannot find symbol
[ERROR] symbol:   class IoCTX
[ERROR] location: class LibvirtStorageAdaptor
[ERROR] <http://jenkins.buildacloud.org/job/build-master-slowbuild/ws/plugins/hypervisors/kvm/src/com/cloud/hypervisor/kvm/storage/LibvirtStorageAdaptor.java>:[948,28]
error: cannot find symbol
[ERROR] symbol:   class Rbd
[ERROR] location: class LibvirtStorageAdaptor
[ERROR] <http://jenkins.buildacloud.org/job/build-master-slowbuild/ws/plugins/hypervisors/kvm/src/com/cloud/hypervisor/kvm/storage/LibvirtStorageAdaptor.java>:[948,43]
error: cannot find symbol
[ERROR] symbol:   class Rbd
[ERROR] location: class LibvirtStorageAdaptor
[ERROR] <http://jenkins.buildacloud.org/job/build-master-slowbuild/ws/plugins/hypervisors/kvm/src/com/cloud/hypervisor/kvm/storage/LibvirtStorageAdaptor.java>:[950,28]
error: cannot find symbol
[ERROR] symbol:   class IoCTX
[ERROR] location: class LibvirtStorageAdaptor
[ERROR] <http://jenkins.buildacloud.org/job/build-master-slowbuild/ws/plugins/hypervisors/kvm/src/com/cloud/hypervisor/kvm/storage/LibvirtStorageAdaptor.java>:[951,28]
error: cannot find symbol
[ERROR] symbol:   class Rbd
[ERROR] location: class LibvirtStorageAdaptor
[ERROR] <http://jenkins.buildacloud.org/job/build-master-slowbuild/ws/plugins/hypervisors/kvm/src/com/cloud/hypervisor/kvm/storage/LibvirtStorageAdaptor.java>:[951,43]
error: cannot find symbol
[ERROR] symbol:   class Rbd
[ERROR] location: class LibvirtStorageAdaptor
[ERROR] <http://jenkins.buildacloud.org/job/build-master-slowbuild/ws/plugins/hypervisors/kvm/src/com/cloud/hypervisor/kvm/storage/LibvirtStorageAdaptor.java>:[957,28]
error: cannot find symbol
[ERROR] symbol:   class RbdImage
[ERROR] location: class LibvirtStorageAdaptor
[ERROR] <http://jenkins.buildacloud.org/job/build-master-slowbuild/ws/plugins/hypervisors/kvm/src/com/cloud/hypervisor/kvm/storage/LibvirtStorageAdaptor.java>:[958,28]
error: cannot find symbol
[ERROR] symbol:   class RbdImage
[ERROR] location: class LibvirtStorageAdaptor
[ERROR] <http://jenkins.buildacloud.org/job/build-master-slowbuild/ws/plugins/hypervisors/kvm/src/com/cloud/hypervisor/kvm/storage/LibvirtStorageAdaptor.java>:[970,29]
error: cannot find symbol
[ERROR] symbol:   class RadosException
[ERROR] location: class LibvirtStorageAdaptor
[ERROR] <http://jenkins.buildacloud.org/job/build-master-slowbuild/ws/plugins/hypervisors/kvm/src/com/cloud/hypervisor/kvm/storage/LibvirtStorageAdaptor.java>:[973,29]
error: cannot find symbol
[ERROR] symbol:   class RbdException
[ERROR] location: class LibvirtStorageAdaptor
[ERROR] <http://jenkins.buildacloud.org/job/build-master-slowbuild/ws/plugins/hypervisors/kvm/src/com/cloud/hypervisor/kvm/storage/LibvirtStorageAdaptor.java>:[1120,16]
error: cannot find symbol
[ERROR] symbol:   class Rados
[ERROR] location: class LibvirtStorageAdaptor
[ERROR] <http://jenkins.buildacloud.org/job/build-master-slowbuild/ws/plugins/hypervisors/kvm/src/com/cloud/hypervisor/kvm/storage/LibvirtStorageAdaptor.java>:[1120,30]
error: cannot find symbol
[ERROR] symbol:   class Rados
[ERROR] location: class LibvirtStorageAdaptor
[ERROR] <http://jenkins.buildacloud.org/job/build-master-slowbuild/ws/plugins/hypervisors/kvm/src/com/cloud/hypervisor/kvm/storage/LibvirtStorageAdaptor.java>:[1127,16]
error: cannot find symbol
[ERROR] symbol:   class IoCTX
[ERROR] location: class LibvirtStorageAdaptor
[ERROR] <http://jenkins.buildacloud.org/job/build-master-slowbuild/ws/plugins/hypervisors/kvm/src/com/cloud/hypervisor/kvm/storage/LibvirtStorageAdaptor.java>:[1128,16]
error: cannot find symbol
[ERROR] symbol:   class Rbd
[ERROR] location: class LibvirtStorageAdaptor
[ERROR] <http://jenkins.buildacloud.org/job/build-master-slowbuild/ws/plugins/hypervisors/kvm/src/com/cloud/hypervisor/kvm/storage/LibvirtStorageAdaptor.java>:[1128,30]
error: cannot find symbol
[ERROR] symbol:   class Rbd
[ERROR] location: class LibvirtStorageAdaptor
[ERROR] <http://jenkins.buildacloud.org/job/build-master-slowbuild/ws/plugins/hypervisors/kvm/src/com/cloud/hypervisor/kvm/storage/LibvirtStorageAdaptor.java>:[1130,16]
error: cannot find symbol
[ERROR] symbol:   class RbdImage
[ERROR] location: class LibvirtStorageAdaptor
[ERROR] <http://jenkins.buildacloud.org/job/build-master-slowbuild/ws/plugins/hypervisors/kvm/src/com/cloud/hypervisor/kvm/storage/LibvirtStorageAdaptor.java>:[1143,21]
error: cannot find symbol
[ERROR] symbol:   class RadosException
[ERROR] location: class LibvirtStorageAdaptor
[ERROR] <http://jenkins.buildacloud.org/job/build-master-slowbuild/ws/plugins/hypervisors/kvm/src/com/cloud/hypervisor/kvm/storage/LibvirtStorageAdaptor.java>:[1146,21]
error: cannot find symbol
[ERROR] symbol:   class RbdException
[ERROR] location: class LibvirtStorageAdaptor
[ERROR] <http://jenkins.buildacloud.org/job/build-master-slowbuild/ws/plugins/hypervisors/kvm/src/com/cloud/hypervisor/kvm/storage/KVMStorageProcessor.java>:[704,20]
error: cannot find symbol
[ERROR] symbol:   class Rados
[ERROR] location: class KVMStorageProcessor
[ERROR] <http://jenkins.buildacloud.org/job/build-master-slowbuild/ws/plugins/hypervisors/kvm/src/com/cloud/hypervisor/kvm/storage/KVMStorageProcessor.java>:[704,34]
error: cannot find symbol
[ERROR] symbol:   class Rados
[ERROR] location: class KVMStorageProcessor
[ERROR] <http://jenkins.buildacloud.org/job/build-master-slowbuild/ws/plugins/hypervisors/kvm/src/com/cloud/hypervisor/kvm/storage/KVMStorageProcessor.java>:[711,20]
error: cannot find symbol
[ERROR] symbol:   class IoCTX
[ERROR] location: class KVMStorageProcessor
[ERROR] <http://jenkins.buildacloud.org/job/build-master-slowbuild/ws/plugins/hypervisors/kvm/src/com/cloud/hypervisor/kvm/storage/KVMStorageProcessor.java>:[712,20]
error: cannot find symbol
[ERROR] symbol:   class Rbd
[ERROR] location: class KVMStorageProcessor
[ERROR] <http://jenkins.buildacloud.org/job/build-master-slowbuild/ws/plugins/hypervisors/kvm/src/com/cloud/hypervisor/kvm/storage/KVMStorageProcessor.java>:[712,34]
error: cannot find symbol
[ERROR] symbol:   class Rbd
[ERROR] location: class KVMStorageProcessor
[ERROR] <http://jenkins.buildacloud.org/job/build-master-slowbuild/ws/plugins/hypervisors/kvm/src/com/cloud/hypervisor/kvm/storage/KVMStorageProcessor.java>:[713,20]
error: cannot find symbol
[ERROR] symbol:   class RbdImage
[ERROR] location: class KVMStorageProcessor
[ERROR] <http://jenkins.buildacloud.org/job/build-master-slowbuild/ws/plugins/hypervisors/kvm/src/com/cloud/hypervisor/kvm/storage/KVMStorageProcessor.java>:[742,25]
error: cannot find symbol
[ERROR] symbol:   class RadosException
[ERROR] location: class KVMStorageProcessor
[ERROR] <http://jenkins.buildacloud.org/job/build-master-slowbuild/ws/plugins/hypervisors/kvm/src/com/cloud/hypervisor/kvm/storage/KVMStorageProcessor.java>:[745,25]
error: cannot find symbol
[ERROR] symbol:   class RbdException
[ERROR] location: class KVMStorageProcessor
[ERROR] <http://jenkins.buildacloud.org/job/build-master-slowbuild/ws/plugins/hypervisors/kvm/src/com/cloud/hypervisor/kvm/storage/KVMStorageProcessor.java>:[1156,24]
error: cannot find symbol
[ERROR] symbol:   class Rados
[ERROR] location: class KVMStorageProcessor
[ERROR] <http://jenkins.buildacloud.org/job/build-master-slowbuild/ws/plugins/hypervisors/kvm/src/com/cloud/hypervisor/kvm/storage/KVMStorageProcessor.java>:[1156,38]
error: cannot find symbol
[ERROR] symbol:   class Rados
[ERROR] location: class KVMStorageProcessor
[ERROR] <http://jenkins.buildacloud.org/job/build-master-slowbuild/ws/plugins/hypervisors/kvm/src/com/cloud/hypervisor/kvm/storage/KVMStorageProcessor.java>:[1163,24]
error: cannot find symbol
[ERROR] symbol:   class IoCTX
[ERROR] location: class KVMStorageProcessor
[ERROR] <http://jenkins.buildacloud.org/job/build-master-slowbuild/ws/plugins/hypervisors/kvm/src/com/cloud/hypervisor/kvm/storage/KVMStorageProcessor.java>:[1164,24]
error: cannot find symbol
[ERROR] symbol:   class Rbd
[ERROR] location: class KVMStorageProcessor
[ERROR] <http://jenkins.buildacloud.org/job/build-master-slowbuild/ws/plugins/hypervisors/kvm/src/com/cloud/hypervisor/kvm/storage/KVMStorageProcessor.java>:[1164,38]
error: cannot find symbol
[ERROR] symbol:   class Rbd
[ERROR] location: class KVMStorageProcessor
[ERROR] <http://jenkins.buildacloud.org/job/build-master-slowbuild/ws/plugins/hypervisors/kvm/src/com/cloud/hypervisor/kvm/storage/KVMStorageProcessor.java>:[1165,24]
error: cannot find symbol
[ERROR] -> [Help 1]
[ERROR] 
[ERROR] To see the full stack trace of the errors, re-run Maven with the -e switch.
[ERROR] Re-run Maven using the -X switch to enable full debug logging.
[ERROR] 
[ERROR] For more information about the errors and possible solutions, please read the following
articles:
[ERROR] [Help 1] http://cwiki.apache.org/confluence/display/MAVEN/MojoFailureException
[ERROR] 
[ERROR] After correcting the problems, you can resume the build with the command
[ERROR]   mvn <goals> -rf :cloud-plugin-hypervisor-kvm
Build step 'Invoke top-level Maven targets' marked build as failure
[FINDBUGS] Skipping publisher since build result is FAILURE
Skipping Cobertura coverage report as build was not SUCCESS or better ...

Mime
View raw message