cloudstack-dev mailing list archives

Site index · List index
Message view « Date » · « Thread »
Top « Date » · « Thread »
From Hugo Trippaers <h...@trippaers.nl>
Subject Re: Build failed in Jenkins: build-master #609
Date Thu, 10 Apr 2014 20:22:23 GMT
Hey guys,

There is/was a problem the radios jar file. Rados version 0.1.4 is the culprit. The issue
has now been resolved, but it was fixed by apparently replacing the jar file in the upstream
maven repo. This is pretty unfortunate for us as a release version of a maven artifact is
permanently cached by all mvn tooling. So for local developers it will work to clean the repository.


For our build infrastructure it means that we have to go and manually clean all slaves and
maven proxies, so it might be some time before the builds are stable again. I’m trying to
figure out who is responsible for pushing releases for radios-java and see if i can convince
them to release a new version with a higher version number and push the jar to maven central
while they are at it.

Cheers,

Hugo



On 10 apr. 2014, at 10:10, Wido den Hollander <wido@widodh.nl> wrote:

> It works fine on my local systems as well.
> 
> I changed a maven dependency to fix a RBD bug.
> 
> Wido
> 
>> Op 10 apr. 2014 om 21:34 heeft "Marcus Sorensen" <marcus@betterservers.com>
het volgende geschreven:
>> 
>> Ok, now I can't get it to fail locally in Linux or Mac, even with
>> deleting my ~/.m2. Not sure what's going on.
>> 
>>> On 4/10/14, 9:48 AM, Marcus Sorensen wrote:
>>> Hmm, sorry. I thought master was fixed, as we saw complaints about the
>>> rados stuff yesterday (and I saw it on my linux vm as well), but the
>>> build worked fine on my mac today.  It must have only worked due to
>>> cached .m2 on my mac. I'm going to try to figure out what we need to
>>> revert to get master going again.
>>> 
>>>> On 4/10/14, 9:38 AM, jenkins@cloudstack.org wrote:
>>>> See <http://jenkins.buildacloud.org/job/build-master/609/changes>
>>>> 
>>>> Changes:
>>>> 
>>>> [marcus] CLOUDSTACK-6191 Add support for specifying volume provisioning
>>>> 
>>>> ------------------------------------------
>>>> [...truncated 3066 lines...]
>>>> [ERROR] <http://jenkins.buildacloud.org/job/build-master/ws/plugins/hypervisors/kvm/src/com/cloud/hypervisor/kvm/resource/LibvirtComputingResource.java>:[20,21]
error: package com.ceph.rados does not exist
>>>> [ERROR] <http://jenkins.buildacloud.org/job/build-master/ws/plugins/hypervisors/kvm/src/com/cloud/hypervisor/kvm/resource/LibvirtComputingResource.java>:[21,21]
error: package com.ceph.rados does not exist
>>>> [ERROR] <http://jenkins.buildacloud.org/job/build-master/ws/plugins/hypervisors/kvm/src/com/cloud/hypervisor/kvm/resource/LibvirtComputingResource.java>:[22,19]
error: package com.ceph.rbd does not exist
>>>> [ERROR] <http://jenkins.buildacloud.org/job/build-master/ws/plugins/hypervisors/kvm/src/com/cloud/hypervisor/kvm/resource/LibvirtComputingResource.java>:[23,19]
error: package com.ceph.rbd does not exist
>>>> [ERROR] <http://jenkins.buildacloud.org/job/build-master/ws/plugins/hypervisors/kvm/src/com/cloud/hypervisor/kvm/resource/LibvirtComputingResource.java>:[24,19]
error: package com.ceph.rbd does not exist
>>>> [ERROR] <http://jenkins.buildacloud.org/job/build-master/ws/plugins/hypervisors/kvm/src/com/cloud/hypervisor/kvm/storage/KVMStorageProcessor.java>:[50,21]
error: package com.ceph.rados does not exist
>>>> [ERROR] <http://jenkins.buildacloud.org/job/build-master/ws/plugins/hypervisors/kvm/src/com/cloud/hypervisor/kvm/storage/KVMStorageProcessor.java>:[51,21]
error: package com.ceph.rados does not exist
>>>> [ERROR] <http://jenkins.buildacloud.org/job/build-master/ws/plugins/hypervisors/kvm/src/com/cloud/hypervisor/kvm/storage/KVMStorageProcessor.java>:[52,21]
error: package com.ceph.rados does not exist
>>>> [ERROR] <http://jenkins.buildacloud.org/job/build-master/ws/plugins/hypervisors/kvm/src/com/cloud/hypervisor/kvm/storage/KVMStorageProcessor.java>:[53,19]
error: package com.ceph.rbd does not exist
>>>> [ERROR] <http://jenkins.buildacloud.org/job/build-master/ws/plugins/hypervisors/kvm/src/com/cloud/hypervisor/kvm/storage/KVMStorageProcessor.java>:[54,19]
error: package com.ceph.rbd does not exist
>>>> [ERROR] <http://jenkins.buildacloud.org/job/build-master/ws/plugins/hypervisors/kvm/src/com/cloud/hypervisor/kvm/storage/KVMStorageProcessor.java>:[55,19]
error: package com.ceph.rbd does not exist
>>>> [ERROR] <http://jenkins.buildacloud.org/job/build-master/ws/plugins/hypervisors/kvm/src/com/cloud/hypervisor/kvm/storage/LibvirtStorageAdaptor.java>:[36,21]
error: package com.ceph.rados does not exist
>>>> [ERROR] <http://jenkins.buildacloud.org/job/build-master/ws/plugins/hypervisors/kvm/src/com/cloud/hypervisor/kvm/storage/LibvirtStorageAdaptor.java>:[37,21]
error: package com.ceph.rados does not exist
>>>> [ERROR] <http://jenkins.buildacloud.org/job/build-master/ws/plugins/hypervisors/kvm/src/com/cloud/hypervisor/kvm/storage/LibvirtStorageAdaptor.java>:[38,21]
error: package com.ceph.rados does not exist
>>>> [ERROR] <http://jenkins.buildacloud.org/job/build-master/ws/plugins/hypervisors/kvm/src/com/cloud/hypervisor/kvm/storage/LibvirtStorageAdaptor.java>:[39,19]
error: package com.ceph.rbd does not exist
>>>> [ERROR] <http://jenkins.buildacloud.org/job/build-master/ws/plugins/hypervisors/kvm/src/com/cloud/hypervisor/kvm/storage/LibvirtStorageAdaptor.java>:[40,19]
error: package com.ceph.rbd does not exist
>>>> [ERROR] <http://jenkins.buildacloud.org/job/build-master/ws/plugins/hypervisors/kvm/src/com/cloud/hypervisor/kvm/storage/LibvirtStorageAdaptor.java>:[41,19]
error: package com.ceph.rbd does not exist
>>>> [ERROR] <http://jenkins.buildacloud.org/job/build-master/ws/plugins/hypervisors/kvm/src/com/cloud/hypervisor/kvm/storage/LibvirtStorageAdaptor.java>:[42,23]
error: package com.ceph.rbd.jna does not exist
>>>> [ERROR] <http://jenkins.buildacloud.org/job/build-master/ws/plugins/hypervisors/kvm/src/com/cloud/hypervisor/kvm/resource/LibvirtComputingResource.java>:[2373,24]
error: cannot find symbol
>>>> [ERROR] symbol:   class Rados
>>>> [ERROR] location: class LibvirtComputingResource
>>>> [ERROR] <http://jenkins.buildacloud.org/job/build-master/ws/plugins/hypervisors/kvm/src/com/cloud/hypervisor/kvm/resource/LibvirtComputingResource.java>:[2373,38]
error: cannot find symbol
>>>> [ERROR] symbol:   class Rados
>>>> [ERROR] location: class LibvirtComputingResource
>>>> [ERROR] <http://jenkins.buildacloud.org/job/build-master/ws/plugins/hypervisors/kvm/src/com/cloud/hypervisor/kvm/resource/LibvirtComputingResource.java>:[2380,24]
error: cannot find symbol
>>>> [ERROR] symbol:   class IoCTX
>>>> [ERROR] location: class LibvirtComputingResource
>>>> [ERROR] <http://jenkins.buildacloud.org/job/build-master/ws/plugins/hypervisors/kvm/src/com/cloud/hypervisor/kvm/resource/LibvirtComputingResource.java>:[2381,24]
error: cannot find symbol
>>>> [ERROR] symbol:   class Rbd
>>>> [ERROR] location: class LibvirtComputingResource
>>>> [ERROR] <http://jenkins.buildacloud.org/job/build-master/ws/plugins/hypervisors/kvm/src/com/cloud/hypervisor/kvm/resource/LibvirtComputingResource.java>:[2381,38]
error: cannot find symbol
>>>> [ERROR] symbol:   class Rbd
>>>> [ERROR] location: class LibvirtComputingResource
>>>> [ERROR] <http://jenkins.buildacloud.org/job/build-master/ws/plugins/hypervisors/kvm/src/com/cloud/hypervisor/kvm/resource/LibvirtComputingResource.java>:[2382,24]
error: cannot find symbol
>>>> [ERROR] symbol:   class RbdImage
>>>> [ERROR] location: class LibvirtComputingResource
>>>> [ERROR] <http://jenkins.buildacloud.org/job/build-master/ws/plugins/hypervisors/kvm/src/com/cloud/hypervisor/kvm/resource/LibvirtComputingResource.java>:[2456,20]
error: cannot find symbol
>>>> [ERROR] symbol:   class Rados
>>>> [ERROR] location: class LibvirtComputingResource
>>>> [ERROR] <http://jenkins.buildacloud.org/job/build-master/ws/plugins/hypervisors/kvm/src/com/cloud/hypervisor/kvm/resource/LibvirtComputingResource.java>:[2456,34]
error: cannot find symbol
>>>> [ERROR] symbol:   class Rados
>>>> [ERROR] location: class LibvirtComputingResource
>>>> [ERROR] <http://jenkins.buildacloud.org/job/build-master/ws/plugins/hypervisors/kvm/src/com/cloud/hypervisor/kvm/resource/LibvirtComputingResource.java>:[2463,20]
error: cannot find symbol
>>>> [ERROR] symbol:   class IoCTX
>>>> [ERROR] location: class LibvirtComputingResource
>>>> [ERROR] <http://jenkins.buildacloud.org/job/build-master/ws/plugins/hypervisors/kvm/src/com/cloud/hypervisor/kvm/resource/LibvirtComputingResource.java>:[2464,20]
error: cannot find symbol
>>>> [ERROR] symbol:   class Rbd
>>>> [ERROR] location: class LibvirtComputingResource
>>>> [ERROR] <http://jenkins.buildacloud.org/job/build-master/ws/plugins/hypervisors/kvm/src/com/cloud/hypervisor/kvm/resource/LibvirtComputingResource.java>:[2464,34]
error: cannot find symbol
>>>> [ERROR] symbol:   class Rbd
>>>> [ERROR] location: class LibvirtComputingResource
>>>> [ERROR] <http://jenkins.buildacloud.org/job/build-master/ws/plugins/hypervisors/kvm/src/com/cloud/hypervisor/kvm/resource/LibvirtComputingResource.java>:[2465,20]
error: cannot find symbol
>>>> [ERROR] symbol:   class RbdImage
>>>> [ERROR] location: class LibvirtComputingResource
>>>> [ERROR] <http://jenkins.buildacloud.org/job/build-master/ws/plugins/hypervisors/kvm/src/com/cloud/hypervisor/kvm/resource/LibvirtComputingResource.java>:[2485,25]
error: cannot find symbol
>>>> [ERROR] symbol:   class RadosException
>>>> [ERROR] location: class LibvirtComputingResource
>>>> [ERROR] <http://jenkins.buildacloud.org/job/build-master/ws/plugins/hypervisors/kvm/src/com/cloud/hypervisor/kvm/resource/LibvirtComputingResource.java>:[2488,25]
error: cannot find symbol
>>>> [ERROR] symbol:   class RbdException
>>>> [ERROR] location: class LibvirtComputingResource
>>>> [ERROR] <http://jenkins.buildacloud.org/job/build-master/ws/plugins/hypervisors/kvm/src/com/cloud/hypervisor/kvm/storage/KVMStorageProcessor.java>:[705,20]
error: cannot find symbol
>>>> [ERROR] symbol:   class Rados
>>>> [ERROR] location: class KVMStorageProcessor
>>>> [ERROR] <http://jenkins.buildacloud.org/job/build-master/ws/plugins/hypervisors/kvm/src/com/cloud/hypervisor/kvm/storage/KVMStorageProcessor.java>:[705,34]
error: cannot find symbol
>>>> [ERROR] symbol:   class Rados
>>>> [ERROR] location: class KVMStorageProcessor
>>>> [ERROR] <http://jenkins.buildacloud.org/job/build-master/ws/plugins/hypervisors/kvm/src/com/cloud/hypervisor/kvm/storage/KVMStorageProcessor.java>:[712,20]
error: cannot find symbol
>>>> [ERROR] symbol:   class IoCTX
>>>> [ERROR] location: class KVMStorageProcessor
>>>> [ERROR] <http://jenkins.buildacloud.org/job/build-master/ws/plugins/hypervisors/kvm/src/com/cloud/hypervisor/kvm/storage/KVMStorageProcessor.java>:[713,20]
error: cannot find symbol
>>>> [ERROR] symbol:   class Rbd
>>>> [ERROR] location: class KVMStorageProcessor
>>>> [ERROR] <http://jenkins.buildacloud.org/job/build-master/ws/plugins/hypervisors/kvm/src/com/cloud/hypervisor/kvm/storage/KVMStorageProcessor.java>:[713,34]
error: cannot find symbol
>>>> [ERROR] symbol:   class Rbd
>>>> [ERROR] location: class KVMStorageProcessor
>>>> [ERROR] <http://jenkins.buildacloud.org/job/build-master/ws/plugins/hypervisors/kvm/src/com/cloud/hypervisor/kvm/storage/KVMStorageProcessor.java>:[714,20]
error: cannot find symbol
>>>> [ERROR] symbol:   class RbdImage
>>>> [ERROR] location: class KVMStorageProcessor
>>>> [ERROR] <http://jenkins.buildacloud.org/job/build-master/ws/plugins/hypervisors/kvm/src/com/cloud/hypervisor/kvm/storage/KVMStorageProcessor.java>:[743,25]
error: cannot find symbol
>>>> [ERROR] symbol:   class RadosException
>>>> [ERROR] location: class KVMStorageProcessor
>>>> [ERROR] <http://jenkins.buildacloud.org/job/build-master/ws/plugins/hypervisors/kvm/src/com/cloud/hypervisor/kvm/storage/KVMStorageProcessor.java>:[746,25]
error: cannot find symbol
>>>> [ERROR] symbol:   class RbdException
>>>> [ERROR] location: class KVMStorageProcessor
>>>> [ERROR] <http://jenkins.buildacloud.org/job/build-master/ws/plugins/hypervisors/kvm/src/com/cloud/hypervisor/kvm/storage/KVMStorageProcessor.java>:[1157,24]
error: cannot find symbol
>>>> [ERROR] symbol:   class Rados
>>>> [ERROR] location: class KVMStorageProcessor
>>>> [ERROR] <http://jenkins.buildacloud.org/job/build-master/ws/plugins/hypervisors/kvm/src/com/cloud/hypervisor/kvm/storage/KVMStorageProcessor.java>:[1157,38]
error: cannot find symbol
>>>> [ERROR] symbol:   class Rados
>>>> [ERROR] location: class KVMStorageProcessor
>>>> [ERROR] <http://jenkins.buildacloud.org/job/build-master/ws/plugins/hypervisors/kvm/src/com/cloud/hypervisor/kvm/storage/KVMStorageProcessor.java>:[1164,24]
error: cannot find symbol
>>>> [ERROR] symbol:   class IoCTX
>>>> [ERROR] location: class KVMStorageProcessor
>>>> [ERROR] <http://jenkins.buildacloud.org/job/build-master/ws/plugins/hypervisors/kvm/src/com/cloud/hypervisor/kvm/storage/KVMStorageProcessor.java>:[1165,24]
error: cannot find symbol
>>>> [ERROR] symbol:   class Rbd
>>>> [ERROR] location: class KVMStorageProcessor
>>>> [ERROR] <http://jenkins.buildacloud.org/job/build-master/ws/plugins/hypervisors/kvm/src/com/cloud/hypervisor/kvm/storage/KVMStorageProcessor.java>:[1165,38]
error: cannot find symbol
>>>> [ERROR] symbol:   class Rbd
>>>> [ERROR] location: class KVMStorageProcessor
>>>> [ERROR] <http://jenkins.buildacloud.org/job/build-master/ws/plugins/hypervisors/kvm/src/com/cloud/hypervisor/kvm/storage/KVMStorageProcessor.java>:[1166,24]
error: cannot find symbol
>>>> [ERROR] symbol:   class RbdImage
>>>> [ERROR] location: class KVMStorageProcessor
>>>> [ERROR] <http://jenkins.buildacloud.org/job/build-master/ws/plugins/hypervisors/kvm/src/com/cloud/hypervisor/kvm/storage/LibvirtStorageAdaptor.java>:[729,12]
error: cannot find symbol
>>>> [ERROR] symbol:   class Rados
>>>> [ERROR] location: class LibvirtStorageAdaptor
>>>> [ERROR] <http://jenkins.buildacloud.org/job/build-master/ws/plugins/hypervisors/kvm/src/com/cloud/hypervisor/kvm/storage/LibvirtStorageAdaptor.java>:[729,26]
error: cannot find symbol
>>>> [ERROR] symbol:   class Rados
>>>> [ERROR] location: class LibvirtStorageAdaptor
>>>> [ERROR] <http://jenkins.buildacloud.org/job/build-master/ws/plugins/hypervisors/kvm/src/com/cloud/hypervisor/kvm/storage/LibvirtStorageAdaptor.java>:[736,12]
error: cannot find symbol
>>>> [ERROR] symbol:   class IoCTX
>>>> [ERROR] location: class LibvirtStorageAdaptor
>>>> [ERROR] <http://jenkins.buildacloud.org/job/build-master/ws/plugins/hypervisors/kvm/src/com/cloud/hypervisor/kvm/storage/LibvirtStorageAdaptor.java>:[737,12]
error: cannot find symbol
>>>> [ERROR] symbol:   class Rbd
>>>> [ERROR] location: class LibvirtStorageAdaptor
>>>> [ERROR] <http://jenkins.buildacloud.org/job/build-master/ws/plugins/hypervisors/kvm/src/com/cloud/hypervisor/kvm/storage/LibvirtStorageAdaptor.java>:[737,26]
error: cannot find symbol
>>>> [ERROR] symbol:   class Rbd
>>>> [ERROR] location: class LibvirtStorageAdaptor
>>>> [ERROR] <http://jenkins.buildacloud.org/job/build-master/ws/plugins/hypervisors/kvm/src/com/cloud/hypervisor/kvm/storage/LibvirtStorageAdaptor.java>:[741,17]
error: cannot find symbol
>>>> [ERROR] symbol:   class RadosException
>>>> [ERROR] location: class LibvirtStorageAdaptor
>>>> [ERROR] <http://jenkins.buildacloud.org/job/build-master/ws/plugins/hypervisors/kvm/src/com/cloud/hypervisor/kvm/storage/LibvirtStorageAdaptor.java>:[743,17]
error: cannot find symbol
>>>> [ERROR] symbol:   class RbdException
>>>> [ERROR] location: class LibvirtStorageAdaptor
>>>> [ERROR] <http://jenkins.buildacloud.org/job/build-master/ws/plugins/hypervisors/kvm/src/com/cloud/hypervisor/kvm/storage/LibvirtStorageAdaptor.java>:[813,16]
error: cannot find symbol
>>>> [ERROR] symbol:   class Rados
>>>> [ERROR] location: class LibvirtStorageAdaptor
>>>> [ERROR] <http://jenkins.buildacloud.org/job/build-master/ws/plugins/hypervisors/kvm/src/com/cloud/hypervisor/kvm/storage/LibvirtStorageAdaptor.java>:[813,30]
error: cannot find symbol
>>>> [ERROR] symbol:   class Rados
>>>> [ERROR] location: class LibvirtStorageAdaptor
>>>> [ERROR] <http://jenkins.buildacloud.org/job/build-master/ws/plugins/hypervisors/kvm/src/com/cloud/hypervisor/kvm/storage/LibvirtStorageAdaptor.java>:[820,16]
error: cannot find symbol
>>>> [ERROR] symbol:   class IoCTX
>>>> [ERROR] location: class LibvirtStorageAdaptor
>>>> [ERROR] <http://jenkins.buildacloud.org/job/build-master/ws/plugins/hypervisors/kvm/src/com/cloud/hypervisor/kvm/storage/LibvirtStorageAdaptor.java>:[821,16]
error: cannot find symbol
>>>> [ERROR] symbol:   class Rbd
>>>> [ERROR] location: class LibvirtStorageAdaptor
>>>> [ERROR] <http://jenkins.buildacloud.org/job/build-master/ws/plugins/hypervisors/kvm/src/com/cloud/hypervisor/kvm/storage/LibvirtStorageAdaptor.java>:[821,30]
error: cannot find symbol
>>>> [ERROR] symbol:   class Rbd
>>>> [ERROR] location: class LibvirtStorageAdaptor
>>>> [ERROR] <http://jenkins.buildacloud.org/job/build-master/ws/plugins/hypervisors/kvm/src/com/cloud/hypervisor/kvm/storage/LibvirtStorageAdaptor.java>:[822,16]
error: cannot find symbol
>>>> [ERROR] symbol:   class RbdImage
>>>> [ERROR] location: class LibvirtStorageAdaptor
>>>> [ERROR] <http://jenkins.buildacloud.org/job/build-master/ws/plugins/hypervisors/kvm/src/com/cloud/hypervisor/kvm/storage/LibvirtStorageAdaptor.java>:[824,21]
error: cannot find symbol
>>>> [ERROR] symbol:   class RbdSnapInfo
>>>> [ERROR] location: class LibvirtStorageAdaptor
>>>> [ERROR] <http://jenkins.buildacloud.org/job/build-master/ws/plugins/hypervisors/kvm/src/com/cloud/hypervisor/kvm/storage/LibvirtStorageAdaptor.java>:[825,21]
error: cannot find symbol
>>>> [ERROR] symbol:   class RbdSnapInfo
>>>> [ERROR] location: class LibvirtStorageAdaptor
>>>> [ERROR] <http://jenkins.buildacloud.org/job/build-master/ws/plugins/hypervisors/kvm/src/com/cloud/hypervisor/kvm/storage/LibvirtStorageAdaptor.java>:[841,21]
error: cannot find symbol
>>>> [ERROR] symbol:   class RadosException
>>>> [ERROR] location: class LibvirtStorageAdaptor
>>>> [ERROR] <http://jenkins.buildacloud.org/job/build-master/ws/plugins/hypervisors/kvm/src/com/cloud/hypervisor/kvm/storage/LibvirtStorageAdaptor.java>:[843,21]
error: cannot find symbol
>>>> [ERROR] symbol:   class RbdException
>>>> [ERROR] location: class LibvirtStorageAdaptor
>>>> [ERROR] <http://jenkins.buildacloud.org/job/build-master/ws/plugins/hypervisors/kvm/src/com/cloud/hypervisor/kvm/storage/LibvirtStorageAdaptor.java>:[994,20]
error: cannot find symbol
>>>> [ERROR] symbol:   class Rados
>>>> [ERROR] location: class LibvirtStorageAdaptor
>>>> [ERROR] <http://jenkins.buildacloud.org/job/build-master/ws/plugins/hypervisors/kvm/src/com/cloud/hypervisor/kvm/storage/LibvirtStorageAdaptor.java>:[994,34]
error: cannot find symbol
>>>> [ERROR] symbol:   class Rados
>>>> [ERROR] location: class LibvirtStorageAdaptor
>>>> [ERROR] <http://jenkins.buildacloud.org/job/build-master/ws/plugins/hypervisors/kvm/src/com/cloud/hypervisor/kvm/storage/LibvirtStorageAdaptor.java>:[1001,20]
error: cannot find symbol
>>>> [ERROR] symbol:   class IoCTX
>>>> [ERROR] location: class LibvirtStorageAdaptor
>>>> [ERROR] <http://jenkins.buildacloud.org/job/build-master/ws/plugins/hypervisors/kvm/src/com/cloud/hypervisor/kvm/storage/LibvirtStorageAdaptor.java>:[1002,20]
error: cannot find symbol
>>>> [ERROR] symbol:   class Rbd
>>>> [ERROR] location: class LibvirtStorageAdaptor
>>>> [ERROR] <http://jenkins.buildacloud.org/job/build-master/ws/plugins/hypervisors/kvm/src/com/cloud/hypervisor/kvm/storage/LibvirtStorageAdaptor.java>:[1002,34]
error: cannot find symbol
>>>> [ERROR] symbol:   class Rbd
>>>> [ERROR] location: class LibvirtStorageAdaptor
>>>> [ERROR] <http://jenkins.buildacloud.org/job/build-master/ws/plugins/hypervisors/kvm/src/com/cloud/hypervisor/kvm/storage/LibvirtStorageAdaptor.java>:[1003,20]
error: cannot find symbol
>>>> [ERROR] symbol:   class RbdImage
>>>> [ERROR] location: class LibvirtStorageAdaptor
>>>> [ERROR] <http://jenkins.buildacloud.org/job/build-master/ws/plugins/hypervisors/kvm/src/com/cloud/hypervisor/kvm/storage/LibvirtStorageAdaptor.java>:[1011,24]
error: cannot find symbol
>>>> [ERROR] symbol:   class RbdImage
>>>> [ERROR] location: class LibvirtStorageAdaptor
>>>> [ERROR] <http://jenkins.buildacloud.org/job/build-master/ws/plugins/hypervisors/kvm/src/com/cloud/hypervisor/kvm/storage/LibvirtStorageAdaptor.java>:[1033,20]
error: cannot find symbol
>>>> [ERROR] symbol:   class Rados
>>>> [ERROR] location: class LibvirtStorageAdaptor
>>>> [ERROR] <http://jenkins.buildacloud.org/job/build-master/ws/plugins/hypervisors/kvm/src/com/cloud/hypervisor/kvm/storage/LibvirtStorageAdaptor.java>:[1033,37]
error: cannot find symbol
>>>> [ERROR] symbol:   class Rados
>>>> [ERROR] location: class LibvirtStorageAdaptor
>>>> [ERROR] <http://jenkins.buildacloud.org/job/build-master/ws/plugins/hypervisors/kvm/src/com/cloud/hypervisor/kvm/storage/LibvirtStorageAdaptor.java>:[1040,20]
error: cannot find symbol
>>>> [ERROR] symbol:   class Rados
>>>> [ERROR] location: class LibvirtStorageAdaptor
>>>> [ERROR] <http://jenkins.buildacloud.org/job/build-master/ws/plugins/hypervisors/kvm/src/com/cloud/hypervisor/kvm/storage/LibvirtStorageAdaptor.java>:[1040,38]
error: cannot find symbol
>>>> [ERROR] symbol:   class Rados
>>>> [ERROR] location: class LibvirtStorageAdaptor
>>>> [ERROR] <http://jenkins.buildacloud.org/job/build-master/ws/plugins/hypervisors/kvm/src/com/cloud/hypervisor/kvm/storage/LibvirtStorageAdaptor.java>:[1047,20]
error: cannot find symbol
>>>> [ERROR] symbol:   class IoCTX
>>>> [ERROR] location: class LibvirtStorageAdaptor
>>>> [ERROR] <http://jenkins.buildacloud.org/job/build-master/ws/plugins/hypervisors/kvm/src/com/cloud/hypervisor/kvm/storage/LibvirtStorageAdaptor.java>:[1048,20]
error: cannot find symbol
>>>> [ERROR] symbol:   class Rbd
>>>> [ERROR] location: class LibvirtStorageAdaptor
>>>> [ERROR] <http://jenkins.buildacloud.org/job/build-master/ws/plugins/hypervisors/kvm/src/com/cloud/hypervisor/kvm/storage/LibvirtStorageAdaptor.java>:[1048,35]
error: cannot find symbol
>>>> [ERROR] symbol:   class Rbd
>>>> [ERROR] location: class LibvirtStorageAdaptor
>>>> [ERROR] <http://jenkins.buildacloud.org/job/build-master/ws/plugins/hypervisors/kvm/src/com/cloud/hypervisor/kvm/storage/LibvirtStorageAdaptor.java>:[1050,20]
error: cannot find symbol
>>>> [ERROR] symbol:   class IoCTX
>>>> [ERROR] location: class LibvirtStorageAdaptor
>>>> [ERROR] <http://jenkins.buildacloud.org/job/build-master/ws/plugins/hypervisors/kvm/src/com/cloud/hypervisor/kvm/storage/LibvirtStorageAdaptor.java>:[1051,20]
error: cannot find symbol
>>>> [ERROR] symbol:   class Rbd
>>>> [ERROR] location: class LibvirtStorageAdaptor
>>>> [ERROR] <http://jenkins.buildacloud.org/job/build-master/ws/plugins/hypervisors/kvm/src/com/cloud/hypervisor/kvm/storage/LibvirtStorageAdaptor.java>:[1051,35]
error: cannot find symbol
>>>> [ERROR] symbol:   class Rbd
>>>> [ERROR] location: class LibvirtStorageAdaptor
>>>> [ERROR] <http://jenkins.buildacloud.org/job/build-master/ws/plugins/hypervisors/kvm/src/com/cloud/hypervisor/kvm/storage/LibvirtStorageAdaptor.java>:[1057,20]
error: cannot find symbol
>>>> [ERROR] symbol:   class RbdImage
>>>> [ERROR] location: class LibvirtStorageAdaptor
>>>> [ERROR] <http://jenkins.buildacloud.org/job/build-master/ws/plugins/hypervisors/kvm/src/com/cloud/hypervisor/kvm/storage/LibvirtStorageAdaptor.java>:[1058,20]
error: cannot find symbol
>>>> [ERROR] symbol:   class RbdImage
>>>> [ERROR] location: class LibvirtStorageAdaptor
>>>> [ERROR] <http://jenkins.buildacloud.org/job/build-master/ws/plugins/hypervisors/kvm/src/com/cloud/hypervisor/kvm/storage/LibvirtStorageAdaptor.java>:[1070,21]
error: cannot find symbol
>>>> [ERROR] symbol:   class RadosException
>>>> [ERROR] location: class LibvirtStorageAdaptor
>>>> [ERROR] <http://jenkins.buildacloud.org/job/build-master/ws/plugins/hypervisors/kvm/src/com/cloud/hypervisor/kvm/storage/LibvirtStorageAdaptor.java>:[1073,21]
error: cannot find symbol
>>>> [ERROR] symbol:   class RbdException
>>>> [ERROR] location: class LibvirtStorageAdaptor
>>>> [ERROR] <http://jenkins.buildacloud.org/job/build-master/ws/plugins/hypervisors/kvm/src/com/cloud/hypervisor/kvm/storage/LibvirtStorageAdaptor.java>:[1211,16]
error: cannot find symbol
>>>> [ERROR] symbol:   class Rados
>>>> [ERROR] location: class LibvirtStorageAdaptor
>>>> [ERROR] <http://jenkins.buildacloud.org/job/build-master/ws/plugins/hypervisors/kvm/src/com/cloud/hypervisor/kvm/storage/LibvirtStorageAdaptor.java>:[1211,30]
error: cannot find symbol
>>>> [ERROR] symbol:   class Rados
>>>> [ERROR] location: class LibvirtStorageAdaptor
>>>> [ERROR] <http://jenkins.buildacloud.org/job/build-master/ws/plugins/hypervisors/kvm/src/com/cloud/hypervisor/kvm/storage/LibvirtStorageAdaptor.java>:[1218,16]
error: cannot find symbol
>>>> [ERROR] symbol:   class IoCTX
>>>> [ERROR] location: class LibvirtStorageAdaptor
>>>> [ERROR] <http://jenkins.buildacloud.org/job/build-master/ws/plugins/hypervisors/kvm/src/com/cloud/hypervisor/kvm/storage/LibvirtStorageAdaptor.java>:[1219,16]
error: cannot find symbol
>>>> [ERROR] symbol:   class Rbd
>>>> [ERROR] location: class LibvirtStorageAdaptor
>>>> [ERROR] <http://jenkins.buildacloud.org/job/build-master/ws/plugins/hypervisors/kvm/src/com/cloud/hypervisor/kvm/storage/LibvirtStorageAdaptor.java>:[1219,30]
error: cannot find symbol
>>>> [ERROR] symbol:   class Rbd
>>>> [ERROR] location: class LibvirtStorageAdaptor
>>>> [ERROR] <http://jenkins.buildacloud.org/job/build-master/ws/plugins/hypervisors/kvm/src/com/cloud/hypervisor/kvm/storage/LibvirtStorageAdaptor.java>:[1221,16]
error: cannot find symbol
>>>> [ERROR] symbol:   class RbdImage
>>>> [ERROR] location: class LibvirtStorageAdaptor
>>>> [ERROR] <http://jenkins.buildacloud.org/job/build-master/ws/plugins/hypervisors/kvm/src/com/cloud/hypervisor/kvm/storage/LibvirtStorageAdaptor.java>:[1234,21]
error: cannot find symbol
>>>> [ERROR] symbol:   class RadosException
>>>> [ERROR] location: class LibvirtStorageAdaptor
>>>> [ERROR] <http://jenkins.buildacloud.org/job/build-master/ws/plugins/hypervisors/kvm/src/com/cloud/hypervisor/kvm/storage/LibvirtStorageAdaptor.java>:[1237,21]
error: cannot find symbol
>>>> [ERROR] -> [Help 1]
>>>> [ERROR] 
>>>> [ERROR] To see the full stack trace of the errors, re-run Maven with the
-e switch.
>>>> [ERROR] Re-run Maven using the -X switch to enable full debug logging.
>>>> [ERROR] 
>>>> [ERROR] For more information about the errors and possible solutions, please
read the following articles:
>>>> [ERROR] [Help 1] http://cwiki.apache.org/confluence/display/MAVEN/MojoFailureException
>>>> [ERROR] 
>>>> [ERROR] After correcting the problems, you can resume the build with the
command
>>>> [ERROR]   mvn <goals> -rf :cloud-plugin-hypervisor-kvm
>>>> Build step 'Invoke top-level Maven targets' marked build as failure
>> 
>> 


Mime
View raw message