cloudstack-dev mailing list archives

Site index · List index
Message view « Date » · « Thread »
Top « Date » · « Thread »
From jenk...@cloudstack.org
Subject Build failed in Jenkins: build-master #675
Date Thu, 24 Apr 2014 11:30:38 GMT
See <http://jenkins.buildacloud.org/job/build-master/675/changes>

Changes:

[aprateek] improved ldap logging. added stacktrace in debug level incase of exceptions.

------------------------------------------
[...truncated 3490 lines...]
Tests run: 2, Failures: 0, Errors: 0, Skipped: 0, Time elapsed: 1.044 sec
Running org.apache.cloudstack.network.element.SspClientTest
Tests run: 3, Failures: 0, Errors: 0, Skipped: 0, Time elapsed: 0.161 sec

Results :

Tests run: 5, Failures: 0, Errors: 0, Skipped: 0

[INFO]                                                                         
[INFO] ------------------------------------------------------------------------
[INFO] Building Apache CloudStack Plugin - Network Opendaylight 4.5.0-SNAPSHOT
[INFO] ------------------------------------------------------------------------
[INFO] 
[INFO] --- maven-clean-plugin:2.5:clean (default-clean) @ cloud-plugin-network-opendaylight
---
[INFO] Deleting <http://jenkins.buildacloud.org/job/build-master/ws/plugins/network-elements/opendaylight/target>
(includes = [**/*], excludes = [])
[INFO] Deleting <http://jenkins.buildacloud.org/job/build-master/ws/plugins/network-elements/opendaylight>
(includes = [target, dist], excludes = [])
[INFO] 
[INFO] --- maven-checkstyle-plugin:2.11:check (cloudstack-checkstyle) @ cloud-plugin-network-opendaylight
---
[INFO] Starting audit...
Audit done.

[INFO] 
[INFO] --- maven-remote-resources-plugin:1.3:process (default) @ cloud-plugin-network-opendaylight
---
[INFO] 
[INFO] --- maven-resources-plugin:2.5:resources (default-resources) @ cloud-plugin-network-opendaylight
---
[debug] execute contextualize
[INFO] Using 'UTF-8' encoding to copy filtered resources.
[INFO] Copying 2 resources
[INFO] Copying 3 resources
[INFO] 
[INFO] --- maven-compiler-plugin:2.5.1:compile (default-compile) @ cloud-plugin-network-opendaylight
---
[INFO] Compiling 41 source files to <http://jenkins.buildacloud.org/job/build-master/ws/plugins/network-elements/opendaylight/target/classes>
[INFO] 
[INFO] --- license-maven-plugin:2.5:check (cloudstack-checklicence) @ cloud-plugin-network-opendaylight
---
[INFO] Checking licenses...
[INFO] 
[INFO] --- maven-resources-plugin:2.5:testResources (default-testResources) @ cloud-plugin-network-opendaylight
---
[debug] execute contextualize
[INFO] Using 'UTF-8' encoding to copy filtered resources.
[INFO] skip non existing resourceDirectory <http://jenkins.buildacloud.org/job/build-master/ws/plugins/network-elements/opendaylight/src/test/resources>
[INFO] Copying 3 resources
[INFO] 
[INFO] --- maven-compiler-plugin:2.5.1:testCompile (default-testCompile) @ cloud-plugin-network-opendaylight
---
[INFO] Compiling 6 source files to <http://jenkins.buildacloud.org/job/build-master/ws/plugins/network-elements/opendaylight/target/test-classes>
[INFO] 
[INFO] --- maven-surefire-plugin:2.12:test (default-test) @ cloud-plugin-network-opendaylight
---
[INFO] Surefire report directory: <http://jenkins.buildacloud.org/job/build-master/ws/plugins/network-elements/opendaylight/target/surefire-reports>

-------------------------------------------------------
 T E S T S
-------------------------------------------------------
Running org.apache.cloudstack.network.opendaylight.api.test.NeutronRestApiTest
log4j:WARN No appenders could be found for logger (org.apache.commons.httpclient.params.DefaultHttpParams).
log4j:WARN Please initialize the log4j system properly.
log4j:WARN See http://logging.apache.org/log4j/1.2/faq.html#noconfig for more info.
Tests run: 12, Failures: 0, Errors: 0, Skipped: 0, Time elapsed: 0.499 sec
Running org.apache.cloudstack.network.opendaylight.api.test.NeutronNetworkAdapterTest
Tests run: 2, Failures: 0, Errors: 0, Skipped: 0, Time elapsed: 0.016 sec
Running org.apache.cloudstack.network.opendaylight.api.test.NeutronPortAdapterTest
Tests run: 2, Failures: 0, Errors: 0, Skipped: 0, Time elapsed: 0.007 sec
Running org.apache.cloudstack.network.opendaylight.api.test.NeutronNodeAdapterTest
Tests run: 3, Failures: 0, Errors: 0, Skipped: 0, Time elapsed: 0.006 sec
Running org.apache.cloudstack.network.opendaylight.api.test.NeutronEnumsTest
Tests run: 5, Failures: 0, Errors: 0, Skipped: 0, Time elapsed: 0.005 sec

Results :

Tests run: 24, Failures: 0, Errors: 0, Skipped: 0

[INFO]                                                                         
[INFO] ------------------------------------------------------------------------
[INFO] Building Apache CloudStack Plugin - Storage Allocator Random 4.5.0-SNAPSHOT
[INFO] ------------------------------------------------------------------------
[INFO] 
[INFO] --- maven-clean-plugin:2.5:clean (default-clean) @ cloud-plugin-storage-allocator-random
---
[INFO] Deleting <http://jenkins.buildacloud.org/job/build-master/ws/plugins/storage-allocators/random/target>
(includes = [**/*], excludes = [])
[INFO] Deleting <http://jenkins.buildacloud.org/job/build-master/ws/plugins/storage-allocators/random>
(includes = [target, dist], excludes = [])
[INFO] 
[INFO] --- maven-checkstyle-plugin:2.11:check (cloudstack-checkstyle) @ cloud-plugin-storage-allocator-random
---
[INFO] Starting audit...
Audit done.

[INFO] 
[INFO] --- maven-remote-resources-plugin:1.3:process (default) @ cloud-plugin-storage-allocator-random
---
[INFO] 
[INFO] --- maven-resources-plugin:2.5:resources (default-resources) @ cloud-plugin-storage-allocator-random
---
[debug] execute contextualize
[INFO] Using 'UTF-8' encoding to copy filtered resources.
[INFO] skip non existing resourceDirectory <http://jenkins.buildacloud.org/job/build-master/ws/plugins/storage-allocators/random/resources>
[INFO] Copying 3 resources
[INFO] 
[INFO] --- maven-compiler-plugin:2.5.1:compile (default-compile) @ cloud-plugin-storage-allocator-random
---
[INFO] Compiling 1 source file to <http://jenkins.buildacloud.org/job/build-master/ws/plugins/storage-allocators/random/target/classes>
[INFO] 
[INFO] --- maven-resources-plugin:2.5:testResources (default-testResources) @ cloud-plugin-storage-allocator-random
---
[debug] execute contextualize
[INFO] Using 'UTF-8' encoding to copy filtered resources.
[INFO] skip non existing resourceDirectory <http://jenkins.buildacloud.org/job/build-master/ws/plugins/storage-allocators/random/test/resources>
[INFO] Copying 3 resources
[INFO] 
[INFO] --- maven-compiler-plugin:2.5.1:testCompile (default-testCompile) @ cloud-plugin-storage-allocator-random
---
[INFO] No sources to compile
[INFO] 
[INFO] --- maven-surefire-plugin:2.12:test (default-test) @ cloud-plugin-storage-allocator-random
---
[INFO] Surefire report directory: <http://jenkins.buildacloud.org/job/build-master/ws/plugins/storage-allocators/random/target/surefire-reports>

-------------------------------------------------------
 T E S T S
-------------------------------------------------------

Results :

Tests run: 0, Failures: 0, Errors: 0, Skipped: 0

[INFO]                                                                         
[INFO] ------------------------------------------------------------------------
[INFO] Building Apache CloudStack Plugin - User Authenticator LDAP 4.5.0-SNAPSHOT
[INFO] ------------------------------------------------------------------------
[INFO] 
[INFO] --- maven-clean-plugin:2.5:clean (default-clean) @ cloud-plugin-user-authenticator-ldap
---
[INFO] Deleting <http://jenkins.buildacloud.org/job/build-master/ws/plugins/user-authenticators/ldap/target>
(includes = [**/*], excludes = [])
[INFO] Deleting <http://jenkins.buildacloud.org/job/build-master/ws/plugins/user-authenticators/ldap>
(includes = [target, dist], excludes = [])
[INFO] 
[INFO] --- maven-checkstyle-plugin:2.11:check (cloudstack-checkstyle) @ cloud-plugin-user-authenticator-ldap
---
[INFO] Starting audit...
<http://jenkins.buildacloud.org/job/build-master/ws/plugins/user-authenticators/ldap/src/org/apache/cloudstack/ldap/LdapContextFactory.java>:56:1:
Line contains a tab character.
<http://jenkins.buildacloud.org/job/build-master/ws/plugins/user-authenticators/ldap/src/org/apache/cloudstack/ldap/LdapContextFactory.java>:57:1:
Line contains a tab character.
<http://jenkins.buildacloud.org/job/build-master/ws/plugins/user-authenticators/ldap/src/org/apache/cloudstack/ldap/LdapContextFactory.java>:58:1:
Line contains a tab character.
<http://jenkins.buildacloud.org/job/build-master/ws/plugins/user-authenticators/ldap/src/org/apache/cloudstack/ldap/LdapContextFactory.java>:61:1:
Line contains a tab character.
Audit done.

[INFO] ------------------------------------------------------------------------
[INFO] Reactor Summary:
[INFO] 
[INFO] Apache CloudStack Developer Tools - Checkstyle Configuration  SUCCESS [0.777s]
[INFO] Apache CloudStack ................................. SUCCESS [0.664s]
[INFO] Apache CloudStack Maven Conventions Parent ........ SUCCESS [1.245s]
[INFO] Apache CloudStack Framework - Managed Context ..... SUCCESS [2.669s]
[INFO] Apache CloudStack Utils ........................... SUCCESS [9.862s]
[INFO] Apache CloudStack Framework ....................... SUCCESS [0.058s]
[INFO] Apache CloudStack Framework - Event Notification .. SUCCESS [5.812s]
[INFO] Apache CloudStack Framework - Configuration ....... SUCCESS [3.515s]
[INFO] Apache CloudStack API ............................. SUCCESS [11.572s]
[INFO] Apache CloudStack Framework - REST ................ SUCCESS [2.371s]
[INFO] Apache CloudStack Framework - IPC ................. SUCCESS [4.969s]
[INFO] Apache CloudStack Cloud Engine .................... SUCCESS [0.032s]
[INFO] Apache CloudStack Cloud Engine API ................ SUCCESS [3.964s]
[INFO] Apache CloudStack Framework - Security ............ SUCCESS [1.948s]
[INFO] Apache CloudStack Core ............................ SUCCESS [8.199s]
[INFO] Apache CloudStack Agents .......................... SUCCESS [4.702s]
[INFO] Apache CloudStack Framework - Clustering .......... SUCCESS [2.539s]
[INFO] Apache CloudStack Framework - Jobs ................ SUCCESS [2.985s]
[INFO] Apache CloudStack Cloud Engine Schema Component ... SUCCESS [11.223s]
[INFO] Apache CloudStack Framework - Event Notification .. SUCCESS [1.536s]
[INFO] Apache CloudStack Cloud Engine Internal Components API  SUCCESS [2.607s]
[INFO] Apache CloudStack Server .......................... SUCCESS [31.521s]
[INFO] Apache CloudStack Usage Server .................... SUCCESS [5.242s]
[INFO] Apache CloudStack Cloud Engine Orchestration Component  SUCCESS [8.279s]
[INFO] Apache CloudStack Cloud Services .................. SUCCESS [0.037s]
[INFO] Apache CloudStack Secondary Storage ............... SUCCESS [0.358s]
[INFO] Apache CloudStack Secondary Storage Service ....... SUCCESS [4.085s]
[INFO] Apache CloudStack Engine Storage Component ........ SUCCESS [5.695s]
[INFO] Apache CloudStack Engine Storage Volume Component . SUCCESS [3.551s]
[INFO] Apache CloudStack Engine Storage Image Component .. SUCCESS [2.409s]
[INFO] Apache CloudStack Engine Storage Data Motion Component  SUCCESS [2.118s]
[INFO] Apache CloudStack Engine Storage Cache Component .. SUCCESS [2.062s]
[INFO] Apache CloudStack Engine Storage Snapshot Component  SUCCESS [5.805s]
[INFO] Apache CloudStack Cloud Engine API ................ SUCCESS [1.596s]
[INFO] Apache CloudStack Cloud Engine Service ............ SUCCESS [0.769s]
[INFO] Apache CloudStack Plugin POM ...................... SUCCESS [0.251s]
[INFO] Apache CloudStack Plugin - API Rate Limit ......... SUCCESS [5.743s]
[INFO] Apache CloudStack Plugin - API Discovery .......... SUCCESS [3.728s]
[INFO] Apache CloudStack Plugin - ACL Static Role Based .. SUCCESS [1.850s]
[INFO] Apache CloudStack Plugin - Host Anti-Affinity Processor  SUCCESS [1.940s]
[INFO] Apache CloudStack Plugin - Explicit Dedication Processor  SUCCESS [2.132s]
[INFO] Apache CloudStack Plugin - User Concentrated Pod Deployment Planner  SUCCESS [1.885s]
[INFO] Apache CloudStack Plugin - User Dispersing Deployment Planner  SUCCESS [1.947s]
[INFO] Apache CloudStack Plugin - Implicit Dedication Planner  SUCCESS [5.917s]
[INFO] Apache CloudStack Plugin - Skip Heurestics Planner  SUCCESS [1.838s]
[INFO] Apache CloudStack Plugin - Host Allocator Random .. SUCCESS [1.937s]
[INFO] Apache CloudStack Plugin - Dedicated Resources .... SUCCESS [5.826s]
[INFO] Apache CloudStack Plugin - Hypervisor OracleVM .... SUCCESS [2.974s]
[INFO] Apache CloudStack Plugin - Open vSwitch ........... SUCCESS [2.789s]
[INFO] Apache CloudStack Plugin - Hypervisor Xen ......... SUCCESS [8.141s]
[INFO] Apache CloudStack Plugin - Hypervisor KVM ......... SUCCESS [7.287s]
[INFO] Apache CloudStack Plugin - RabbitMQ Event Bus ..... SUCCESS [1.944s]
[INFO] Apache CloudStack Plugin - In Memory Event Bus .... SUCCESS [3.699s]
[INFO] Apache CloudStack Plugin - Hypervisor Baremetal ... SUCCESS [3.310s]
[INFO] Apache CloudStack Plugin - Hypervisor UCS ......... SUCCESS [2.359s]
[INFO] Apache CloudStack Plugin - Hypervisor Hyper-V ..... SUCCESS [4.719s]
[INFO] Apache CloudStack Plugin - Network Elastic Load Balancer  SUCCESS [4.621s]
[INFO] Apache CloudStack Plugin - Network Internal Load Balancer  SUCCESS [7.198s]
[INFO] Apache CloudStack Framework - Spring Life Cycle ... SUCCESS [1.805s]
[INFO] Apache CloudStack Plugin - Network Juniper Contrail  SUCCESS [8.560s]
[INFO] Apache CloudStack Plugin - Palo Alto .............. SUCCESS [6.070s]
[INFO] Apache CloudStack Plugin - Network Netscaler ...... SUCCESS [3.317s]
[INFO] Apache CloudStack Plugin - Network Nicira NVP ..... SUCCESS [6.832s]
[INFO] Apache CloudStack Plugin - BigSwitch Virtual Network Segment  SUCCESS [4.951s]
[INFO] Apache CloudStack Plugin - Midokura Midonet ....... SUCCESS [5.232s]
[INFO] Apache CloudStack Plugin - Stratosphere SSP ....... SUCCESS [5.103s]
[INFO] Apache CloudStack Plugin - Network Opendaylight ... SUCCESS [4.513s]
[INFO] Apache CloudStack Plugin - Storage Allocator Random  SUCCESS [1.876s]
[INFO] Apache CloudStack Plugin - User Authenticator LDAP  FAILURE [0.241s]
[INFO] Apache CloudStack Plugin - User Authenticator MD5 . SKIPPED
[INFO] Apache CloudStack Plugin - User Authenticator Plain Text  SKIPPED
[INFO] Apache CloudStack Plugin - User Authenticator SHA256 Salted  SKIPPED
[INFO] Apache CloudStack Plugin - Dns Notifier Example ... SKIPPED
[INFO] Apache CloudStack Plugin - Storage Image S3 ....... SKIPPED
[INFO] Apache CloudStack Plugin - Storage Image Swift provider  SKIPPED
[INFO] Apache CloudStack Plugin - Storage Image default provider  SKIPPED
[INFO] Apache CloudStack Plugin - Storage Image sample provider  SKIPPED
[INFO] Apache CloudStack Plugin - Storage Volume Nexenta Provider  SKIPPED
[INFO] Apache CloudStack Plugin - Storage Volume SolidFire Provider  SKIPPED
[INFO] Apache CloudStack Plugin - Storage Volume default provider  SKIPPED
[INFO] Apache CloudStack Plugin - Storage Volume CloudByte Provider  SKIPPED
[INFO] Apache CloudStack Plugin - Storage Volume sample provider  SKIPPED
[INFO] Apache CloudStack Plugin - SNMP Alerts ............ SKIPPED
[INFO] Apache CloudStack Plugin - Syslog Alerts .......... SKIPPED
[INFO] Apache CloudStack Plugin - Network VXLAN .......... SKIPPED
[INFO] Apache CloudStack Framework - Spring Module ....... SKIPPED
[INFO] Apache CloudStack IAM Service ..................... SKIPPED
[INFO] Apache CloudStack IAM - Server .................... SKIPPED
[INFO] Apache CloudStack IAM - Plugin .................... SKIPPED
[INFO] Apache CloudStack Secondary Storage Controller .... SKIPPED
[INFO] Apache CloudStack Console Proxy - RDP Client ...... SKIPPED
[INFO] Apache CloudStack Console Proxy ................... SKIPPED
[INFO] Apache CloudStack Console Proxy - Server .......... SKIPPED
[INFO] Apache CloudStack System VM ....................... SKIPPED
[INFO] Apache CloudStack Client UI ....................... SKIPPED
[INFO] Apache CloudStack Framework - QuickCloud .......... SKIPPED
[INFO] Apache CloudStack AWS API Bridge .................. SKIPPED
[INFO] ------------------------------------------------------------------------
[INFO] BUILD FAILURE
[INFO] ------------------------------------------------------------------------
[INFO] Total time: 4:51.401s
[INFO] Finished at: Thu Apr 24 13:30:33 CEST 2014
[INFO] Final Memory: 68M/398M
[INFO] ------------------------------------------------------------------------
[ERROR] Failed to execute goal org.apache.maven.plugins:maven-checkstyle-plugin:2.11:check
(cloudstack-checkstyle) on project cloud-plugin-user-authenticator-ldap: Failed during checkstyle
execution: There are 4 checkstyle errors. -> [Help 1]
[ERROR] 
[ERROR] To see the full stack trace of the errors, re-run Maven with the -e switch.
[ERROR] Re-run Maven using the -X switch to enable full debug logging.
[ERROR] 
[ERROR] For more information about the errors and possible solutions, please read the following
articles:
[ERROR] [Help 1] http://cwiki.apache.org/confluence/display/MAVEN/MojoExecutionException
[ERROR] 
[ERROR] After correcting the problems, you can resume the build with the command
[ERROR]   mvn <goals> -rf :cloud-plugin-user-authenticator-ldap
Build step 'Invoke top-level Maven targets' marked build as failure

Mime
View raw message