cloudstack-dev mailing list archives

Site index · List index
Message view « Date » · « Thread »
Top « Date » · « Thread »
From jenk...@cloudstack.org
Subject Build failed in Jenkins: cloudstack-4.3-maven-build #521
Date Mon, 14 Apr 2014 12:00:35 GMT
See <http://jenkins.buildacloud.org/job/cloudstack-4.3-maven-build/521/changes>

Changes:

[wido] CLOUDSTACK-4665: Depend on rados-java 0.1.4

[wido] CLOUDSTACK-4665: Check if a snapshot is protected before trying to unprotect

[wido] debian: Add JNA flag when starting agent

[wido] debian: cloudstack-management requires libmysql-java for SQL connection

------------------------------------------
[...truncated 2221 lines...]
	at java.security.AccessController.doPrivileged(Native Method)
	at java.net.URLClassLoader.findClass(URLClassLoader.java:205)
	at java.lang.ClassLoader.loadClass(ClassLoader.java:323)
	at sun.misc.Launcher$AppClassLoader.loadClass(Launcher.java:294)
	at java.lang.ClassLoader.loadClass(ClassLoader.java:268)
	at com.cloud.hypervisor.kvm.resource.LibvirtComputingResourceTest.testCreateVMFromSpecLegacy(LibvirtComputingResourceTest.java:82)

Running com.cloud.hypervisor.kvm.resource.LibvirtVifDriverTest
Tests run: 7, Failures: 0, Errors: 7, Skipped: 0, Time elapsed: 0.01 sec <<< FAILURE!
testDefaults(com.cloud.hypervisor.kvm.resource.LibvirtVifDriverTest)  Time elapsed: 0 sec
 <<< ERROR!
java.lang.UnsupportedClassVersionError: com/ceph/rados/RadosException : Unsupported major.minor
version 51.0
	at java.lang.ClassLoader.defineClass1(Native Method)
	at java.lang.ClassLoader.defineClass(ClassLoader.java:643)
	at java.security.SecureClassLoader.defineClass(SecureClassLoader.java:142)
	at java.net.URLClassLoader.defineClass(URLClassLoader.java:277)
	at java.net.URLClassLoader.access$000(URLClassLoader.java:73)
	at java.net.URLClassLoader$1.run(URLClassLoader.java:212)
	at java.security.AccessController.doPrivileged(Native Method)
	at java.net.URLClassLoader.findClass(URLClassLoader.java:205)
	at java.lang.ClassLoader.loadClass(ClassLoader.java:323)
	at sun.misc.Launcher$AppClassLoader.loadClass(Launcher.java:294)
	at java.lang.ClassLoader.loadClass(ClassLoader.java:268)
	at com.cloud.hypervisor.kvm.resource.LibvirtVifDriverTest.setUp(LibvirtVifDriverTest.java:51)

testDefaultsWhenExplicitlySet(com.cloud.hypervisor.kvm.resource.LibvirtVifDriverTest)  Time
elapsed: 0.001 sec  <<< ERROR!
java.lang.UnsupportedClassVersionError: com/ceph/rados/RadosException : Unsupported major.minor
version 51.0
	at java.lang.ClassLoader.defineClass1(Native Method)
	at java.lang.ClassLoader.defineClass(ClassLoader.java:643)
	at java.security.SecureClassLoader.defineClass(SecureClassLoader.java:142)
	at java.net.URLClassLoader.defineClass(URLClassLoader.java:277)
	at java.net.URLClassLoader.access$000(URLClassLoader.java:73)
	at java.net.URLClassLoader$1.run(URLClassLoader.java:212)
	at java.security.AccessController.doPrivileged(Native Method)
	at java.net.URLClassLoader.findClass(URLClassLoader.java:205)
	at java.lang.ClassLoader.loadClass(ClassLoader.java:323)
	at sun.misc.Launcher$AppClassLoader.loadClass(Launcher.java:294)
	at java.lang.ClassLoader.loadClass(ClassLoader.java:268)
	at com.cloud.hypervisor.kvm.resource.LibvirtVifDriverTest.setUp(LibvirtVifDriverTest.java:51)

testWhenExplicitlySetDifferentDefault(com.cloud.hypervisor.kvm.resource.LibvirtVifDriverTest)
 Time elapsed: 0 sec  <<< ERROR!
java.lang.UnsupportedClassVersionError: com/ceph/rados/RadosException : Unsupported major.minor
version 51.0
	at java.lang.ClassLoader.defineClass1(Native Method)
	at java.lang.ClassLoader.defineClass(ClassLoader.java:643)
	at java.security.SecureClassLoader.defineClass(SecureClassLoader.java:142)
	at java.net.URLClassLoader.defineClass(URLClassLoader.java:277)
	at java.net.URLClassLoader.access$000(URLClassLoader.java:73)
	at java.net.URLClassLoader$1.run(URLClassLoader.java:212)
	at java.security.AccessController.doPrivileged(Native Method)
	at java.net.URLClassLoader.findClass(URLClassLoader.java:205)
	at java.lang.ClassLoader.loadClass(ClassLoader.java:323)
	at sun.misc.Launcher$AppClassLoader.loadClass(Launcher.java:294)
	at java.lang.ClassLoader.loadClass(ClassLoader.java:268)
	at com.cloud.hypervisor.kvm.resource.LibvirtVifDriverTest.setUp(LibvirtVifDriverTest.java:51)

testOverrideSomeTrafficTypes(com.cloud.hypervisor.kvm.resource.LibvirtVifDriverTest)  Time
elapsed: 0.002 sec  <<< ERROR!
java.lang.UnsupportedClassVersionError: com/ceph/rados/RadosException : Unsupported major.minor
version 51.0
	at java.lang.ClassLoader.defineClass1(Native Method)
	at java.lang.ClassLoader.defineClass(ClassLoader.java:643)
	at java.security.SecureClassLoader.defineClass(SecureClassLoader.java:142)
	at java.net.URLClassLoader.defineClass(URLClassLoader.java:277)
	at java.net.URLClassLoader.access$000(URLClassLoader.java:73)
	at java.net.URLClassLoader$1.run(URLClassLoader.java:212)
	at java.security.AccessController.doPrivileged(Native Method)
	at java.net.URLClassLoader.findClass(URLClassLoader.java:205)
	at java.lang.ClassLoader.loadClass(ClassLoader.java:323)
	at sun.misc.Launcher$AppClassLoader.loadClass(Launcher.java:294)
	at java.lang.ClassLoader.loadClass(ClassLoader.java:268)
	at com.cloud.hypervisor.kvm.resource.LibvirtVifDriverTest.setUp(LibvirtVifDriverTest.java:51)

testBadTrafficType(com.cloud.hypervisor.kvm.resource.LibvirtVifDriverTest)  Time elapsed:
0.002 sec  <<< ERROR!
java.lang.UnsupportedClassVersionError: com/ceph/rados/RadosException : Unsupported major.minor
version 51.0
	at java.lang.ClassLoader.defineClass1(Native Method)
	at java.lang.ClassLoader.defineClass(ClassLoader.java:643)
	at java.security.SecureClassLoader.defineClass(SecureClassLoader.java:142)
	at java.net.URLClassLoader.defineClass(URLClassLoader.java:277)
	at java.net.URLClassLoader.access$000(URLClassLoader.java:73)
	at java.net.URLClassLoader$1.run(URLClassLoader.java:212)
	at java.security.AccessController.doPrivileged(Native Method)
	at java.net.URLClassLoader.findClass(URLClassLoader.java:205)
	at java.lang.ClassLoader.loadClass(ClassLoader.java:323)
	at sun.misc.Launcher$AppClassLoader.loadClass(Launcher.java:294)
	at java.lang.ClassLoader.loadClass(ClassLoader.java:268)
	at com.cloud.hypervisor.kvm.resource.LibvirtVifDriverTest.setUp(LibvirtVifDriverTest.java:51)

testEmptyTrafficType(com.cloud.hypervisor.kvm.resource.LibvirtVifDriverTest)  Time elapsed:
0.002 sec  <<< ERROR!
java.lang.UnsupportedClassVersionError: com/ceph/rados/RadosException : Unsupported major.minor
version 51.0
	at java.lang.ClassLoader.defineClass1(Native Method)
	at java.lang.ClassLoader.defineClass(ClassLoader.java:643)
	at java.security.SecureClassLoader.defineClass(SecureClassLoader.java:142)
	at java.net.URLClassLoader.defineClass(URLClassLoader.java:277)
	at java.net.URLClassLoader.access$000(URLClassLoader.java:73)
	at java.net.URLClassLoader$1.run(URLClassLoader.java:212)
	at java.security.AccessController.doPrivileged(Native Method)
	at java.net.URLClassLoader.findClass(URLClassLoader.java:205)
	at java.lang.ClassLoader.loadClass(ClassLoader.java:323)
	at sun.misc.Launcher$AppClassLoader.loadClass(Launcher.java:294)
	at java.lang.ClassLoader.loadClass(ClassLoader.java:268)
	at com.cloud.hypervisor.kvm.resource.LibvirtVifDriverTest.setUp(LibvirtVifDriverTest.java:51)

testBadVifDriverClassName(com.cloud.hypervisor.kvm.resource.LibvirtVifDriverTest)  Time elapsed:
0.001 sec  <<< ERROR!
java.lang.UnsupportedClassVersionError: com/ceph/rados/RadosException : Unsupported major.minor
version 51.0
	at java.lang.ClassLoader.defineClass1(Native Method)
	at java.lang.ClassLoader.defineClass(ClassLoader.java:643)
	at java.security.SecureClassLoader.defineClass(SecureClassLoader.java:142)
	at java.net.URLClassLoader.defineClass(URLClassLoader.java:277)
	at java.net.URLClassLoader.access$000(URLClassLoader.java:73)
	at java.net.URLClassLoader$1.run(URLClassLoader.java:212)
	at java.security.AccessController.doPrivileged(Native Method)
	at java.net.URLClassLoader.findClass(URLClassLoader.java:205)
	at java.lang.ClassLoader.loadClass(ClassLoader.java:323)
	at sun.misc.Launcher$AppClassLoader.loadClass(Launcher.java:294)
	at java.lang.ClassLoader.loadClass(ClassLoader.java:268)
	at com.cloud.hypervisor.kvm.resource.LibvirtVifDriverTest.setUp(LibvirtVifDriverTest.java:51)

Running com.cloud.hypervisor.kvm.resource.LibvirtVMDefTest
Tests run: 3, Failures: 0, Errors: 0, Skipped: 0, Time elapsed: 0.011 sec
Running com.cloud.hypervisor.kvm.storage.KVMStorageProcessorTest
Tests run: 2, Failures: 0, Errors: 0, Skipped: 0, Time elapsed: 0.002 sec

Results :

Tests in error: 
  LibvirtComputingResourceTest.testCreateVMFromSpecWithTopology4:224 » UnsupportedClassVersion
  LibvirtComputingResourceTest.testCreateVMFromSpec:298 » UnsupportedClassVersion
  LibvirtComputingResourceTest.testGetNicStats:355 » UnsupportedClassVersion com...
  LibvirtComputingResourceTest.testUUID:362 » UnsupportedClassVersion com/ceph/r...
  LibvirtComputingResourceTest.testGetVmStat:423 » UnsupportedClassVersion com/c...
  LibvirtComputingResourceTest.testCreateVMFromSpecWithTopology6:154 » UnsupportedClassVersion
  LibvirtComputingResourceTest.testCreateVMFromSpecLegacy:82 » UnsupportedClassVersion
  LibvirtVifDriverTest.setUp:51 » UnsupportedClassVersion com/ceph/rados/RadosEx...
  LibvirtVifDriverTest.setUp:51 » UnsupportedClassVersion com/ceph/rados/RadosEx...
  LibvirtVifDriverTest.setUp:51 » UnsupportedClassVersion com/ceph/rados/RadosEx...
  LibvirtVifDriverTest.setUp:51 » UnsupportedClassVersion com/ceph/rados/RadosEx...
  LibvirtVifDriverTest.setUp:51 » UnsupportedClassVersion com/ceph/rados/RadosEx...
  LibvirtVifDriverTest.setUp:51 » UnsupportedClassVersion com/ceph/rados/RadosEx...
  LibvirtVifDriverTest.setUp:51 » UnsupportedClassVersion com/ceph/rados/RadosEx...

Tests run: 19, Failures: 0, Errors: 14, Skipped: 0

[INFO] ------------------------------------------------------------------------
[INFO] Reactor Summary:
[INFO] 
[INFO] Apache CloudStack ................................. SUCCESS [1.043s]
[INFO] Apache CloudStack Maven Conventions Parent ........ SUCCESS [0.033s]
[INFO] Apache CloudStack Framework - Managed Context ..... SUCCESS [3.090s]
[INFO] Apache CloudStack Utils ........................... SUCCESS [8.030s]
[INFO] Apache CloudStack Framework ....................... SUCCESS [0.034s]
[INFO] Apache CloudStack Framework - Event Notification .. SUCCESS [4.313s]
[INFO] Apache CloudStack Framework - Configuration ....... SUCCESS [3.468s]
[INFO] Apache CloudStack API ............................. SUCCESS [7.955s]
[INFO] Apache CloudStack Framework - REST ................ SUCCESS [2.626s]
[INFO] Apache CloudStack Framework - IPC ................. SUCCESS [4.933s]
[INFO] Apache CloudStack Cloud Engine .................... SUCCESS [0.030s]
[INFO] Apache CloudStack Cloud Engine API ................ SUCCESS [3.681s]
[INFO] Apache CloudStack Core ............................ SUCCESS [6.040s]
[INFO] Apache CloudStack Agents .......................... SUCCESS [4.534s]
[INFO] Apache CloudStack Framework - Clustering .......... SUCCESS [2.384s]
[INFO] Apache CloudStack Framework - Jobs ................ SUCCESS [2.604s]
[INFO] Apache CloudStack Cloud Engine Schema Component ... SUCCESS [6.285s]
[INFO] Apache CloudStack Framework - Event Notification .. SUCCESS [1.587s]
[INFO] Apache CloudStack Cloud Engine Internal Components API  SUCCESS [2.522s]
[INFO] Apache CloudStack Server .......................... SUCCESS [29.074s]
[INFO] Apache CloudStack Usage Server .................... SUCCESS [4.474s]
[INFO] Apache XenSource XAPI ............................. SUCCESS [3.773s]
[INFO] Apache CloudStack Cloud Engine Orchestration Component  SUCCESS [5.615s]
[INFO] Apache CloudStack Cloud Services .................. SUCCESS [0.027s]
[INFO] Apache CloudStack Secondary Storage Service ....... SUCCESS [3.936s]
[INFO] Apache CloudStack Engine Storage Component ........ SUCCESS [5.212s]
[INFO] Apache CloudStack Engine Storage Volume Component . SUCCESS [3.448s]
[INFO] Apache CloudStack Engine Storage Image Component .. SUCCESS [2.636s]
[INFO] Apache CloudStack Engine Storage Data Motion Component  SUCCESS [2.639s]
[INFO] Apache CloudStack Engine Storage Cache Component .. SUCCESS [2.281s]
[INFO] Apache CloudStack Engine Storage Snapshot Component  SUCCESS [5.980s]
[INFO] Apache CloudStack Cloud Engine API ................ SUCCESS [1.817s]
[INFO] Apache CloudStack Cloud Engine Service ............ SUCCESS [0.957s]
[INFO] Apache CloudStack Plugin POM ...................... SUCCESS [0.324s]
[INFO] Apache CloudStack Plugin - API Rate Limit ......... SUCCESS [6.217s]
[INFO] Apache CloudStack Plugin - API Discovery .......... SUCCESS [3.928s]
[INFO] Apache CloudStack Plugin - ACL Static Role Based .. SUCCESS [2.068s]
[INFO] Apache CloudStack Plugin - Host Anti-Affinity Processor  SUCCESS [2.042s]
[INFO] Apache CloudStack Plugin - Explicit Dedication Processor  SUCCESS [2.109s]
[INFO] Apache CloudStack Plugin - User Concentrated Pod Deployment Planner  SUCCESS [2.026s]
[INFO] Apache CloudStack Plugin - User Dispersing Deployment Planner  SUCCESS [2.105s]
[INFO] Apache CloudStack Plugin - Implicit Dedication Planner  SUCCESS [5.999s]
[INFO] Apache CloudStack Plugin - Skip Heurestics Planner  SUCCESS [1.974s]
[INFO] Apache CloudStack Plugin - Host Allocator Random .. SUCCESS [2.294s]
[INFO] Apache CloudStack Plugin - Dedicated Resources .... SUCCESS [5.729s]
[INFO] Apache CloudStack Plugin - Hypervisor OracleVM .... SUCCESS [2.659s]
[INFO] Apache CloudStack Plugin - Open vSwitch ........... SUCCESS [2.455s]
[INFO] Apache CloudStack Plugin - Hypervisor Xen ......... SUCCESS [7.068s]
[INFO] Apache CloudStack Plugin - Hypervisor KVM ......... FAILURE [6.486s]
[INFO] Apache CloudStack Plugin - RabbitMQ Event Bus ..... SKIPPED
[INFO] Apache CloudStack Plugin - Hypervisor Baremetal ... SKIPPED
[INFO] Apache CloudStack Plugin - Hypervisor UCS ......... SKIPPED
[INFO] Apache CloudStack Plugin - Hypervisor Hyper-V ..... SKIPPED
[INFO] Apache CloudStack Plugin - Network Elastic Load Balancer  SKIPPED
[INFO] Apache CloudStack Plugin - Network Internal Load Balancer  SKIPPED
[INFO] Apache CloudStack Plugin - Network Juniper Contrail  SKIPPED
[INFO] Apache CloudStack Plugin - Palo Alto .............. SKIPPED
[INFO] Apache CloudStack Checkstyle Configuration ........ SKIPPED
[INFO] Apache CloudStack Plugin - Network Nicira NVP ..... SKIPPED
[INFO] Apache CloudStack Plugin - BigSwitch Virtual Network Segment  SKIPPED
[INFO] Apache CloudStack Plugin - Midokura Midonet ....... SKIPPED
[INFO] Apache Cloudstack Plugin - Stratosphere SSP ....... SKIPPED
[INFO] Apache CloudStack Plugin - Storage Allocator Random  SKIPPED
[INFO] Apache CloudStack Plugin - User Authenticator LDAP  SKIPPED
[INFO] Apache CloudStack Plugin - User Authenticator MD5 . SKIPPED
[INFO] Apache CloudStack Plugin - User Authenticator Plain Text  SKIPPED
[INFO] Apache CloudStack Plugin - User Authenticator SHA256 Salted  SKIPPED
[INFO] Apache CloudStack Plugin - Dns Notifier Example ... SKIPPED
[INFO] Apache CloudStack Plugin - Storage Image S3 ....... SKIPPED
[INFO] Apache CloudStack Plugin - Storage Image Swift provider  SKIPPED
[INFO] Apache CloudStack Plugin - Storage Image default provider  SKIPPED
[INFO] Apache CloudStack Plugin - Storage Image sample provider  SKIPPED
[INFO] Apache CloudStack Plugin - Storage Volume SolidFire Provider  SKIPPED
[INFO] Apache CloudStack Plugin - Storage Volume default provider  SKIPPED
[INFO] Apache CloudStack Plugin - Storage Volume sample provider  SKIPPED
[INFO] Apache CloudStack Plugin - SNMP Alerts ............ SKIPPED
[INFO] Apache CloudStack Plugin - Syslog Alerts .......... SKIPPED
[INFO] Apache CloudStack Plugin - Network VXLAN .......... SKIPPED
[INFO] Apache CloudStack Framework - Spring Life Cycle ... SKIPPED
[INFO] cloud-framework-spring-module ..................... SKIPPED
[INFO] Apache CloudStack Test ............................ SKIPPED
[INFO] Apache CloudStack Client UI ....................... SKIPPED
[INFO] Apache CloudStack Console Proxy - RDP Client ...... SKIPPED
[INFO] Apache CloudStack Console Proxy ................... SKIPPED
[INFO] Apache CloudStack Console Proxy - Server .......... SKIPPED
[INFO] Apache CloudStack Framework - QuickCloud .......... SKIPPED
[INFO] ------------------------------------------------------------------------
[INFO] BUILD FAILURE
[INFO] ------------------------------------------------------------------------
[INFO] Total time: 3:14.429s
[INFO] Finished at: Mon Apr 14 14:00:38 CEST 2014
[INFO] Final Memory: 46M/353M
[INFO] ------------------------------------------------------------------------
[ERROR] Failed to execute goal org.apache.maven.plugins:maven-surefire-plugin:2.14:test (default-test)
on project cloud-plugin-hypervisor-kvm: There are test failures.
[ERROR] 
[ERROR] Please refer to <http://jenkins.buildacloud.org/job/cloudstack-4.3-maven-build/ws/plugins/hypervisors/kvm/target/surefire-reports>
for the individual test results.
[ERROR] -> [Help 1]
[ERROR] 
[ERROR] To see the full stack trace of the errors, re-run Maven with the -e switch.
[ERROR] Re-run Maven using the -X switch to enable full debug logging.
[ERROR] 
[ERROR] For more information about the errors and possible solutions, please read the following
articles:
[ERROR] [Help 1] http://cwiki.apache.org/confluence/display/MAVEN/MojoFailureException
[ERROR] 
[ERROR] After correcting the problems, you can resume the build with the command
[ERROR]   mvn <goals> -rf :cloud-plugin-hypervisor-kvm
Build step 'Invoke top-level Maven targets' marked build as failure

Mime
View raw message