cloudstack-dev mailing list archives

Site index · List index
Message view « Date » · « Thread »
Top « Date » · « Thread »
From jenk...@cloudstack.org
Subject Build failed in Jenkins: build-master #607
Date Thu, 10 Apr 2014 10:08:26 GMT
See <http://jenkins.buildacloud.org/job/build-master/607/changes>

Changes:

[kishan] CLOUDSTACK-6371: Set snapshot size in copycommand answer during snapshot backup

[kishan] CLOUDSTACK-6374: Remove entries from lb vm map when lb rule apply fails

[kishan] CLOUDSTACK-6376: Return empty list when network tier has no ACL list associated.

------------------------------------------
[...truncated 3066 lines...]
[ERROR] <http://jenkins.buildacloud.org/job/build-master/ws/plugins/hypervisors/kvm/src/com/cloud/hypervisor/kvm/resource/LibvirtComputingResource.java>:[20,21]
error: package com.ceph.rados does not exist
[ERROR] <http://jenkins.buildacloud.org/job/build-master/ws/plugins/hypervisors/kvm/src/com/cloud/hypervisor/kvm/resource/LibvirtComputingResource.java>:[21,21]
error: package com.ceph.rados does not exist
[ERROR] <http://jenkins.buildacloud.org/job/build-master/ws/plugins/hypervisors/kvm/src/com/cloud/hypervisor/kvm/resource/LibvirtComputingResource.java>:[22,19]
error: package com.ceph.rbd does not exist
[ERROR] <http://jenkins.buildacloud.org/job/build-master/ws/plugins/hypervisors/kvm/src/com/cloud/hypervisor/kvm/resource/LibvirtComputingResource.java>:[23,19]
error: package com.ceph.rbd does not exist
[ERROR] <http://jenkins.buildacloud.org/job/build-master/ws/plugins/hypervisors/kvm/src/com/cloud/hypervisor/kvm/resource/LibvirtComputingResource.java>:[24,19]
error: package com.ceph.rbd does not exist
[ERROR] <http://jenkins.buildacloud.org/job/build-master/ws/plugins/hypervisors/kvm/src/com/cloud/hypervisor/kvm/storage/KVMStorageProcessor.java>:[50,21]
error: package com.ceph.rados does not exist
[ERROR] <http://jenkins.buildacloud.org/job/build-master/ws/plugins/hypervisors/kvm/src/com/cloud/hypervisor/kvm/storage/KVMStorageProcessor.java>:[51,21]
error: package com.ceph.rados does not exist
[ERROR] <http://jenkins.buildacloud.org/job/build-master/ws/plugins/hypervisors/kvm/src/com/cloud/hypervisor/kvm/storage/KVMStorageProcessor.java>:[52,21]
error: package com.ceph.rados does not exist
[ERROR] <http://jenkins.buildacloud.org/job/build-master/ws/plugins/hypervisors/kvm/src/com/cloud/hypervisor/kvm/storage/KVMStorageProcessor.java>:[53,19]
error: package com.ceph.rbd does not exist
[ERROR] <http://jenkins.buildacloud.org/job/build-master/ws/plugins/hypervisors/kvm/src/com/cloud/hypervisor/kvm/storage/KVMStorageProcessor.java>:[54,19]
error: package com.ceph.rbd does not exist
[ERROR] <http://jenkins.buildacloud.org/job/build-master/ws/plugins/hypervisors/kvm/src/com/cloud/hypervisor/kvm/storage/KVMStorageProcessor.java>:[55,19]
error: package com.ceph.rbd does not exist
[ERROR] <http://jenkins.buildacloud.org/job/build-master/ws/plugins/hypervisors/kvm/src/com/cloud/hypervisor/kvm/storage/LibvirtStorageAdaptor.java>:[34,21]
error: package com.ceph.rados does not exist
[ERROR] <http://jenkins.buildacloud.org/job/build-master/ws/plugins/hypervisors/kvm/src/com/cloud/hypervisor/kvm/storage/LibvirtStorageAdaptor.java>:[35,21]
error: package com.ceph.rados does not exist
[ERROR] <http://jenkins.buildacloud.org/job/build-master/ws/plugins/hypervisors/kvm/src/com/cloud/hypervisor/kvm/storage/LibvirtStorageAdaptor.java>:[36,21]
error: package com.ceph.rados does not exist
[ERROR] <http://jenkins.buildacloud.org/job/build-master/ws/plugins/hypervisors/kvm/src/com/cloud/hypervisor/kvm/storage/LibvirtStorageAdaptor.java>:[37,19]
error: package com.ceph.rbd does not exist
[ERROR] <http://jenkins.buildacloud.org/job/build-master/ws/plugins/hypervisors/kvm/src/com/cloud/hypervisor/kvm/storage/LibvirtStorageAdaptor.java>:[38,19]
error: package com.ceph.rbd does not exist
[ERROR] <http://jenkins.buildacloud.org/job/build-master/ws/plugins/hypervisors/kvm/src/com/cloud/hypervisor/kvm/storage/LibvirtStorageAdaptor.java>:[39,19]
error: package com.ceph.rbd does not exist
[ERROR] <http://jenkins.buildacloud.org/job/build-master/ws/plugins/hypervisors/kvm/src/com/cloud/hypervisor/kvm/storage/LibvirtStorageAdaptor.java>:[40,23]
error: package com.ceph.rbd.jna does not exist
[ERROR] <http://jenkins.buildacloud.org/job/build-master/ws/plugins/hypervisors/kvm/src/com/cloud/hypervisor/kvm/resource/LibvirtComputingResource.java>:[2372,24]
error: cannot find symbol
[ERROR] symbol:   class Rados
[ERROR] location: class LibvirtComputingResource
[ERROR] <http://jenkins.buildacloud.org/job/build-master/ws/plugins/hypervisors/kvm/src/com/cloud/hypervisor/kvm/resource/LibvirtComputingResource.java>:[2372,38]
error: cannot find symbol
[ERROR] symbol:   class Rados
[ERROR] location: class LibvirtComputingResource
[ERROR] <http://jenkins.buildacloud.org/job/build-master/ws/plugins/hypervisors/kvm/src/com/cloud/hypervisor/kvm/resource/LibvirtComputingResource.java>:[2379,24]
error: cannot find symbol
[ERROR] symbol:   class IoCTX
[ERROR] location: class LibvirtComputingResource
[ERROR] <http://jenkins.buildacloud.org/job/build-master/ws/plugins/hypervisors/kvm/src/com/cloud/hypervisor/kvm/resource/LibvirtComputingResource.java>:[2380,24]
error: cannot find symbol
[ERROR] symbol:   class Rbd
[ERROR] location: class LibvirtComputingResource
[ERROR] <http://jenkins.buildacloud.org/job/build-master/ws/plugins/hypervisors/kvm/src/com/cloud/hypervisor/kvm/resource/LibvirtComputingResource.java>:[2380,38]
error: cannot find symbol
[ERROR] symbol:   class Rbd
[ERROR] location: class LibvirtComputingResource
[ERROR] <http://jenkins.buildacloud.org/job/build-master/ws/plugins/hypervisors/kvm/src/com/cloud/hypervisor/kvm/resource/LibvirtComputingResource.java>:[2381,24]
error: cannot find symbol
[ERROR] symbol:   class RbdImage
[ERROR] location: class LibvirtComputingResource
[ERROR] <http://jenkins.buildacloud.org/job/build-master/ws/plugins/hypervisors/kvm/src/com/cloud/hypervisor/kvm/resource/LibvirtComputingResource.java>:[2455,20]
error: cannot find symbol
[ERROR] symbol:   class Rados
[ERROR] location: class LibvirtComputingResource
[ERROR] <http://jenkins.buildacloud.org/job/build-master/ws/plugins/hypervisors/kvm/src/com/cloud/hypervisor/kvm/resource/LibvirtComputingResource.java>:[2455,34]
error: cannot find symbol
[ERROR] symbol:   class Rados
[ERROR] location: class LibvirtComputingResource
[ERROR] <http://jenkins.buildacloud.org/job/build-master/ws/plugins/hypervisors/kvm/src/com/cloud/hypervisor/kvm/resource/LibvirtComputingResource.java>:[2462,20]
error: cannot find symbol
[ERROR] symbol:   class IoCTX
[ERROR] location: class LibvirtComputingResource
[ERROR] <http://jenkins.buildacloud.org/job/build-master/ws/plugins/hypervisors/kvm/src/com/cloud/hypervisor/kvm/resource/LibvirtComputingResource.java>:[2463,20]
error: cannot find symbol
[ERROR] symbol:   class Rbd
[ERROR] location: class LibvirtComputingResource
[ERROR] <http://jenkins.buildacloud.org/job/build-master/ws/plugins/hypervisors/kvm/src/com/cloud/hypervisor/kvm/resource/LibvirtComputingResource.java>:[2463,34]
error: cannot find symbol
[ERROR] symbol:   class Rbd
[ERROR] location: class LibvirtComputingResource
[ERROR] <http://jenkins.buildacloud.org/job/build-master/ws/plugins/hypervisors/kvm/src/com/cloud/hypervisor/kvm/resource/LibvirtComputingResource.java>:[2464,20]
error: cannot find symbol
[ERROR] symbol:   class RbdImage
[ERROR] location: class LibvirtComputingResource
[ERROR] <http://jenkins.buildacloud.org/job/build-master/ws/plugins/hypervisors/kvm/src/com/cloud/hypervisor/kvm/resource/LibvirtComputingResource.java>:[2484,25]
error: cannot find symbol
[ERROR] symbol:   class RadosException
[ERROR] location: class LibvirtComputingResource
[ERROR] <http://jenkins.buildacloud.org/job/build-master/ws/plugins/hypervisors/kvm/src/com/cloud/hypervisor/kvm/resource/LibvirtComputingResource.java>:[2487,25]
error: cannot find symbol
[ERROR] symbol:   class RbdException
[ERROR] location: class LibvirtComputingResource
[ERROR] <http://jenkins.buildacloud.org/job/build-master/ws/plugins/hypervisors/kvm/src/com/cloud/hypervisor/kvm/storage/KVMStorageProcessor.java>:[704,20]
error: cannot find symbol
[ERROR] symbol:   class Rados
[ERROR] location: class KVMStorageProcessor
[ERROR] <http://jenkins.buildacloud.org/job/build-master/ws/plugins/hypervisors/kvm/src/com/cloud/hypervisor/kvm/storage/KVMStorageProcessor.java>:[704,34]
error: cannot find symbol
[ERROR] symbol:   class Rados
[ERROR] location: class KVMStorageProcessor
[ERROR] <http://jenkins.buildacloud.org/job/build-master/ws/plugins/hypervisors/kvm/src/com/cloud/hypervisor/kvm/storage/KVMStorageProcessor.java>:[711,20]
error: cannot find symbol
[ERROR] symbol:   class IoCTX
[ERROR] location: class KVMStorageProcessor
[ERROR] <http://jenkins.buildacloud.org/job/build-master/ws/plugins/hypervisors/kvm/src/com/cloud/hypervisor/kvm/storage/KVMStorageProcessor.java>:[712,20]
error: cannot find symbol
[ERROR] symbol:   class Rbd
[ERROR] location: class KVMStorageProcessor
[ERROR] <http://jenkins.buildacloud.org/job/build-master/ws/plugins/hypervisors/kvm/src/com/cloud/hypervisor/kvm/storage/KVMStorageProcessor.java>:[712,34]
error: cannot find symbol
[ERROR] symbol:   class Rbd
[ERROR] location: class KVMStorageProcessor
[ERROR] <http://jenkins.buildacloud.org/job/build-master/ws/plugins/hypervisors/kvm/src/com/cloud/hypervisor/kvm/storage/KVMStorageProcessor.java>:[713,20]
error: cannot find symbol
[ERROR] symbol:   class RbdImage
[ERROR] location: class KVMStorageProcessor
[ERROR] <http://jenkins.buildacloud.org/job/build-master/ws/plugins/hypervisors/kvm/src/com/cloud/hypervisor/kvm/storage/KVMStorageProcessor.java>:[742,25]
error: cannot find symbol
[ERROR] symbol:   class RadosException
[ERROR] location: class KVMStorageProcessor
[ERROR] <http://jenkins.buildacloud.org/job/build-master/ws/plugins/hypervisors/kvm/src/com/cloud/hypervisor/kvm/storage/KVMStorageProcessor.java>:[745,25]
error: cannot find symbol
[ERROR] symbol:   class RbdException
[ERROR] location: class KVMStorageProcessor
[ERROR] <http://jenkins.buildacloud.org/job/build-master/ws/plugins/hypervisors/kvm/src/com/cloud/hypervisor/kvm/storage/KVMStorageProcessor.java>:[1156,24]
error: cannot find symbol
[ERROR] symbol:   class Rados
[ERROR] location: class KVMStorageProcessor
[ERROR] <http://jenkins.buildacloud.org/job/build-master/ws/plugins/hypervisors/kvm/src/com/cloud/hypervisor/kvm/storage/KVMStorageProcessor.java>:[1156,38]
error: cannot find symbol
[ERROR] symbol:   class Rados
[ERROR] location: class KVMStorageProcessor
[ERROR] <http://jenkins.buildacloud.org/job/build-master/ws/plugins/hypervisors/kvm/src/com/cloud/hypervisor/kvm/storage/KVMStorageProcessor.java>:[1163,24]
error: cannot find symbol
[ERROR] symbol:   class IoCTX
[ERROR] location: class KVMStorageProcessor
[ERROR] <http://jenkins.buildacloud.org/job/build-master/ws/plugins/hypervisors/kvm/src/com/cloud/hypervisor/kvm/storage/KVMStorageProcessor.java>:[1164,24]
error: cannot find symbol
[ERROR] symbol:   class Rbd
[ERROR] location: class KVMStorageProcessor
[ERROR] <http://jenkins.buildacloud.org/job/build-master/ws/plugins/hypervisors/kvm/src/com/cloud/hypervisor/kvm/storage/KVMStorageProcessor.java>:[1164,38]
error: cannot find symbol
[ERROR] symbol:   class Rbd
[ERROR] location: class KVMStorageProcessor
[ERROR] <http://jenkins.buildacloud.org/job/build-master/ws/plugins/hypervisors/kvm/src/com/cloud/hypervisor/kvm/storage/KVMStorageProcessor.java>:[1165,24]
error: cannot find symbol
[ERROR] symbol:   class RbdImage
[ERROR] location: class KVMStorageProcessor
[ERROR] <http://jenkins.buildacloud.org/job/build-master/ws/plugins/hypervisors/kvm/src/com/cloud/hypervisor/kvm/storage/LibvirtStorageAdaptor.java>:[640,16]
error: cannot find symbol
[ERROR] symbol:   class Rados
[ERROR] location: class LibvirtStorageAdaptor
[ERROR] <http://jenkins.buildacloud.org/job/build-master/ws/plugins/hypervisors/kvm/src/com/cloud/hypervisor/kvm/storage/LibvirtStorageAdaptor.java>:[640,30]
error: cannot find symbol
[ERROR] symbol:   class Rados
[ERROR] location: class LibvirtStorageAdaptor
[ERROR] <http://jenkins.buildacloud.org/job/build-master/ws/plugins/hypervisors/kvm/src/com/cloud/hypervisor/kvm/storage/LibvirtStorageAdaptor.java>:[647,16]
error: cannot find symbol
[ERROR] symbol:   class IoCTX
[ERROR] location: class LibvirtStorageAdaptor
[ERROR] <http://jenkins.buildacloud.org/job/build-master/ws/plugins/hypervisors/kvm/src/com/cloud/hypervisor/kvm/storage/LibvirtStorageAdaptor.java>:[648,16]
error: cannot find symbol
[ERROR] symbol:   class Rbd
[ERROR] location: class LibvirtStorageAdaptor
[ERROR] <http://jenkins.buildacloud.org/job/build-master/ws/plugins/hypervisors/kvm/src/com/cloud/hypervisor/kvm/storage/LibvirtStorageAdaptor.java>:[648,30]
error: cannot find symbol
[ERROR] symbol:   class Rbd
[ERROR] location: class LibvirtStorageAdaptor
[ERROR] <http://jenkins.buildacloud.org/job/build-master/ws/plugins/hypervisors/kvm/src/com/cloud/hypervisor/kvm/storage/LibvirtStorageAdaptor.java>:[652,21]
error: cannot find symbol
[ERROR] symbol:   class RadosException
[ERROR] location: class LibvirtStorageAdaptor
[ERROR] <http://jenkins.buildacloud.org/job/build-master/ws/plugins/hypervisors/kvm/src/com/cloud/hypervisor/kvm/storage/LibvirtStorageAdaptor.java>:[654,21]
error: cannot find symbol
[ERROR] symbol:   class RbdException
[ERROR] location: class LibvirtStorageAdaptor
[ERROR] <http://jenkins.buildacloud.org/job/build-master/ws/plugins/hypervisors/kvm/src/com/cloud/hypervisor/kvm/storage/LibvirtStorageAdaptor.java>:[752,16]
error: cannot find symbol
[ERROR] symbol:   class Rados
[ERROR] location: class LibvirtStorageAdaptor
[ERROR] <http://jenkins.buildacloud.org/job/build-master/ws/plugins/hypervisors/kvm/src/com/cloud/hypervisor/kvm/storage/LibvirtStorageAdaptor.java>:[752,30]
error: cannot find symbol
[ERROR] symbol:   class Rados
[ERROR] location: class LibvirtStorageAdaptor
[ERROR] <http://jenkins.buildacloud.org/job/build-master/ws/plugins/hypervisors/kvm/src/com/cloud/hypervisor/kvm/storage/LibvirtStorageAdaptor.java>:[759,16]
error: cannot find symbol
[ERROR] symbol:   class IoCTX
[ERROR] location: class LibvirtStorageAdaptor
[ERROR] <http://jenkins.buildacloud.org/job/build-master/ws/plugins/hypervisors/kvm/src/com/cloud/hypervisor/kvm/storage/LibvirtStorageAdaptor.java>:[760,16]
error: cannot find symbol
[ERROR] symbol:   class Rbd
[ERROR] location: class LibvirtStorageAdaptor
[ERROR] <http://jenkins.buildacloud.org/job/build-master/ws/plugins/hypervisors/kvm/src/com/cloud/hypervisor/kvm/storage/LibvirtStorageAdaptor.java>:[760,30]
error: cannot find symbol
[ERROR] symbol:   class Rbd
[ERROR] location: class LibvirtStorageAdaptor
[ERROR] <http://jenkins.buildacloud.org/job/build-master/ws/plugins/hypervisors/kvm/src/com/cloud/hypervisor/kvm/storage/LibvirtStorageAdaptor.java>:[761,16]
error: cannot find symbol
[ERROR] symbol:   class RbdImage
[ERROR] location: class LibvirtStorageAdaptor
[ERROR] <http://jenkins.buildacloud.org/job/build-master/ws/plugins/hypervisors/kvm/src/com/cloud/hypervisor/kvm/storage/LibvirtStorageAdaptor.java>:[763,21]
error: cannot find symbol
[ERROR] symbol:   class RbdSnapInfo
[ERROR] location: class LibvirtStorageAdaptor
[ERROR] <http://jenkins.buildacloud.org/job/build-master/ws/plugins/hypervisors/kvm/src/com/cloud/hypervisor/kvm/storage/LibvirtStorageAdaptor.java>:[764,21]
error: cannot find symbol
[ERROR] symbol:   class RbdSnapInfo
[ERROR] location: class LibvirtStorageAdaptor
[ERROR] <http://jenkins.buildacloud.org/job/build-master/ws/plugins/hypervisors/kvm/src/com/cloud/hypervisor/kvm/storage/LibvirtStorageAdaptor.java>:[777,21]
error: cannot find symbol
[ERROR] symbol:   class RadosException
[ERROR] location: class LibvirtStorageAdaptor
[ERROR] <http://jenkins.buildacloud.org/job/build-master/ws/plugins/hypervisors/kvm/src/com/cloud/hypervisor/kvm/storage/LibvirtStorageAdaptor.java>:[779,21]
error: cannot find symbol
[ERROR] symbol:   class RbdException
[ERROR] location: class LibvirtStorageAdaptor
[ERROR] <http://jenkins.buildacloud.org/job/build-master/ws/plugins/hypervisors/kvm/src/com/cloud/hypervisor/kvm/storage/LibvirtStorageAdaptor.java>:[891,28]
error: cannot find symbol
[ERROR] symbol:   class Rados
[ERROR] location: class LibvirtStorageAdaptor
[ERROR] <http://jenkins.buildacloud.org/job/build-master/ws/plugins/hypervisors/kvm/src/com/cloud/hypervisor/kvm/storage/LibvirtStorageAdaptor.java>:[891,42]
error: cannot find symbol
[ERROR] symbol:   class Rados
[ERROR] location: class LibvirtStorageAdaptor
[ERROR] <http://jenkins.buildacloud.org/job/build-master/ws/plugins/hypervisors/kvm/src/com/cloud/hypervisor/kvm/storage/LibvirtStorageAdaptor.java>:[898,28]
error: cannot find symbol
[ERROR] symbol:   class IoCTX
[ERROR] location: class LibvirtStorageAdaptor
[ERROR] <http://jenkins.buildacloud.org/job/build-master/ws/plugins/hypervisors/kvm/src/com/cloud/hypervisor/kvm/storage/LibvirtStorageAdaptor.java>:[899,28]
error: cannot find symbol
[ERROR] symbol:   class Rbd
[ERROR] location: class LibvirtStorageAdaptor
[ERROR] <http://jenkins.buildacloud.org/job/build-master/ws/plugins/hypervisors/kvm/src/com/cloud/hypervisor/kvm/storage/LibvirtStorageAdaptor.java>:[899,42]
error: cannot find symbol
[ERROR] symbol:   class Rbd
[ERROR] location: class LibvirtStorageAdaptor
[ERROR] <http://jenkins.buildacloud.org/job/build-master/ws/plugins/hypervisors/kvm/src/com/cloud/hypervisor/kvm/storage/LibvirtStorageAdaptor.java>:[900,28]
error: cannot find symbol
[ERROR] symbol:   class RbdImage
[ERROR] location: class LibvirtStorageAdaptor
[ERROR] <http://jenkins.buildacloud.org/job/build-master/ws/plugins/hypervisors/kvm/src/com/cloud/hypervisor/kvm/storage/LibvirtStorageAdaptor.java>:[908,32]
error: cannot find symbol
[ERROR] symbol:   class RbdImage
[ERROR] location: class LibvirtStorageAdaptor
[ERROR] <http://jenkins.buildacloud.org/job/build-master/ws/plugins/hypervisors/kvm/src/com/cloud/hypervisor/kvm/storage/LibvirtStorageAdaptor.java>:[929,28]
error: cannot find symbol
[ERROR] symbol:   class Rados
[ERROR] location: class LibvirtStorageAdaptor
[ERROR] <http://jenkins.buildacloud.org/job/build-master/ws/plugins/hypervisors/kvm/src/com/cloud/hypervisor/kvm/storage/LibvirtStorageAdaptor.java>:[929,45]
error: cannot find symbol
[ERROR] symbol:   class Rados
[ERROR] location: class LibvirtStorageAdaptor
[ERROR] <http://jenkins.buildacloud.org/job/build-master/ws/plugins/hypervisors/kvm/src/com/cloud/hypervisor/kvm/storage/LibvirtStorageAdaptor.java>:[936,28]
error: cannot find symbol
[ERROR] symbol:   class Rados
[ERROR] location: class LibvirtStorageAdaptor
[ERROR] <http://jenkins.buildacloud.org/job/build-master/ws/plugins/hypervisors/kvm/src/com/cloud/hypervisor/kvm/storage/LibvirtStorageAdaptor.java>:[936,46]
error: cannot find symbol
[ERROR] symbol:   class Rados
[ERROR] location: class LibvirtStorageAdaptor
[ERROR] <http://jenkins.buildacloud.org/job/build-master/ws/plugins/hypervisors/kvm/src/com/cloud/hypervisor/kvm/storage/LibvirtStorageAdaptor.java>:[943,28]
error: cannot find symbol
[ERROR] symbol:   class IoCTX
[ERROR] location: class LibvirtStorageAdaptor
[ERROR] <http://jenkins.buildacloud.org/job/build-master/ws/plugins/hypervisors/kvm/src/com/cloud/hypervisor/kvm/storage/LibvirtStorageAdaptor.java>:[944,28]
error: cannot find symbol
[ERROR] symbol:   class Rbd
[ERROR] location: class LibvirtStorageAdaptor
[ERROR] <http://jenkins.buildacloud.org/job/build-master/ws/plugins/hypervisors/kvm/src/com/cloud/hypervisor/kvm/storage/LibvirtStorageAdaptor.java>:[944,43]
error: cannot find symbol
[ERROR] symbol:   class Rbd
[ERROR] location: class LibvirtStorageAdaptor
[ERROR] <http://jenkins.buildacloud.org/job/build-master/ws/plugins/hypervisors/kvm/src/com/cloud/hypervisor/kvm/storage/LibvirtStorageAdaptor.java>:[946,28]
error: cannot find symbol
[ERROR] symbol:   class IoCTX
[ERROR] location: class LibvirtStorageAdaptor
[ERROR] <http://jenkins.buildacloud.org/job/build-master/ws/plugins/hypervisors/kvm/src/com/cloud/hypervisor/kvm/storage/LibvirtStorageAdaptor.java>:[947,28]
error: cannot find symbol
[ERROR] symbol:   class Rbd
[ERROR] location: class LibvirtStorageAdaptor
[ERROR] <http://jenkins.buildacloud.org/job/build-master/ws/plugins/hypervisors/kvm/src/com/cloud/hypervisor/kvm/storage/LibvirtStorageAdaptor.java>:[947,43]
error: cannot find symbol
[ERROR] symbol:   class Rbd
[ERROR] location: class LibvirtStorageAdaptor
[ERROR] <http://jenkins.buildacloud.org/job/build-master/ws/plugins/hypervisors/kvm/src/com/cloud/hypervisor/kvm/storage/LibvirtStorageAdaptor.java>:[953,28]
error: cannot find symbol
[ERROR] symbol:   class RbdImage
[ERROR] location: class LibvirtStorageAdaptor
[ERROR] <http://jenkins.buildacloud.org/job/build-master/ws/plugins/hypervisors/kvm/src/com/cloud/hypervisor/kvm/storage/LibvirtStorageAdaptor.java>:[954,28]
error: cannot find symbol
[ERROR] symbol:   class RbdImage
[ERROR] location: class LibvirtStorageAdaptor
[ERROR] <http://jenkins.buildacloud.org/job/build-master/ws/plugins/hypervisors/kvm/src/com/cloud/hypervisor/kvm/storage/LibvirtStorageAdaptor.java>:[966,29]
error: cannot find symbol
[ERROR] symbol:   class RadosException
[ERROR] location: class LibvirtStorageAdaptor
[ERROR] <http://jenkins.buildacloud.org/job/build-master/ws/plugins/hypervisors/kvm/src/com/cloud/hypervisor/kvm/storage/LibvirtStorageAdaptor.java>:[969,29]
error: cannot find symbol
[ERROR] symbol:   class RbdException
[ERROR] location: class LibvirtStorageAdaptor
[ERROR] <http://jenkins.buildacloud.org/job/build-master/ws/plugins/hypervisors/kvm/src/com/cloud/hypervisor/kvm/storage/LibvirtStorageAdaptor.java>:[1116,16]
error: cannot find symbol
[ERROR] symbol:   class Rados
[ERROR] location: class LibvirtStorageAdaptor
[ERROR] <http://jenkins.buildacloud.org/job/build-master/ws/plugins/hypervisors/kvm/src/com/cloud/hypervisor/kvm/storage/LibvirtStorageAdaptor.java>:[1116,30]
error: cannot find symbol
[ERROR] symbol:   class Rados
[ERROR] location: class LibvirtStorageAdaptor
[ERROR] <http://jenkins.buildacloud.org/job/build-master/ws/plugins/hypervisors/kvm/src/com/cloud/hypervisor/kvm/storage/LibvirtStorageAdaptor.java>:[1123,16]
error: cannot find symbol
[ERROR] symbol:   class IoCTX
[ERROR] location: class LibvirtStorageAdaptor
[ERROR] <http://jenkins.buildacloud.org/job/build-master/ws/plugins/hypervisors/kvm/src/com/cloud/hypervisor/kvm/storage/LibvirtStorageAdaptor.java>:[1124,16]
error: cannot find symbol
[ERROR] symbol:   class Rbd
[ERROR] location: class LibvirtStorageAdaptor
[ERROR] <http://jenkins.buildacloud.org/job/build-master/ws/plugins/hypervisors/kvm/src/com/cloud/hypervisor/kvm/storage/LibvirtStorageAdaptor.java>:[1124,30]
error: cannot find symbol
[ERROR] symbol:   class Rbd
[ERROR] location: class LibvirtStorageAdaptor
[ERROR] <http://jenkins.buildacloud.org/job/build-master/ws/plugins/hypervisors/kvm/src/com/cloud/hypervisor/kvm/storage/LibvirtStorageAdaptor.java>:[1126,16]
error: cannot find symbol
[ERROR] symbol:   class RbdImage
[ERROR] location: class LibvirtStorageAdaptor
[ERROR] <http://jenkins.buildacloud.org/job/build-master/ws/plugins/hypervisors/kvm/src/com/cloud/hypervisor/kvm/storage/LibvirtStorageAdaptor.java>:[1139,21]
error: cannot find symbol
[ERROR] symbol:   class RadosException
[ERROR] location: class LibvirtStorageAdaptor
[ERROR] <http://jenkins.buildacloud.org/job/build-master/ws/plugins/hypervisors/kvm/src/com/cloud/hypervisor/kvm/storage/LibvirtStorageAdaptor.java>:[1142,21]
error: cannot find symbol
[ERROR] -> [Help 1]
[ERROR] 
[ERROR] To see the full stack trace of the errors, re-run Maven with the -e switch.
[ERROR] Re-run Maven using the -X switch to enable full debug logging.
[ERROR] 
[ERROR] For more information about the errors and possible solutions, please read the following
articles:
[ERROR] [Help 1] http://cwiki.apache.org/confluence/display/MAVEN/MojoFailureException
[ERROR] 
[ERROR] After correcting the problems, you can resume the build with the command
[ERROR]   mvn <goals> -rf :cloud-plugin-hypervisor-kvm
Build step 'Invoke top-level Maven targets' marked build as failure

Mime
View raw message