cloudstack-dev mailing list archives

Site index · List index
Message view « Date » · « Thread »
Top « Date » · « Thread »
From jenk...@cloudstack.org
Subject Build failed in Jenkins: cloudstack-4.3-maven-build-noredist #416
Date Thu, 17 Apr 2014 01:09:33 GMT
See <http://jenkins.buildacloud.org/job/cloudstack-4.3-maven-build-noredist/416/changes>

Changes:

[wido] CLOUDSTACK-4665: Depend on rados-java 0.1.4

[wido] CLOUDSTACK-4665: Check if a snapshot is protected before trying to unprotect

[wido] debian: Add JNA flag when starting agent

[wido] debian: cloudstack-management requires libmysql-java for SQL connection

[sheng.yang] CLOUDSTACK-6285: Fix savepassword.sh script for clear out old entries

------------------------------------------
[...truncated 3802 lines...]
	at sun.misc.Launcher$AppClassLoader.loadClass(Launcher.java:294)
	at java.lang.ClassLoader.loadClass(ClassLoader.java:268)
	at com.cloud.hypervisor.kvm.resource.LibvirtComputingResourceTest.testGetVmStat(LibvirtComputingResourceTest.java:423)

Running com.cloud.hypervisor.kvm.resource.LibvirtVifDriverTest
Tests run: 7, Failures: 0, Errors: 7, Skipped: 0, Time elapsed: 0.009 sec <<< FAILURE!
testDefaults(com.cloud.hypervisor.kvm.resource.LibvirtVifDriverTest)  Time elapsed: 0 sec
 <<< ERROR!
java.lang.UnsupportedClassVersionError: com/ceph/rados/RadosException : Unsupported major.minor
version 51.0
	at java.lang.ClassLoader.defineClass1(Native Method)
	at java.lang.ClassLoader.defineClass(ClassLoader.java:643)
	at java.security.SecureClassLoader.defineClass(SecureClassLoader.java:142)
	at java.net.URLClassLoader.defineClass(URLClassLoader.java:277)
	at java.net.URLClassLoader.access$000(URLClassLoader.java:73)
	at java.net.URLClassLoader$1.run(URLClassLoader.java:212)
	at java.security.AccessController.doPrivileged(Native Method)
	at java.net.URLClassLoader.findClass(URLClassLoader.java:205)
	at java.lang.ClassLoader.loadClass(ClassLoader.java:323)
	at sun.misc.Launcher$AppClassLoader.loadClass(Launcher.java:294)
	at java.lang.ClassLoader.loadClass(ClassLoader.java:268)
	at com.cloud.hypervisor.kvm.resource.LibvirtVifDriverTest.setUp(LibvirtVifDriverTest.java:51)

testDefaultsWhenExplicitlySet(com.cloud.hypervisor.kvm.resource.LibvirtVifDriverTest)  Time
elapsed: 0 sec  <<< ERROR!
java.lang.UnsupportedClassVersionError: com/ceph/rados/RadosException : Unsupported major.minor
version 51.0
	at java.lang.ClassLoader.defineClass1(Native Method)
	at java.lang.ClassLoader.defineClass(ClassLoader.java:643)
	at java.security.SecureClassLoader.defineClass(SecureClassLoader.java:142)
	at java.net.URLClassLoader.defineClass(URLClassLoader.java:277)
	at java.net.URLClassLoader.access$000(URLClassLoader.java:73)
	at java.net.URLClassLoader$1.run(URLClassLoader.java:212)
	at java.security.AccessController.doPrivileged(Native Method)
	at java.net.URLClassLoader.findClass(URLClassLoader.java:205)
	at java.lang.ClassLoader.loadClass(ClassLoader.java:323)
	at sun.misc.Launcher$AppClassLoader.loadClass(Launcher.java:294)
	at java.lang.ClassLoader.loadClass(ClassLoader.java:268)
	at com.cloud.hypervisor.kvm.resource.LibvirtVifDriverTest.setUp(LibvirtVifDriverTest.java:51)

testWhenExplicitlySetDifferentDefault(com.cloud.hypervisor.kvm.resource.LibvirtVifDriverTest)
 Time elapsed: 0 sec  <<< ERROR!
java.lang.UnsupportedClassVersionError: com/ceph/rados/RadosException : Unsupported major.minor
version 51.0
	at java.lang.ClassLoader.defineClass1(Native Method)
	at java.lang.ClassLoader.defineClass(ClassLoader.java:643)
	at java.security.SecureClassLoader.defineClass(SecureClassLoader.java:142)
	at java.net.URLClassLoader.defineClass(URLClassLoader.java:277)
	at java.net.URLClassLoader.access$000(URLClassLoader.java:73)
	at java.net.URLClassLoader$1.run(URLClassLoader.java:212)
	at java.security.AccessController.doPrivileged(Native Method)
	at java.net.URLClassLoader.findClass(URLClassLoader.java:205)
	at java.lang.ClassLoader.loadClass(ClassLoader.java:323)
	at sun.misc.Launcher$AppClassLoader.loadClass(Launcher.java:294)
	at java.lang.ClassLoader.loadClass(ClassLoader.java:268)
	at com.cloud.hypervisor.kvm.resource.LibvirtVifDriverTest.setUp(LibvirtVifDriverTest.java:51)

testOverrideSomeTrafficTypes(com.cloud.hypervisor.kvm.resource.LibvirtVifDriverTest)  Time
elapsed: 0.001 sec  <<< ERROR!
java.lang.UnsupportedClassVersionError: com/ceph/rados/RadosException : Unsupported major.minor
version 51.0
	at java.lang.ClassLoader.defineClass1(Native Method)
	at java.lang.ClassLoader.defineClass(ClassLoader.java:643)
	at java.security.SecureClassLoader.defineClass(SecureClassLoader.java:142)
	at java.net.URLClassLoader.defineClass(URLClassLoader.java:277)
	at java.net.URLClassLoader.access$000(URLClassLoader.java:73)
	at java.net.URLClassLoader$1.run(URLClassLoader.java:212)
	at java.security.AccessController.doPrivileged(Native Method)
	at java.net.URLClassLoader.findClass(URLClassLoader.java:205)
	at java.lang.ClassLoader.loadClass(ClassLoader.java:323)
	at sun.misc.Launcher$AppClassLoader.loadClass(Launcher.java:294)
	at java.lang.ClassLoader.loadClass(ClassLoader.java:268)
	at com.cloud.hypervisor.kvm.resource.LibvirtVifDriverTest.setUp(LibvirtVifDriverTest.java:51)

testBadTrafficType(com.cloud.hypervisor.kvm.resource.LibvirtVifDriverTest)  Time elapsed:
0.001 sec  <<< ERROR!
java.lang.UnsupportedClassVersionError: com/ceph/rados/RadosException : Unsupported major.minor
version 51.0
	at java.lang.ClassLoader.defineClass1(Native Method)
	at java.lang.ClassLoader.defineClass(ClassLoader.java:643)
	at java.security.SecureClassLoader.defineClass(SecureClassLoader.java:142)
	at java.net.URLClassLoader.defineClass(URLClassLoader.java:277)
	at java.net.URLClassLoader.access$000(URLClassLoader.java:73)
	at java.net.URLClassLoader$1.run(URLClassLoader.java:212)
	at java.security.AccessController.doPrivileged(Native Method)
	at java.net.URLClassLoader.findClass(URLClassLoader.java:205)
	at java.lang.ClassLoader.loadClass(ClassLoader.java:323)
	at sun.misc.Launcher$AppClassLoader.loadClass(Launcher.java:294)
	at java.lang.ClassLoader.loadClass(ClassLoader.java:268)
	at com.cloud.hypervisor.kvm.resource.LibvirtVifDriverTest.setUp(LibvirtVifDriverTest.java:51)

testEmptyTrafficType(com.cloud.hypervisor.kvm.resource.LibvirtVifDriverTest)  Time elapsed:
0.004 sec  <<< ERROR!
java.lang.UnsupportedClassVersionError: com/ceph/rados/RadosException : Unsupported major.minor
version 51.0
	at java.lang.ClassLoader.defineClass1(Native Method)
	at java.lang.ClassLoader.defineClass(ClassLoader.java:643)
	at java.security.SecureClassLoader.defineClass(SecureClassLoader.java:142)
	at java.net.URLClassLoader.defineClass(URLClassLoader.java:277)
	at java.net.URLClassLoader.access$000(URLClassLoader.java:73)
	at java.net.URLClassLoader$1.run(URLClassLoader.java:212)
	at java.security.AccessController.doPrivileged(Native Method)
	at java.net.URLClassLoader.findClass(URLClassLoader.java:205)
	at java.lang.ClassLoader.loadClass(ClassLoader.java:323)
	at sun.misc.Launcher$AppClassLoader.loadClass(Launcher.java:294)
	at java.lang.ClassLoader.loadClass(ClassLoader.java:268)
	at com.cloud.hypervisor.kvm.resource.LibvirtVifDriverTest.setUp(LibvirtVifDriverTest.java:51)

testBadVifDriverClassName(com.cloud.hypervisor.kvm.resource.LibvirtVifDriverTest)  Time elapsed:
0 sec  <<< ERROR!
java.lang.UnsupportedClassVersionError: com/ceph/rados/RadosException : Unsupported major.minor
version 51.0
	at java.lang.ClassLoader.defineClass1(Native Method)
	at java.lang.ClassLoader.defineClass(ClassLoader.java:643)
	at java.security.SecureClassLoader.defineClass(SecureClassLoader.java:142)
	at java.net.URLClassLoader.defineClass(URLClassLoader.java:277)
	at java.net.URLClassLoader.access$000(URLClassLoader.java:73)
	at java.net.URLClassLoader$1.run(URLClassLoader.java:212)
	at java.security.AccessController.doPrivileged(Native Method)
	at java.net.URLClassLoader.findClass(URLClassLoader.java:205)
	at java.lang.ClassLoader.loadClass(ClassLoader.java:323)
	at sun.misc.Launcher$AppClassLoader.loadClass(Launcher.java:294)
	at java.lang.ClassLoader.loadClass(ClassLoader.java:268)
	at com.cloud.hypervisor.kvm.resource.LibvirtVifDriverTest.setUp(LibvirtVifDriverTest.java:51)

Running com.cloud.hypervisor.kvm.resource.LibvirtVMDefTest
Tests run: 3, Failures: 0, Errors: 0, Skipped: 0, Time elapsed: 0.007 sec
Running com.cloud.hypervisor.kvm.storage.KVMStorageProcessorTest
Tests run: 2, Failures: 0, Errors: 0, Skipped: 0, Time elapsed: 0 sec

Results :

Tests in error: 
  LibvirtComputingResourceTest.testCreateVMFromSpecLegacy:82 » UnsupportedClassVersion
  LibvirtComputingResourceTest.testCreateVMFromSpecWithTopology6:154 » UnsupportedClassVersion
  LibvirtComputingResourceTest.testCreateVMFromSpecWithTopology4:224 » UnsupportedClassVersion
  LibvirtComputingResourceTest.testCreateVMFromSpec:298 » UnsupportedClassVersion
  LibvirtComputingResourceTest.testGetNicStats:355 » UnsupportedClassVersion com...
  LibvirtComputingResourceTest.testUUID:362 » UnsupportedClassVersion com/ceph/r...
  LibvirtComputingResourceTest.testGetVmStat:423 » UnsupportedClassVersion com/c...
  LibvirtVifDriverTest.setUp:51 » UnsupportedClassVersion com/ceph/rados/RadosEx...
  LibvirtVifDriverTest.setUp:51 » UnsupportedClassVersion com/ceph/rados/RadosEx...
  LibvirtVifDriverTest.setUp:51 » UnsupportedClassVersion com/ceph/rados/RadosEx...
  LibvirtVifDriverTest.setUp:51 » UnsupportedClassVersion com/ceph/rados/RadosEx...
  LibvirtVifDriverTest.setUp:51 » UnsupportedClassVersion com/ceph/rados/RadosEx...
  LibvirtVifDriverTest.setUp:51 » UnsupportedClassVersion com/ceph/rados/RadosEx...
  LibvirtVifDriverTest.setUp:51 » UnsupportedClassVersion com/ceph/rados/RadosEx...

Tests run: 19, Failures: 0, Errors: 14, Skipped: 0

[INFO] ------------------------------------------------------------------------
[INFO] Reactor Summary:
[INFO] 
[INFO] Apache CloudStack ................................. SUCCESS [1.887s]
[INFO] Apache CloudStack Maven Conventions Parent ........ SUCCESS [0.050s]
[INFO] Apache CloudStack Framework - Managed Context ..... SUCCESS [3.931s]
[INFO] Apache CloudStack Utils ........................... SUCCESS [9.711s]
[INFO] Apache CloudStack Framework ....................... SUCCESS [0.060s]
[INFO] Apache CloudStack Framework - Event Notification .. SUCCESS [5.254s]
[INFO] Apache CloudStack Framework - Configuration ....... SUCCESS [4.323s]
[INFO] Apache CloudStack API ............................. SUCCESS [10.833s]
[INFO] Apache CloudStack Framework - REST ................ SUCCESS [3.360s]
[INFO] Apache CloudStack Framework - IPC ................. SUCCESS [5.649s]
[INFO] Apache CloudStack Cloud Engine .................... SUCCESS [0.055s]
[INFO] Apache CloudStack Cloud Engine API ................ SUCCESS [4.740s]
[INFO] Apache CloudStack Core ............................ SUCCESS [7.250s]
[INFO] Apache CloudStack Agents .......................... SUCCESS [5.955s]
[INFO] Apache CloudStack Framework - Clustering .......... SUCCESS [3.175s]
[INFO] Apache CloudStack Framework - Jobs ................ SUCCESS [3.458s]
[INFO] Apache CloudStack Cloud Engine Schema Component ... SUCCESS [8.828s]
[INFO] Apache CloudStack Framework - Event Notification .. SUCCESS [2.433s]
[INFO] Apache CloudStack Cloud Engine Internal Components API  SUCCESS [4.123s]
[INFO] Apache CloudStack Server .......................... SUCCESS [32.942s]
[INFO] Apache CloudStack Usage Server .................... SUCCESS [5.935s]
[INFO] Apache XenSource XAPI ............................. SUCCESS [4.990s]
[INFO] Apache CloudStack Cloud Engine Orchestration Component  SUCCESS [7.161s]
[INFO] Apache CloudStack Cloud Services .................. SUCCESS [0.049s]
[INFO] Apache CloudStack Secondary Storage Service ....... SUCCESS [5.443s]
[INFO] Apache CloudStack Engine Storage Component ........ SUCCESS [7.041s]
[INFO] Apache CloudStack Engine Storage Volume Component . SUCCESS [5.283s]
[INFO] Apache CloudStack Engine Storage Image Component .. SUCCESS [4.000s]
[INFO] Apache CloudStack Engine Storage Data Motion Component  SUCCESS [3.435s]
[INFO] Apache CloudStack Engine Storage Cache Component .. SUCCESS [3.917s]
[INFO] Apache CloudStack Engine Storage Snapshot Component  SUCCESS [7.358s]
[INFO] Apache CloudStack Cloud Engine API ................ SUCCESS [3.331s]
[INFO] Apache CloudStack Cloud Engine Service ............ SUCCESS [5.847s]
[INFO] Apache CloudStack Plugin POM ...................... SUCCESS [0.900s]
[INFO] Apache CloudStack Plugin - API Rate Limit ......... SUCCESS [7.936s]
[INFO] Apache CloudStack Plugin - API Discovery .......... SUCCESS [6.109s]
[INFO] Apache CloudStack Plugin - ACL Static Role Based .. SUCCESS [3.543s]
[INFO] Apache CloudStack Plugin - Host Anti-Affinity Processor  SUCCESS [3.578s]
[INFO] Apache CloudStack Plugin - Explicit Dedication Processor  SUCCESS [3.736s]
[INFO] Apache CloudStack Plugin - User Concentrated Pod Deployment Planner  SUCCESS [3.688s]
[INFO] Apache CloudStack Plugin - User Dispersing Deployment Planner  SUCCESS [3.645s]
[INFO] Apache CloudStack Plugin - Implicit Dedication Planner  SUCCESS [8.910s]
[INFO] Apache CloudStack Plugin - Skip Heurestics Planner  SUCCESS [3.613s]
[INFO] Apache CloudStack Plugin - Host Allocator Random .. SUCCESS [3.165s]
[INFO] Apache CloudStack Plugin - Dedicated Resources .... SUCCESS [7.453s]
[INFO] Apache CloudStack Plugin - Hypervisor OracleVM .... SUCCESS [4.186s]
[INFO] Apache CloudStack Plugin - Open vSwitch ........... SUCCESS [4.133s]
[INFO] Apache CloudStack Plugin - Hypervisor Xen ......... SUCCESS [9.915s]
[INFO] Apache CloudStack Plugin - Hypervisor KVM ......... FAILURE [7.636s]
[INFO] Apache CloudStack Plugin - RabbitMQ Event Bus ..... SKIPPED
[INFO] Apache CloudStack Plugin - Hypervisor Baremetal ... SKIPPED
[INFO] Apache CloudStack Plugin - Hypervisor UCS ......... SKIPPED
[INFO] Apache CloudStack Plugin - Hypervisor Hyper-V ..... SKIPPED
[INFO] Apache CloudStack Plugin - Network Elastic Load Balancer  SKIPPED
[INFO] Apache CloudStack Plugin - Network Internal Load Balancer  SKIPPED
[INFO] Apache CloudStack Plugin - Network Juniper Contrail  SKIPPED
[INFO] Apache CloudStack Plugin - Palo Alto .............. SKIPPED
[INFO] Apache CloudStack Checkstyle Configuration ........ SKIPPED
[INFO] Apache CloudStack Plugin - Network Nicira NVP ..... SKIPPED
[INFO] Apache CloudStack Plugin - BigSwitch Virtual Network Segment  SKIPPED
[INFO] Apache CloudStack Plugin - Midokura Midonet ....... SKIPPED
[INFO] Apache Cloudstack Plugin - Stratosphere SSP ....... SKIPPED
[INFO] Apache CloudStack Plugin - Storage Allocator Random  SKIPPED
[INFO] Apache CloudStack Plugin - User Authenticator LDAP  SKIPPED
[INFO] Apache CloudStack Plugin - User Authenticator MD5 . SKIPPED
[INFO] Apache CloudStack Plugin - User Authenticator Plain Text  SKIPPED
[INFO] Apache CloudStack Plugin - User Authenticator SHA256 Salted  SKIPPED
[INFO] Apache CloudStack Plugin - Dns Notifier Example ... SKIPPED
[INFO] Apache CloudStack Plugin - Storage Image S3 ....... SKIPPED
[INFO] Apache CloudStack Plugin - Storage Image Swift provider  SKIPPED
[INFO] Apache CloudStack Plugin - Storage Image default provider  SKIPPED
[INFO] Apache CloudStack Plugin - Storage Image sample provider  SKIPPED
[INFO] Apache CloudStack Plugin - Storage Volume SolidFire Provider  SKIPPED
[INFO] Apache CloudStack Plugin - Storage Volume default provider  SKIPPED
[INFO] Apache CloudStack Plugin - Storage Volume sample provider  SKIPPED
[INFO] Apache CloudStack Plugin - SNMP Alerts ............ SKIPPED
[INFO] Apache CloudStack Plugin - Syslog Alerts .......... SKIPPED
[INFO] Apache CloudStack Plugin - Network VXLAN .......... SKIPPED
[INFO] Apache CloudStack Framework - Spring Life Cycle ... SKIPPED
[INFO] cloud-framework-spring-module ..................... SKIPPED
[INFO] Apache CloudStack Test ............................ SKIPPED
[INFO] Apache CloudStack Console Proxy - RDP Client ...... SKIPPED
[INFO] Apache CloudStack Console Proxy ................... SKIPPED
[INFO] Apache CloudStack Console Proxy - Server .......... SKIPPED
[INFO] Apache CloudStack System VM ....................... SKIPPED
[INFO] Apache CloudStack Client UI ....................... SKIPPED
[INFO] Apache CloudStack Framework - QuickCloud .......... SKIPPED
[INFO] ------------------------------------------------------------------------
[INFO] BUILD FAILURE
[INFO] ------------------------------------------------------------------------
[INFO] Total time: 4:25.579s
[INFO] Finished at: Thu Apr 17 03:08:34 CEST 2014
[INFO] Final Memory: 52M/303M
[INFO] ------------------------------------------------------------------------
[ERROR] Failed to execute goal org.apache.maven.plugins:maven-surefire-plugin:2.14:test (default-test)
on project cloud-plugin-hypervisor-kvm: There are test failures.
[ERROR] 
[ERROR] Please refer to <http://jenkins.buildacloud.org/job/cloudstack-4.3-maven-build-noredist/ws/plugins/hypervisors/kvm/target/surefire-reports>
for the individual test results.
[ERROR] -> [Help 1]
[ERROR] 
[ERROR] To see the full stack trace of the errors, re-run Maven with the -e switch.
[ERROR] Re-run Maven using the -X switch to enable full debug logging.
[ERROR] 
[ERROR] For more information about the errors and possible solutions, please read the following
articles:
[ERROR] [Help 1] http://cwiki.apache.org/confluence/display/MAVEN/MojoFailureException
[ERROR] 
[ERROR] After correcting the problems, you can resume the build with the command
[ERROR]   mvn <goals> -rf :cloud-plugin-hypervisor-kvm
Build step 'Invoke top-level Maven targets' marked build as failure
[FINDBUGS] Skipping publisher since build result is FAILURE
Archiving artifacts

Mime
View raw message