cloudstack-dev mailing list archives

Site index · List index
Message view « Date » · « Thread »
Top « Date » · « Thread »
From jenk...@cloudstack.org
Subject Build failed in Jenkins: build-master #503
Date Wed, 26 Mar 2014 11:20:13 GMT
See <http://jenkins.buildacloud.org/job/build-master/503/>

------------------------------------------
[...truncated 5295 lines...]
[ERROR] <http://jenkins.buildacloud.org/job/build-master/ws/awsapi/src/com/cloud/stack/CloudStackApi.java>:[271,36]
error: cannot find symbol
[ERROR] symbol:   class CloudStackCommand
[ERROR] location: class CloudStackApi
[ERROR] <http://jenkins.buildacloud.org/job/build-master/ws/awsapi/src/com/cloud/stack/CloudStackApi.java>:[292,8]
error: cannot find symbol
[ERROR] symbol:   class CloudStackCommand
[ERROR] location: class CloudStackApi
[ERROR] <http://jenkins.buildacloud.org/job/build-master/ws/awsapi/src/com/cloud/stack/CloudStackApi.java>:[292,36]
error: cannot find symbol
[ERROR] symbol:   class CloudStackCommand
[ERROR] location: class CloudStackApi
[ERROR] <http://jenkins.buildacloud.org/job/build-master/ws/awsapi/src/com/cloud/stack/CloudStackApi.java>:[334,8]
error: cannot find symbol
[ERROR] symbol:   class CloudStackCommand
[ERROR] location: class CloudStackApi
[ERROR] <http://jenkins.buildacloud.org/job/build-master/ws/awsapi/src/com/cloud/stack/CloudStackApi.java>:[334,36]
error: cannot find symbol
[ERROR] symbol:   class CloudStackCommand
[ERROR] location: class CloudStackApi
[ERROR] <http://jenkins.buildacloud.org/job/build-master/ws/awsapi/src/com/cloud/stack/CloudStackApi.java>:[384,8]
error: cannot find symbol
[ERROR] symbol:   class CloudStackCommand
[ERROR] location: class CloudStackApi
[ERROR] <http://jenkins.buildacloud.org/job/build-master/ws/awsapi/src/com/cloud/stack/CloudStackApi.java>:[384,36]
error: cannot find symbol
[ERROR] symbol:   class CloudStackCommand
[ERROR] location: class CloudStackApi
[ERROR] <http://jenkins.buildacloud.org/job/build-master/ws/awsapi/src/com/cloud/stack/CloudStackApi.java>:[411,8]
error: cannot find symbol
[ERROR] symbol:   class CloudStackCommand
[ERROR] location: class CloudStackApi
[ERROR] <http://jenkins.buildacloud.org/job/build-master/ws/awsapi/src/com/cloud/stack/CloudStackApi.java>:[411,36]
error: cannot find symbol
[ERROR] symbol:   class CloudStackCommand
[ERROR] location: class CloudStackApi
[ERROR] <http://jenkins.buildacloud.org/job/build-master/ws/awsapi/src/com/cloud/stack/CloudStackApi.java>:[459,8]
error: cannot find symbol
[ERROR] symbol:   class CloudStackCommand
[ERROR] location: class CloudStackApi
[ERROR] <http://jenkins.buildacloud.org/job/build-master/ws/awsapi/src/com/cloud/stack/CloudStackApi.java>:[459,36]
error: cannot find symbol
[ERROR] symbol:   class CloudStackCommand
[ERROR] location: class CloudStackApi
[ERROR] <http://jenkins.buildacloud.org/job/build-master/ws/awsapi/src/com/cloud/stack/CloudStackApi.java>:[506,8]
error: cannot find symbol
[ERROR] symbol:   class CloudStackCommand
[ERROR] location: class CloudStackApi
[ERROR] <http://jenkins.buildacloud.org/job/build-master/ws/awsapi/src/com/cloud/stack/CloudStackApi.java>:[506,36]
error: cannot find symbol
[ERROR] symbol:   class CloudStackCommand
[ERROR] location: class CloudStackApi
[ERROR] <http://jenkins.buildacloud.org/job/build-master/ws/awsapi/src/com/cloud/stack/CloudStackApi.java>:[535,8]
error: cannot find symbol
[ERROR] symbol:   class CloudStackCommand
[ERROR] location: class CloudStackApi
[ERROR] <http://jenkins.buildacloud.org/job/build-master/ws/awsapi/src/com/cloud/stack/CloudStackApi.java>:[535,36]
error: cannot find symbol
[ERROR] symbol:   class CloudStackCommand
[ERROR] location: class CloudStackApi
[ERROR] <http://jenkins.buildacloud.org/job/build-master/ws/awsapi/src/com/cloud/stack/CloudStackApi.java>:[553,8]
error: cannot find symbol
[ERROR] symbol:   class CloudStackCommand
[ERROR] location: class CloudStackApi
[ERROR] <http://jenkins.buildacloud.org/job/build-master/ws/awsapi/src/com/cloud/stack/CloudStackApi.java>:[553,36]
error: cannot find symbol
[ERROR] symbol:   class CloudStackCommand
[ERROR] location: class CloudStackApi
[ERROR] <http://jenkins.buildacloud.org/job/build-master/ws/awsapi/src/com/cloud/stack/CloudStackApi.java>:[578,8]
error: cannot find symbol
[ERROR] symbol:   class CloudStackCommand
[ERROR] location: class CloudStackApi
[ERROR] <http://jenkins.buildacloud.org/job/build-master/ws/awsapi/src/com/cloud/stack/CloudStackApi.java>:[578,36]
error: cannot find symbol
[ERROR] symbol:   class CloudStackCommand
[ERROR] location: class CloudStackApi
[ERROR] <http://jenkins.buildacloud.org/job/build-master/ws/awsapi/src/com/cloud/stack/CloudStackApi.java>:[616,8]
error: cannot find symbol
[ERROR] symbol:   class CloudStackCommand
[ERROR] location: class CloudStackApi
[ERROR] <http://jenkins.buildacloud.org/job/build-master/ws/awsapi/src/com/cloud/stack/CloudStackApi.java>:[616,36]
error: cannot find symbol
[ERROR] symbol:   class CloudStackCommand
[ERROR] location: class CloudStackApi
[ERROR] <http://jenkins.buildacloud.org/job/build-master/ws/awsapi/src/com/cloud/stack/CloudStackApi.java>:[643,8]
error: cannot find symbol
[ERROR] symbol:   class CloudStackCommand
[ERROR] location: class CloudStackApi
[ERROR] <http://jenkins.buildacloud.org/job/build-master/ws/awsapi/src/com/cloud/stack/CloudStackApi.java>:[643,36]
error: cannot find symbol
[ERROR] symbol:   class CloudStackCommand
[ERROR] location: class CloudStackApi
[ERROR] <http://jenkins.buildacloud.org/job/build-master/ws/awsapi/src/com/cloud/stack/CloudStackApi.java>:[666,8]
error: cannot find symbol
[ERROR] symbol:   class CloudStackCommand
[ERROR] location: class CloudStackApi
[ERROR] <http://jenkins.buildacloud.org/job/build-master/ws/awsapi/src/com/cloud/stack/CloudStackApi.java>:[666,36]
error: cannot find symbol
[ERROR] symbol:   class CloudStackCommand
[ERROR] location: class CloudStackApi
[ERROR] <http://jenkins.buildacloud.org/job/build-master/ws/awsapi/src/com/cloud/stack/CloudStackApi.java>:[687,8]
error: cannot find symbol
[ERROR] symbol:   class CloudStackCommand
[ERROR] location: class CloudStackApi
[ERROR] <http://jenkins.buildacloud.org/job/build-master/ws/awsapi/src/com/cloud/stack/CloudStackApi.java>:[687,36]
error: cannot find symbol
[ERROR] symbol:   class CloudStackCommand
[ERROR] location: class CloudStackApi
[ERROR] <http://jenkins.buildacloud.org/job/build-master/ws/awsapi/src/com/cloud/stack/CloudStackApi.java>:[703,8]
error: cannot find symbol
[ERROR] symbol:   class CloudStackCommand
[ERROR] location: class CloudStackApi
[ERROR] <http://jenkins.buildacloud.org/job/build-master/ws/awsapi/src/com/cloud/stack/CloudStackApi.java>:[703,36]
error: cannot find symbol
[ERROR] symbol:   class CloudStackCommand
[ERROR] location: class CloudStackApi
[ERROR] <http://jenkins.buildacloud.org/job/build-master/ws/awsapi/src/com/cloud/stack/CloudStackApi.java>:[729,8]
error: cannot find symbol
[ERROR] symbol:   class CloudStackCommand
[ERROR] location: class CloudStackApi
[ERROR] <http://jenkins.buildacloud.org/job/build-master/ws/awsapi/src/com/cloud/stack/CloudStackApi.java>:[729,36]
error: cannot find symbol
[ERROR] symbol:   class CloudStackCommand
[ERROR] location: class CloudStackApi
[ERROR] <http://jenkins.buildacloud.org/job/build-master/ws/awsapi/src/com/cloud/stack/CloudStackApi.java>:[777,8]
error: cannot find symbol
[ERROR] symbol:   class CloudStackCommand
[ERROR] location: class CloudStackApi
[ERROR] <http://jenkins.buildacloud.org/job/build-master/ws/awsapi/src/com/cloud/stack/CloudStackApi.java>:[777,36]
error: cannot find symbol
[ERROR] symbol:   class CloudStackCommand
[ERROR] location: class CloudStackApi
[ERROR] <http://jenkins.buildacloud.org/job/build-master/ws/awsapi/src/com/cloud/stack/CloudStackApi.java>:[816,8]
error: cannot find symbol
[ERROR] symbol:   class CloudStackCommand
[ERROR] location: class CloudStackApi
[ERROR] <http://jenkins.buildacloud.org/job/build-master/ws/awsapi/src/com/cloud/stack/CloudStackApi.java>:[816,36]
error: cannot find symbol
[ERROR] symbol:   class CloudStackCommand
[ERROR] location: class CloudStackApi
[ERROR] <http://jenkins.buildacloud.org/job/build-master/ws/awsapi/src/com/cloud/stack/CloudStackApi.java>:[844,8]
error: cannot find symbol
[ERROR] symbol:   class CloudStackCommand
[ERROR] location: class CloudStackApi
[ERROR] <http://jenkins.buildacloud.org/job/build-master/ws/awsapi/src/com/cloud/stack/CloudStackApi.java>:[844,36]
error: cannot find symbol
[ERROR] symbol:   class CloudStackCommand
[ERROR] location: class CloudStackApi
[ERROR] <http://jenkins.buildacloud.org/job/build-master/ws/awsapi/src/com/cloud/stack/CloudStackApi.java>:[862,8]
error: cannot find symbol
[ERROR] symbol:   class CloudStackCommand
[ERROR] location: class CloudStackApi
[ERROR] <http://jenkins.buildacloud.org/job/build-master/ws/awsapi/src/com/cloud/stack/CloudStackApi.java>:[862,36]
error: cannot find symbol
[ERROR] symbol:   class CloudStackCommand
[ERROR] location: class CloudStackApi
[ERROR] <http://jenkins.buildacloud.org/job/build-master/ws/awsapi/src/com/cloud/stack/CloudStackApi.java>:[885,8]
error: cannot find symbol
[ERROR] symbol:   class CloudStackCommand
[ERROR] location: class CloudStackApi
[ERROR] <http://jenkins.buildacloud.org/job/build-master/ws/awsapi/src/com/cloud/stack/CloudStackApi.java>:[885,36]
error: cannot find symbol
[ERROR] symbol:   class CloudStackCommand
[ERROR] location: class CloudStackApi
[ERROR] <http://jenkins.buildacloud.org/job/build-master/ws/awsapi/src/com/cloud/stack/CloudStackApi.java>:[911,8]
error: cannot find symbol
[ERROR] symbol:   class CloudStackCommand
[ERROR] location: class CloudStackApi
[ERROR] <http://jenkins.buildacloud.org/job/build-master/ws/awsapi/src/com/cloud/stack/CloudStackApi.java>:[911,36]
error: cannot find symbol
[ERROR] symbol:   class CloudStackCommand
[ERROR] location: class CloudStackApi
[ERROR] <http://jenkins.buildacloud.org/job/build-master/ws/awsapi/src/com/cloud/stack/CloudStackApi.java>:[935,8]
error: cannot find symbol
[ERROR] symbol:   class CloudStackCommand
[ERROR] location: class CloudStackApi
[ERROR] <http://jenkins.buildacloud.org/job/build-master/ws/awsapi/src/com/cloud/stack/CloudStackApi.java>:[935,36]
error: cannot find symbol
[ERROR] symbol:   class CloudStackCommand
[ERROR] location: class CloudStackApi
[ERROR] <http://jenkins.buildacloud.org/job/build-master/ws/awsapi/src/com/cloud/stack/CloudStackApi.java>:[957,8]
error: cannot find symbol
[ERROR] symbol:   class CloudStackCommand
[ERROR] location: class CloudStackApi
[ERROR] <http://jenkins.buildacloud.org/job/build-master/ws/awsapi/src/com/cloud/stack/CloudStackApi.java>:[957,36]
error: cannot find symbol
[ERROR] symbol:   class CloudStackCommand
[ERROR] location: class CloudStackApi
[ERROR] <http://jenkins.buildacloud.org/job/build-master/ws/awsapi/src/com/cloud/stack/CloudStackApi.java>:[977,8]
error: cannot find symbol
[ERROR] symbol:   class CloudStackCommand
[ERROR] location: class CloudStackApi
[ERROR] <http://jenkins.buildacloud.org/job/build-master/ws/awsapi/src/com/cloud/stack/CloudStackApi.java>:[977,36]
error: cannot find symbol
[ERROR] symbol:   class CloudStackCommand
[ERROR] location: class CloudStackApi
[ERROR] <http://jenkins.buildacloud.org/job/build-master/ws/awsapi/src/com/cloud/stack/CloudStackApi.java>:[1004,8]
error: cannot find symbol
[ERROR] symbol:   class CloudStackCommand
[ERROR] location: class CloudStackApi
[ERROR] <http://jenkins.buildacloud.org/job/build-master/ws/awsapi/src/com/cloud/stack/CloudStackApi.java>:[1004,36]
error: cannot find symbol
[ERROR] symbol:   class CloudStackCommand
[ERROR] location: class CloudStackApi
[ERROR] <http://jenkins.buildacloud.org/job/build-master/ws/awsapi/src/com/cloud/stack/CloudStackApi.java>:[1031,8]
error: cannot find symbol
[ERROR] symbol:   class CloudStackCommand
[ERROR] location: class CloudStackApi
[ERROR] <http://jenkins.buildacloud.org/job/build-master/ws/awsapi/src/com/cloud/stack/CloudStackApi.java>:[1031,36]
error: cannot find symbol
[ERROR] symbol:   class CloudStackCommand
[ERROR] location: class CloudStackApi
[ERROR] <http://jenkins.buildacloud.org/job/build-master/ws/awsapi/src/com/cloud/stack/CloudStackApi.java>:[1056,8]
error: cannot find symbol
[ERROR] symbol:   class CloudStackCommand
[ERROR] location: class CloudStackApi
[ERROR] <http://jenkins.buildacloud.org/job/build-master/ws/awsapi/src/com/cloud/stack/CloudStackApi.java>:[1056,36]
error: cannot find symbol
[ERROR] symbol:   class CloudStackCommand
[ERROR] location: class CloudStackApi
[ERROR] <http://jenkins.buildacloud.org/job/build-master/ws/awsapi/src/com/cloud/stack/CloudStackApi.java>:[1098,8]
error: cannot find symbol
[ERROR] symbol:   class CloudStackCommand
[ERROR] location: class CloudStackApi
[ERROR] <http://jenkins.buildacloud.org/job/build-master/ws/awsapi/src/com/cloud/stack/CloudStackApi.java>:[1098,36]
error: cannot find symbol
[ERROR] symbol:   class CloudStackCommand
[ERROR] location: class CloudStackApi
[ERROR] <http://jenkins.buildacloud.org/job/build-master/ws/awsapi/src/com/cloud/stack/CloudStackApi.java>:[1121,8]
error: cannot find symbol
[ERROR] symbol:   class CloudStackCommand
[ERROR] location: class CloudStackApi
[ERROR] <http://jenkins.buildacloud.org/job/build-master/ws/awsapi/src/com/cloud/stack/CloudStackApi.java>:[1121,36]
error: cannot find symbol
[ERROR] symbol:   class CloudStackCommand
[ERROR] location: class CloudStackApi
[ERROR] <http://jenkins.buildacloud.org/job/build-master/ws/awsapi/src/com/cloud/stack/CloudStackApi.java>:[1137,8]
error: cannot find symbol
[ERROR] symbol:   class CloudStackCommand
[ERROR] location: class CloudStackApi
[ERROR] <http://jenkins.buildacloud.org/job/build-master/ws/awsapi/src/com/cloud/stack/CloudStackApi.java>:[1137,36]
error: cannot find symbol
[ERROR] symbol:   class CloudStackCommand
[ERROR] location: class CloudStackApi
[ERROR] <http://jenkins.buildacloud.org/job/build-master/ws/awsapi/src/com/cloud/stack/CloudStackApi.java>:[1143,8]
error: cannot find symbol
[ERROR] symbol:   class CloudStackCommand
[ERROR] location: class CloudStackApi
[ERROR] <http://jenkins.buildacloud.org/job/build-master/ws/awsapi/src/com/cloud/stack/CloudStackApi.java>:[1143,36]
error: cannot find symbol
[ERROR] symbol:   class CloudStackCommand
[ERROR] location: class CloudStackApi
[ERROR] <http://jenkins.buildacloud.org/job/build-master/ws/awsapi/src/com/cloud/stack/CloudStackApi.java>:[1195,8]
error: cannot find symbol
[ERROR] symbol:   class CloudStackCommand
[ERROR] location: class CloudStackApi
[ERROR] <http://jenkins.buildacloud.org/job/build-master/ws/awsapi/src/com/cloud/stack/CloudStackApi.java>:[1195,36]
error: cannot find symbol
[ERROR] symbol:   class CloudStackCommand
[ERROR] location: class CloudStackApi
[ERROR] <http://jenkins.buildacloud.org/job/build-master/ws/awsapi/src/com/cloud/stack/CloudStackApi.java>:[1220,8]
error: cannot find symbol
[ERROR] symbol:   class CloudStackCommand
[ERROR] location: class CloudStackApi
[ERROR] <http://jenkins.buildacloud.org/job/build-master/ws/awsapi/src/com/cloud/stack/CloudStackApi.java>:[1220,36]
error: cannot find symbol
[ERROR] symbol:   class CloudStackCommand
[ERROR] location: class CloudStackApi
[ERROR] <http://jenkins.buildacloud.org/job/build-master/ws/awsapi/src/com/cloud/stack/CloudStackApi.java>:[1253,8]
error: cannot find symbol
[ERROR] symbol:   class CloudStackCommand
[ERROR] location: class CloudStackApi
[ERROR] <http://jenkins.buildacloud.org/job/build-master/ws/awsapi/src/com/cloud/stack/CloudStackApi.java>:[1253,36]
error: cannot find symbol
[ERROR] symbol:   class CloudStackCommand
[ERROR] location: class CloudStackApi
[ERROR] <http://jenkins.buildacloud.org/job/build-master/ws/awsapi/src/com/cloud/stack/CloudStackApi.java>:[1296,8]
error: cannot find symbol
[ERROR] symbol:   class CloudStackCommand
[ERROR] location: class CloudStackApi
[ERROR] <http://jenkins.buildacloud.org/job/build-master/ws/awsapi/src/com/cloud/stack/CloudStackApi.java>:[1296,36]
error: cannot find symbol
[ERROR] symbol:   class CloudStackCommand
[ERROR] location: class CloudStackApi
[ERROR] <http://jenkins.buildacloud.org/job/build-master/ws/awsapi/src/com/cloud/stack/CloudStackApi.java>:[1316,8]
error: cannot find symbol
[ERROR] symbol:   class CloudStackCommand
[ERROR] location: class CloudStackApi
[ERROR] <http://jenkins.buildacloud.org/job/build-master/ws/awsapi/src/com/cloud/stack/CloudStackApi.java>:[1316,36]
error: cannot find symbol
[ERROR] symbol:   class CloudStackCommand
[ERROR] location: class CloudStackApi
[ERROR] <http://jenkins.buildacloud.org/job/build-master/ws/awsapi/src/com/cloud/stack/CloudStackApi.java>:[1355,8]
error: cannot find symbol
[ERROR] symbol:   class CloudStackCommand
[ERROR] location: class CloudStackApi
[ERROR] <http://jenkins.buildacloud.org/job/build-master/ws/awsapi/src/com/cloud/stack/CloudStackApi.java>:[1355,36]
error: cannot find symbol
[ERROR] symbol:   class CloudStackCommand
[ERROR] location: class CloudStackApi
[ERROR] <http://jenkins.buildacloud.org/job/build-master/ws/awsapi/src/com/cloud/stack/CloudStackApi.java>:[1390,8]
error: cannot find symbol
[ERROR] symbol:   class CloudStackCommand
[ERROR] location: class CloudStackApi
[ERROR] <http://jenkins.buildacloud.org/job/build-master/ws/awsapi/src/com/cloud/stack/CloudStackApi.java>:[1390,36]
error: cannot find symbol
[ERROR] symbol:   class CloudStackCommand
[ERROR] location: class CloudStackApi
[ERROR] <http://jenkins.buildacloud.org/job/build-master/ws/awsapi/src/com/cloud/stack/CloudStackApi.java>:[1415,8]
error: cannot find symbol
[ERROR] symbol:   class CloudStackCommand
[ERROR] location: class CloudStackApi
[ERROR] <http://jenkins.buildacloud.org/job/build-master/ws/awsapi/src/com/cloud/stack/CloudStackApi.java>:[1415,36]
error: cannot find symbol
[ERROR] symbol:   class CloudStackCommand
[ERROR] location: class CloudStackApi
[ERROR] <http://jenkins.buildacloud.org/job/build-master/ws/awsapi/src/com/cloud/stack/CloudStackApi.java>:[1450,8]
error: cannot find symbol
[ERROR] -> [Help 1]
[ERROR] 
[ERROR] To see the full stack trace of the errors, re-run Maven with the -e switch.
[ERROR] Re-run Maven using the -X switch to enable full debug logging.
[ERROR] 
[ERROR] For more information about the errors and possible solutions, please read the following
articles:
[ERROR] [Help 1] http://cwiki.apache.org/confluence/display/MAVEN/MojoFailureException
[ERROR] 
[ERROR] After correcting the problems, you can resume the build with the command
[ERROR]   mvn <goals> -rf :cloud-awsapi
Build step 'Invoke top-level Maven targets' marked build as failure

Mime
View raw message