cloudstack-dev mailing list archives

Site index · List index
Message view « Date » · « Thread »
Top « Date » · « Thread »
From jenk...@cloudstack.org
Subject Build failed in Jenkins: cloudstack-4.3-forward-maven-build #150
Date Tue, 18 Mar 2014 04:32:31 GMT
See <http://jenkins.buildacloud.org/job/cloudstack-4.3-forward-maven-build/150/>

------------------------------------------
Started by an SCM change
[EnvInject] - Loading node environment variables.
Building remotely on cloudstack-buildslave-centos6-609 in workspace <http://jenkins.buildacloud.org/job/cloudstack-4.3-forward-maven-build/ws/>
Cloning the remote Git repository
Cloning repository https://git-wip-us.apache.org/repos/asf/cloudstack.git
Fetching upstream changes from https://git-wip-us.apache.org/repos/asf/cloudstack.git
ERROR: Timeout after 400 minutes
ERROR: Error cloning remote repo 'origin'
hudson.plugins.git.GitException: Command "git fetch --tags --progress https://git-wip-us.apache.org/repos/asf/cloudstack.git
+refs/heads/*:refs/remotes/origin/*" returned status code 128:
stdout: 
stderr: error: RPC failed; result=22, HTTP code = 502
error: fetch-pack died of signal 15

	at org.jenkinsci.plugins.gitclient.CliGitAPIImpl.launchCommandIn(CliGitAPIImpl.java:1086)
	at org.jenkinsci.plugins.gitclient.CliGitAPIImpl.launchCommandWithCredentials(CliGitAPIImpl.java:968)
	at org.jenkinsci.plugins.gitclient.CliGitAPIImpl.access$200(CliGitAPIImpl.java:71)
	at org.jenkinsci.plugins.gitclient.CliGitAPIImpl$1.execute(CliGitAPIImpl.java:197)
	at org.jenkinsci.plugins.gitclient.CliGitAPIImpl$2.execute(CliGitAPIImpl.java:329)
	at org.jenkinsci.plugins.gitclient.RemoteGitImpl$CommandInvocationHandler$1.call(RemoteGitImpl.java:152)
	at org.jenkinsci.plugins.gitclient.RemoteGitImpl$CommandInvocationHandler$1.call(RemoteGitImpl.java:145)
	at hudson.remoting.UserRequest.perform(UserRequest.java:118)
	at hudson.remoting.UserRequest.perform(UserRequest.java:48)
	at hudson.remoting.Request$2.run(Request.java:328)
	at hudson.remoting.InterceptingExecutorService$1.call(InterceptingExecutorService.java:72)
	at java.util.concurrent.FutureTask$Sync.innerRun(FutureTask.java:334)
	at java.util.concurrent.FutureTask.run(FutureTask.java:166)
	at java.util.concurrent.ThreadPoolExecutor.runWorker(ThreadPoolExecutor.java:1146)
	at java.util.concurrent.ThreadPoolExecutor$Worker.run(ThreadPoolExecutor.java:615)
	at java.lang.Thread.run(Thread.java:701)
ERROR: null
[FINDBUGS] Skipping publisher since build result is FAILURE

Mime
View raw message