cloudstack-dev mailing list archives

Site index · List index
Message view « Date » · « Thread »
Top « Date » · « Thread »
From jenk...@cloudstack.org
Subject Build failed in Jenkins: cloudstack-4.3-maven-build #446
Date Wed, 22 Jan 2014 03:02:34 GMT
See <http://jenkins.buildacloud.org/job/cloudstack-4.3-maven-build/446/changes>

Changes:

[anthony.xu] CLOUDSTACK-5923: CS doesn't do master switch for XS any more, CS will depend
on XS HA to do master switch, XS HA needs to be enabled.

[Alena Prokharchyk] Changed "authenticate" method to return both - result of authentication,
and action to perform when authentication failed - to the accountManagerImpl. Only if authenicators
request INCREMENT_INCORRECT_LOGIN_ATTEMPT_COUNT, the incorrect_login_attempts parameter will
be increased

------------------------------------------
[...truncated 2841 lines...]
[INFO] 
[INFO] --- maven-surefire-plugin:2.12:test (default-test) @ cloud-plugin-user-authenticator-ldap
---
[INFO] Surefire report directory: <http://jenkins.buildacloud.org/job/cloudstack-4.3-maven-build/ws/plugins/user-authenticators/ldap/target/surefire-reports>

-------------------------------------------------------
 T E S T S
-------------------------------------------------------

Results :

Tests run: 0, Failures: 0, Errors: 0, Skipped: 0

[INFO]                                                                         
[INFO] ------------------------------------------------------------------------
[INFO] Building Apache CloudStack Plugin - User Authenticator MD5 4.3.0
[INFO] ------------------------------------------------------------------------
[INFO] 
[INFO] --- maven-clean-plugin:2.5:clean (default-clean) @ cloud-plugin-user-authenticator-md5
---
[INFO] Deleting <http://jenkins.buildacloud.org/job/cloudstack-4.3-maven-build/ws/plugins/user-authenticators/md5/target>
(includes = [**/*], excludes = [])
[INFO] Deleting <http://jenkins.buildacloud.org/job/cloudstack-4.3-maven-build/ws/plugins/user-authenticators/md5>
(includes = [target, dist], excludes = [])
[INFO] 
[INFO] --- maven-remote-resources-plugin:1.3:process (default) @ cloud-plugin-user-authenticator-md5
---
[INFO] 
[INFO] --- maven-resources-plugin:2.5:resources (default-resources) @ cloud-plugin-user-authenticator-md5
---
[debug] execute contextualize
[INFO] Using 'UTF-8' encoding to copy filtered resources.
[INFO] Copying 2 resources
[INFO] Copying 3 resources
[INFO] 
[INFO] --- maven-compiler-plugin:2.5.1:compile (default-compile) @ cloud-plugin-user-authenticator-md5
---
[INFO] Compiling 1 source file to <http://jenkins.buildacloud.org/job/cloudstack-4.3-maven-build/ws/plugins/user-authenticators/md5/target/classes>
[INFO] 
[INFO] --- maven-resources-plugin:2.5:testResources (default-testResources) @ cloud-plugin-user-authenticator-md5
---
[debug] execute contextualize
[INFO] Using 'UTF-8' encoding to copy filtered resources.
[INFO] skip non existing resourceDirectory <http://jenkins.buildacloud.org/job/cloudstack-4.3-maven-build/ws/plugins/user-authenticators/md5/test/resources>
[INFO] Copying 3 resources
[INFO] 
[INFO] --- maven-compiler-plugin:2.5.1:testCompile (default-testCompile) @ cloud-plugin-user-authenticator-md5
---
[INFO] No sources to compile
[INFO] 
[INFO] --- maven-surefire-plugin:2.12:test (default-test) @ cloud-plugin-user-authenticator-md5
---
[INFO] Surefire report directory: <http://jenkins.buildacloud.org/job/cloudstack-4.3-maven-build/ws/plugins/user-authenticators/md5/target/surefire-reports>

-------------------------------------------------------
 T E S T S
-------------------------------------------------------

Results :

Tests run: 0, Failures: 0, Errors: 0, Skipped: 0

[INFO]                                                                         
[INFO] ------------------------------------------------------------------------
[INFO] Building Apache CloudStack Plugin - User Authenticator Plain Text 4.3.0
[INFO] ------------------------------------------------------------------------
[INFO] 
[INFO] --- maven-clean-plugin:2.5:clean (default-clean) @ cloud-plugin-user-authenticator-plaintext
---
[INFO] Deleting <http://jenkins.buildacloud.org/job/cloudstack-4.3-maven-build/ws/plugins/user-authenticators/plain-text/target>
(includes = [**/*], excludes = [])
[INFO] Deleting <http://jenkins.buildacloud.org/job/cloudstack-4.3-maven-build/ws/plugins/user-authenticators/plain-text>
(includes = [target, dist], excludes = [])
[INFO] 
[INFO] --- maven-remote-resources-plugin:1.3:process (default) @ cloud-plugin-user-authenticator-plaintext
---
[INFO] 
[INFO] --- maven-resources-plugin:2.5:resources (default-resources) @ cloud-plugin-user-authenticator-plaintext
---
[debug] execute contextualize
[INFO] Using 'UTF-8' encoding to copy filtered resources.
[INFO] Copying 2 resources
[INFO] Copying 3 resources
[INFO] 
[INFO] --- maven-compiler-plugin:2.5.1:compile (default-compile) @ cloud-plugin-user-authenticator-plaintext
---
[INFO] Compiling 1 source file to <http://jenkins.buildacloud.org/job/cloudstack-4.3-maven-build/ws/plugins/user-authenticators/plain-text/target/classes>
[INFO] 
[INFO] --- maven-resources-plugin:2.5:testResources (default-testResources) @ cloud-plugin-user-authenticator-plaintext
---
[debug] execute contextualize
[INFO] Using 'UTF-8' encoding to copy filtered resources.
[INFO] skip non existing resourceDirectory <http://jenkins.buildacloud.org/job/cloudstack-4.3-maven-build/ws/plugins/user-authenticators/plain-text/test/resources>
[INFO] Copying 3 resources
[INFO] 
[INFO] --- maven-compiler-plugin:2.5.1:testCompile (default-testCompile) @ cloud-plugin-user-authenticator-plaintext
---
[INFO] No sources to compile
[INFO] 
[INFO] --- maven-surefire-plugin:2.12:test (default-test) @ cloud-plugin-user-authenticator-plaintext
---
[INFO] Surefire report directory: <http://jenkins.buildacloud.org/job/cloudstack-4.3-maven-build/ws/plugins/user-authenticators/plain-text/target/surefire-reports>

-------------------------------------------------------
 T E S T S
-------------------------------------------------------

Results :

Tests run: 0, Failures: 0, Errors: 0, Skipped: 0

[INFO]                                                                         
[INFO] ------------------------------------------------------------------------
[INFO] Building Apache CloudStack Plugin - User Authenticator SHA256 Salted 4.3.0
[INFO] ------------------------------------------------------------------------
[INFO] 
[INFO] --- maven-clean-plugin:2.5:clean (default-clean) @ cloud-plugin-user-authenticator-sha256salted
---
[INFO] Deleting <http://jenkins.buildacloud.org/job/cloudstack-4.3-maven-build/ws/plugins/user-authenticators/sha256salted/target>
(includes = [**/*], excludes = [])
[INFO] Deleting <http://jenkins.buildacloud.org/job/cloudstack-4.3-maven-build/ws/plugins/user-authenticators/sha256salted>
(includes = [target, dist], excludes = [])
[INFO] 
[INFO] --- maven-remote-resources-plugin:1.3:process (default) @ cloud-plugin-user-authenticator-sha256salted
---
[INFO] 
[INFO] --- maven-resources-plugin:2.5:resources (default-resources) @ cloud-plugin-user-authenticator-sha256salted
---
[debug] execute contextualize
[INFO] Using 'UTF-8' encoding to copy filtered resources.
[INFO] Copying 2 resources
[INFO] Copying 3 resources
[INFO] 
[INFO] --- maven-compiler-plugin:2.5.1:compile (default-compile) @ cloud-plugin-user-authenticator-sha256salted
---
[INFO] Compiling 1 source file to <http://jenkins.buildacloud.org/job/cloudstack-4.3-maven-build/ws/plugins/user-authenticators/sha256salted/target/classes>
[INFO] 
[INFO] --- maven-resources-plugin:2.5:testResources (default-testResources) @ cloud-plugin-user-authenticator-sha256salted
---
[debug] execute contextualize
[INFO] Using 'UTF-8' encoding to copy filtered resources.
[INFO] skip non existing resourceDirectory <http://jenkins.buildacloud.org/job/cloudstack-4.3-maven-build/ws/plugins/user-authenticators/sha256salted/test/resources>
[INFO] Copying 3 resources
[INFO] 
[INFO] --- maven-compiler-plugin:2.5.1:testCompile (default-testCompile) @ cloud-plugin-user-authenticator-sha256salted
---
[INFO] Compiling 1 source file to <http://jenkins.buildacloud.org/job/cloudstack-4.3-maven-build/ws/plugins/user-authenticators/sha256salted/target/test-classes>
[INFO] 
[INFO] --- maven-surefire-plugin:2.12:test (default-test) @ cloud-plugin-user-authenticator-sha256salted
---
[INFO] Surefire report directory: <http://jenkins.buildacloud.org/job/cloudstack-4.3-maven-build/ws/plugins/user-authenticators/sha256salted/target/surefire-reports>

-------------------------------------------------------
 T E S T S
-------------------------------------------------------
Running src.com.cloud.server.auth.test.AuthenticatorTest
log4j:WARN No appenders could be found for logger (com.cloud.server.auth.SHA256SaltedUserAuthenticator).
log4j:WARN Please initialize the log4j system properly.
log4j:WARN See http://logging.apache.org/log4j/1.2/faq.html#noconfig for more info.
Tests run: 2, Failures: 1, Errors: 0, Skipped: 0, Time elapsed: 0.936 sec <<< FAILURE!

Results :

Failed tests:   testAuthentication(src.com.cloud.server.auth.test.AuthenticatorTest): 32 byte
salt authenticated expected:<true> but was:<P[true:null]>

Tests run: 2, Failures: 1, Errors: 0, Skipped: 0

[INFO] ------------------------------------------------------------------------
[INFO] Reactor Summary:
[INFO] 
[INFO] Apache CloudStack ................................. SUCCESS [2.218s]
[INFO] Apache CloudStack Maven Conventions Parent ........ SUCCESS [0.085s]
[INFO] Apache CloudStack Framework - Managed Context ..... SUCCESS [3.560s]
[INFO] Apache CloudStack Utils ........................... SUCCESS [11.629s]
[INFO] Apache CloudStack Framework ....................... SUCCESS [0.036s]
[INFO] Apache CloudStack Framework - Event Notification .. SUCCESS [6.276s]
[INFO] Apache CloudStack Framework - Configuration ....... SUCCESS [4.639s]
[INFO] Apache CloudStack API ............................. SUCCESS [13.110s]
[INFO] Apache CloudStack Framework - REST ................ SUCCESS [3.602s]
[INFO] Apache CloudStack Framework - IPC ................. SUCCESS [6.670s]
[INFO] Apache CloudStack Cloud Engine .................... SUCCESS [0.025s]
[INFO] Apache CloudStack Cloud Engine API ................ SUCCESS [5.138s]
[INFO] Apache CloudStack Core ............................ SUCCESS [8.594s]
[INFO] Apache CloudStack Agents .......................... SUCCESS [5.972s]
[INFO] Apache CloudStack Framework - Clustering .......... SUCCESS [3.503s]
[INFO] Apache CloudStack Framework - Jobs ................ SUCCESS [3.747s]
[INFO] Apache CloudStack Cloud Engine Schema Component ... SUCCESS [10.816s]
[INFO] Apache CloudStack Framework - Event Notification .. SUCCESS [1.795s]
[INFO] Apache CloudStack Cloud Engine Internal Components API  SUCCESS [3.186s]
[INFO] Apache CloudStack Server .......................... SUCCESS [45.028s]
[INFO] Apache CloudStack Usage Server .................... SUCCESS [6.727s]
[INFO] Apache XenSource XAPI ............................. SUCCESS [6.111s]
[INFO] Apache CloudStack Cloud Engine Orchestration Component  SUCCESS [9.218s]
[INFO] Apache CloudStack Cloud Services .................. SUCCESS [0.023s]
[INFO] Apache CloudStack Secondary Storage Service ....... SUCCESS [6.223s]
[INFO] Apache CloudStack Engine Storage Component ........ SUCCESS [7.027s]
[INFO] Apache CloudStack Engine Storage Volume Component . SUCCESS [4.649s]
[INFO] Apache CloudStack Engine Storage Image Component .. SUCCESS [2.852s]
[INFO] Apache CloudStack Engine Storage Data Motion Component  SUCCESS [3.373s]
[INFO] Apache CloudStack Engine Storage Cache Component .. SUCCESS [3.312s]
[INFO] Apache CloudStack Engine Storage Snapshot Component  SUCCESS [7.586s]
[INFO] Apache CloudStack Cloud Engine API ................ SUCCESS [2.713s]
[INFO] Apache CloudStack Cloud Engine Service ............ SUCCESS [1.046s]
[INFO] Apache CloudStack Plugin POM ...................... SUCCESS [0.650s]
[INFO] Apache CloudStack Plugin - API Rate Limit ......... SUCCESS [7.179s]
[INFO] Apache CloudStack Plugin - API Discovery .......... SUCCESS [4.630s]
[INFO] Apache CloudStack Plugin - ACL Static Role Based .. SUCCESS [2.763s]
[INFO] Apache CloudStack Plugin - Host Anti-Affinity Processor  SUCCESS [2.385s]
[INFO] Apache CloudStack Plugin - Explicit Dedication Processor  SUCCESS [2.632s]
[INFO] Apache CloudStack Plugin - User Concentrated Pod Deployment Planner  SUCCESS [2.664s]
[INFO] Apache CloudStack Plugin - User Dispersing Deployment Planner  SUCCESS [2.623s]
[INFO] Apache CloudStack Plugin - Implicit Dedication Planner  SUCCESS [8.131s]
[INFO] Apache CloudStack Plugin - Skip Heurestics Planner  SUCCESS [2.162s]
[INFO] Apache CloudStack Plugin - Host Allocator Random .. SUCCESS [2.635s]
[INFO] Apache CloudStack Plugin - Dedicated Resources .... SUCCESS [7.343s]
[INFO] Apache CloudStack Plugin - Hypervisor OracleVM .... SUCCESS [3.400s]
[INFO] Apache CloudStack Plugin - Open vSwitch ........... SUCCESS [3.081s]
[INFO] Apache CloudStack Plugin - Hypervisor Xen ......... SUCCESS [10.429s]
[INFO] Apache CloudStack Plugin - Hypervisor KVM ......... SUCCESS [9.970s]
[INFO] Apache CloudStack Plugin - RabbitMQ Event Bus ..... SUCCESS [2.447s]
[INFO] Apache CloudStack Plugin - Hypervisor Baremetal ... SUCCESS [4.311s]
[INFO] Apache CloudStack Plugin - Hypervisor UCS ......... SUCCESS [3.085s]
[INFO] Apache CloudStack Plugin - Hypervisor Hyper-V ..... SUCCESS [6.440s]
[INFO] Apache CloudStack Plugin - Network Elastic Load Balancer  SUCCESS [3.133s]
[INFO] Apache CloudStack Plugin - Network Internal Load Balancer  SUCCESS [10.909s]
[INFO] Apache CloudStack Plugin - Network Juniper Contrail  SUCCESS [9.563s]
[INFO] Apache CloudStack Plugin - Palo Alto .............. SUCCESS [8.056s]
[INFO] Apache CloudStack Checkstyle Configuration ........ SUCCESS [0.240s]
[INFO] Apache CloudStack Plugin - Network Nicira NVP ..... SUCCESS [12.308s]
[INFO] Apache CloudStack Plugin - BigSwitch Virtual Network Segment  SUCCESS [6.726s]
[INFO] Apache CloudStack Plugin - Midokura Midonet ....... SUCCESS [7.422s]
[INFO] Apache Cloudstack Plugin - Stratosphere SSP ....... SUCCESS [7.825s]
[INFO] Apache CloudStack Plugin - Storage Allocator Random  SUCCESS [2.847s]
[INFO] Apache CloudStack Plugin - User Authenticator LDAP  SUCCESS [4.153s]
[INFO] Apache CloudStack Plugin - User Authenticator MD5 . SUCCESS [2.137s]
[INFO] Apache CloudStack Plugin - User Authenticator Plain Text  SUCCESS [3.873s]
[INFO] Apache CloudStack Plugin - User Authenticator SHA256 Salted  FAILURE [6.345s]
[INFO] Apache CloudStack Plugin - Dns Notifier Example ... SKIPPED
[INFO] Apache CloudStack Plugin - Storage Image S3 ....... SKIPPED
[INFO] Apache CloudStack Plugin - Storage Image Swift provider  SKIPPED
[INFO] Apache CloudStack Plugin - Storage Image default provider  SKIPPED
[INFO] Apache CloudStack Plugin - Storage Image sample provider  SKIPPED
[INFO] Apache CloudStack Plugin - Storage Volume SolidFire Provider  SKIPPED
[INFO] Apache CloudStack Plugin - Storage Volume default provider  SKIPPED
[INFO] Apache CloudStack Plugin - Storage Volume sample provider  SKIPPED
[INFO] Apache CloudStack Plugin - SNMP Alerts ............ SKIPPED
[INFO] Apache CloudStack Plugin - Syslog Alerts .......... SKIPPED
[INFO] Apache CloudStack Plugin - Network VXLAN .......... SKIPPED
[INFO] Apache CloudStack Framework - Spring Life Cycle ... SKIPPED
[INFO] cloud-framework-spring-module ..................... SKIPPED
[INFO] Apache CloudStack Test ............................ SKIPPED
[INFO] Apache CloudStack Client UI ....................... SKIPPED
[INFO] Apache CloudStack Console Proxy - RDP Client ...... SKIPPED
[INFO] Apache CloudStack Console Proxy ................... SKIPPED
[INFO] Apache CloudStack Console Proxy - Server .......... SKIPPED
[INFO] Apache CloudStack Framework - QuickCloud .......... SKIPPED
[INFO] ------------------------------------------------------------------------
[INFO] BUILD FAILURE
[INFO] ------------------------------------------------------------------------
[INFO] Total time: 6:18.108s
[INFO] Finished at: Tue Jan 21 21:57:26 EST 2014
[INFO] Final Memory: 55M/234M
[INFO] ------------------------------------------------------------------------
[ERROR] Failed to execute goal org.apache.maven.plugins:maven-surefire-plugin:2.12:test (default-test)
on project cloud-plugin-user-authenticator-sha256salted: There are test failures.
[ERROR] 
[ERROR] Please refer to <http://jenkins.buildacloud.org/job/cloudstack-4.3-maven-build/ws/plugins/user-authenticators/sha256salted/target/surefire-reports>
for the individual test results.
[ERROR] -> [Help 1]
[ERROR] 
[ERROR] To see the full stack trace of the errors, re-run Maven with the -e switch.
[ERROR] Re-run Maven using the -X switch to enable full debug logging.
[ERROR] 
[ERROR] For more information about the errors and possible solutions, please read the following
articles:
[ERROR] [Help 1] http://cwiki.apache.org/confluence/display/MAVEN/MojoFailureException
[ERROR] 
[ERROR] After correcting the problems, you can resume the build with the command
[ERROR]   mvn <goals> -rf :cloud-plugin-user-authenticator-sha256salted
Build step 'Invoke top-level Maven targets' marked build as failure

Mime
View raw message