cloudstack-dev mailing list archives

Site index · List index
Message view « Date » · « Thread »
Top « Date » · « Thread »
From jenk...@cloudstack.org
Subject Build failed in Jenkins: cloudstack-4.3-maven-build #447
Date Wed, 22 Jan 2014 04:02:06 GMT
See <http://jenkins.buildacloud.org/job/cloudstack-4.3-maven-build/447/changes>

Changes:

[animesh] Pom.xml script updater erroneously removed SNAPSOT from XAPI dependency causing
build failure

------------------------------------------
[...truncated 2841 lines...]
[INFO] 
[INFO] --- maven-surefire-plugin:2.12:test (default-test) @ cloud-plugin-user-authenticator-ldap
---
[INFO] Surefire report directory: <http://jenkins.buildacloud.org/job/cloudstack-4.3-maven-build/ws/plugins/user-authenticators/ldap/target/surefire-reports>

-------------------------------------------------------
 T E S T S
-------------------------------------------------------

Results :

Tests run: 0, Failures: 0, Errors: 0, Skipped: 0

[INFO]                                                                         
[INFO] ------------------------------------------------------------------------
[INFO] Building Apache CloudStack Plugin - User Authenticator MD5 4.3.0
[INFO] ------------------------------------------------------------------------
[INFO] 
[INFO] --- maven-clean-plugin:2.5:clean (default-clean) @ cloud-plugin-user-authenticator-md5
---
[INFO] Deleting <http://jenkins.buildacloud.org/job/cloudstack-4.3-maven-build/ws/plugins/user-authenticators/md5/target>
(includes = [**/*], excludes = [])
[INFO] Deleting <http://jenkins.buildacloud.org/job/cloudstack-4.3-maven-build/ws/plugins/user-authenticators/md5>
(includes = [target, dist], excludes = [])
[INFO] 
[INFO] --- maven-remote-resources-plugin:1.3:process (default) @ cloud-plugin-user-authenticator-md5
---
[INFO] 
[INFO] --- maven-resources-plugin:2.5:resources (default-resources) @ cloud-plugin-user-authenticator-md5
---
[debug] execute contextualize
[INFO] Using 'UTF-8' encoding to copy filtered resources.
[INFO] Copying 2 resources
[INFO] Copying 3 resources
[INFO] 
[INFO] --- maven-compiler-plugin:2.5.1:compile (default-compile) @ cloud-plugin-user-authenticator-md5
---
[INFO] Compiling 1 source file to <http://jenkins.buildacloud.org/job/cloudstack-4.3-maven-build/ws/plugins/user-authenticators/md5/target/classes>
[INFO] 
[INFO] --- maven-resources-plugin:2.5:testResources (default-testResources) @ cloud-plugin-user-authenticator-md5
---
[debug] execute contextualize
[INFO] Using 'UTF-8' encoding to copy filtered resources.
[INFO] skip non existing resourceDirectory <http://jenkins.buildacloud.org/job/cloudstack-4.3-maven-build/ws/plugins/user-authenticators/md5/test/resources>
[INFO] Copying 3 resources
[INFO] 
[INFO] --- maven-compiler-plugin:2.5.1:testCompile (default-testCompile) @ cloud-plugin-user-authenticator-md5
---
[INFO] No sources to compile
[INFO] 
[INFO] --- maven-surefire-plugin:2.12:test (default-test) @ cloud-plugin-user-authenticator-md5
---
[INFO] Surefire report directory: <http://jenkins.buildacloud.org/job/cloudstack-4.3-maven-build/ws/plugins/user-authenticators/md5/target/surefire-reports>

-------------------------------------------------------
 T E S T S
-------------------------------------------------------

Results :

Tests run: 0, Failures: 0, Errors: 0, Skipped: 0

[INFO]                                                                         
[INFO] ------------------------------------------------------------------------
[INFO] Building Apache CloudStack Plugin - User Authenticator Plain Text 4.3.0
[INFO] ------------------------------------------------------------------------
[INFO] 
[INFO] --- maven-clean-plugin:2.5:clean (default-clean) @ cloud-plugin-user-authenticator-plaintext
---
[INFO] Deleting <http://jenkins.buildacloud.org/job/cloudstack-4.3-maven-build/ws/plugins/user-authenticators/plain-text/target>
(includes = [**/*], excludes = [])
[INFO] Deleting <http://jenkins.buildacloud.org/job/cloudstack-4.3-maven-build/ws/plugins/user-authenticators/plain-text>
(includes = [target, dist], excludes = [])
[INFO] 
[INFO] --- maven-remote-resources-plugin:1.3:process (default) @ cloud-plugin-user-authenticator-plaintext
---
[INFO] 
[INFO] --- maven-resources-plugin:2.5:resources (default-resources) @ cloud-plugin-user-authenticator-plaintext
---
[debug] execute contextualize
[INFO] Using 'UTF-8' encoding to copy filtered resources.
[INFO] Copying 2 resources
[INFO] Copying 3 resources
[INFO] 
[INFO] --- maven-compiler-plugin:2.5.1:compile (default-compile) @ cloud-plugin-user-authenticator-plaintext
---
[INFO] Compiling 1 source file to <http://jenkins.buildacloud.org/job/cloudstack-4.3-maven-build/ws/plugins/user-authenticators/plain-text/target/classes>
[INFO] 
[INFO] --- maven-resources-plugin:2.5:testResources (default-testResources) @ cloud-plugin-user-authenticator-plaintext
---
[debug] execute contextualize
[INFO] Using 'UTF-8' encoding to copy filtered resources.
[INFO] skip non existing resourceDirectory <http://jenkins.buildacloud.org/job/cloudstack-4.3-maven-build/ws/plugins/user-authenticators/plain-text/test/resources>
[INFO] Copying 3 resources
[INFO] 
[INFO] --- maven-compiler-plugin:2.5.1:testCompile (default-testCompile) @ cloud-plugin-user-authenticator-plaintext
---
[INFO] No sources to compile
[INFO] 
[INFO] --- maven-surefire-plugin:2.12:test (default-test) @ cloud-plugin-user-authenticator-plaintext
---
[INFO] Surefire report directory: <http://jenkins.buildacloud.org/job/cloudstack-4.3-maven-build/ws/plugins/user-authenticators/plain-text/target/surefire-reports>

-------------------------------------------------------
 T E S T S
-------------------------------------------------------

Results :

Tests run: 0, Failures: 0, Errors: 0, Skipped: 0

[INFO]                                                                         
[INFO] ------------------------------------------------------------------------
[INFO] Building Apache CloudStack Plugin - User Authenticator SHA256 Salted 4.3.0
[INFO] ------------------------------------------------------------------------
[INFO] 
[INFO] --- maven-clean-plugin:2.5:clean (default-clean) @ cloud-plugin-user-authenticator-sha256salted
---
[INFO] Deleting <http://jenkins.buildacloud.org/job/cloudstack-4.3-maven-build/ws/plugins/user-authenticators/sha256salted/target>
(includes = [**/*], excludes = [])
[INFO] Deleting <http://jenkins.buildacloud.org/job/cloudstack-4.3-maven-build/ws/plugins/user-authenticators/sha256salted>
(includes = [target, dist], excludes = [])
[INFO] 
[INFO] --- maven-remote-resources-plugin:1.3:process (default) @ cloud-plugin-user-authenticator-sha256salted
---
[INFO] 
[INFO] --- maven-resources-plugin:2.5:resources (default-resources) @ cloud-plugin-user-authenticator-sha256salted
---
[debug] execute contextualize
[INFO] Using 'UTF-8' encoding to copy filtered resources.
[INFO] Copying 2 resources
[INFO] Copying 3 resources
[INFO] 
[INFO] --- maven-compiler-plugin:2.5.1:compile (default-compile) @ cloud-plugin-user-authenticator-sha256salted
---
[INFO] Compiling 1 source file to <http://jenkins.buildacloud.org/job/cloudstack-4.3-maven-build/ws/plugins/user-authenticators/sha256salted/target/classes>
[INFO] 
[INFO] --- maven-resources-plugin:2.5:testResources (default-testResources) @ cloud-plugin-user-authenticator-sha256salted
---
[debug] execute contextualize
[INFO] Using 'UTF-8' encoding to copy filtered resources.
[INFO] skip non existing resourceDirectory <http://jenkins.buildacloud.org/job/cloudstack-4.3-maven-build/ws/plugins/user-authenticators/sha256salted/test/resources>
[INFO] Copying 3 resources
[INFO] 
[INFO] --- maven-compiler-plugin:2.5.1:testCompile (default-testCompile) @ cloud-plugin-user-authenticator-sha256salted
---
[INFO] Compiling 1 source file to <http://jenkins.buildacloud.org/job/cloudstack-4.3-maven-build/ws/plugins/user-authenticators/sha256salted/target/test-classes>
[INFO] 
[INFO] --- maven-surefire-plugin:2.12:test (default-test) @ cloud-plugin-user-authenticator-sha256salted
---
[INFO] Surefire report directory: <http://jenkins.buildacloud.org/job/cloudstack-4.3-maven-build/ws/plugins/user-authenticators/sha256salted/target/surefire-reports>

-------------------------------------------------------
 T E S T S
-------------------------------------------------------
Running src.com.cloud.server.auth.test.AuthenticatorTest
log4j:WARN No appenders could be found for logger (com.cloud.server.auth.SHA256SaltedUserAuthenticator).
log4j:WARN Please initialize the log4j system properly.
log4j:WARN See http://logging.apache.org/log4j/1.2/faq.html#noconfig for more info.
Tests run: 2, Failures: 1, Errors: 0, Skipped: 0, Time elapsed: 0.918 sec <<< FAILURE!

Results :

Failed tests:   testAuthentication(src.com.cloud.server.auth.test.AuthenticatorTest): 32 byte
salt authenticated expected:<true> but was:<P[true:null]>

Tests run: 2, Failures: 1, Errors: 0, Skipped: 0

[INFO] ------------------------------------------------------------------------
[INFO] Reactor Summary:
[INFO] 
[INFO] Apache CloudStack ................................. SUCCESS [1.383s]
[INFO] Apache CloudStack Maven Conventions Parent ........ SUCCESS [0.053s]
[INFO] Apache CloudStack Framework - Managed Context ..... SUCCESS [4.375s]
[INFO] Apache CloudStack Utils ........................... SUCCESS [10.020s]
[INFO] Apache CloudStack Framework ....................... SUCCESS [0.029s]
[INFO] Apache CloudStack Framework - Event Notification .. SUCCESS [7.224s]
[INFO] Apache CloudStack Framework - Configuration ....... SUCCESS [5.018s]
[INFO] Apache CloudStack API ............................. SUCCESS [13.137s]
[INFO] Apache CloudStack Framework - REST ................ SUCCESS [3.225s]
[INFO] Apache CloudStack Framework - IPC ................. SUCCESS [5.951s]
[INFO] Apache CloudStack Cloud Engine .................... SUCCESS [0.064s]
[INFO] Apache CloudStack Cloud Engine API ................ SUCCESS [4.871s]
[INFO] Apache CloudStack Core ............................ SUCCESS [8.193s]
[INFO] Apache CloudStack Agents .......................... SUCCESS [5.790s]
[INFO] Apache CloudStack Framework - Clustering .......... SUCCESS [3.245s]
[INFO] Apache CloudStack Framework - Jobs ................ SUCCESS [3.773s]
[INFO] Apache CloudStack Cloud Engine Schema Component ... SUCCESS [10.841s]
[INFO] Apache CloudStack Framework - Event Notification .. SUCCESS [1.980s]
[INFO] Apache CloudStack Cloud Engine Internal Components API  SUCCESS [3.383s]
[INFO] Apache CloudStack Server .......................... SUCCESS [44.528s]
[INFO] Apache CloudStack Usage Server .................... SUCCESS [6.894s]
[INFO] Apache XenSource XAPI ............................. SUCCESS [5.726s]
[INFO] Apache CloudStack Cloud Engine Orchestration Component  SUCCESS [10.381s]
[INFO] Apache CloudStack Cloud Services .................. SUCCESS [0.082s]
[INFO] Apache CloudStack Secondary Storage Service ....... SUCCESS [5.314s]
[INFO] Apache CloudStack Engine Storage Component ........ SUCCESS [7.028s]
[INFO] Apache CloudStack Engine Storage Volume Component . SUCCESS [4.443s]
[INFO] Apache CloudStack Engine Storage Image Component .. SUCCESS [3.141s]
[INFO] Apache CloudStack Engine Storage Data Motion Component  SUCCESS [3.543s]
[INFO] Apache CloudStack Engine Storage Cache Component .. SUCCESS [2.757s]
[INFO] Apache CloudStack Engine Storage Snapshot Component  SUCCESS [7.276s]
[INFO] Apache CloudStack Cloud Engine API ................ SUCCESS [2.612s]
[INFO] Apache CloudStack Cloud Engine Service ............ SUCCESS [1.030s]
[INFO] Apache CloudStack Plugin POM ...................... SUCCESS [0.345s]
[INFO] Apache CloudStack Plugin - API Rate Limit ......... SUCCESS [7.544s]
[INFO] Apache CloudStack Plugin - API Discovery .......... SUCCESS [4.724s]
[INFO] Apache CloudStack Plugin - ACL Static Role Based .. SUCCESS [2.278s]
[INFO] Apache CloudStack Plugin - Host Anti-Affinity Processor  SUCCESS [2.355s]
[INFO] Apache CloudStack Plugin - Explicit Dedication Processor  SUCCESS [3.176s]
[INFO] Apache CloudStack Plugin - User Concentrated Pod Deployment Planner  SUCCESS [2.422s]
[INFO] Apache CloudStack Plugin - User Dispersing Deployment Planner  SUCCESS [2.485s]
[INFO] Apache CloudStack Plugin - Implicit Dedication Planner  SUCCESS [7.823s]
[INFO] Apache CloudStack Plugin - Skip Heurestics Planner  SUCCESS [2.366s]
[INFO] Apache CloudStack Plugin - Host Allocator Random .. SUCCESS [2.535s]
[INFO] Apache CloudStack Plugin - Dedicated Resources .... SUCCESS [7.392s]
[INFO] Apache CloudStack Plugin - Hypervisor OracleVM .... SUCCESS [3.616s]
[INFO] Apache CloudStack Plugin - Open vSwitch ........... SUCCESS [3.260s]
[INFO] Apache CloudStack Plugin - Hypervisor Xen ......... SUCCESS [10.075s]
[INFO] Apache CloudStack Plugin - Hypervisor KVM ......... SUCCESS [8.976s]
[INFO] Apache CloudStack Plugin - RabbitMQ Event Bus ..... SUCCESS [2.878s]
[INFO] Apache CloudStack Plugin - Hypervisor Baremetal ... SUCCESS [4.619s]
[INFO] Apache CloudStack Plugin - Hypervisor UCS ......... SUCCESS [3.143s]
[INFO] Apache CloudStack Plugin - Hypervisor Hyper-V ..... SUCCESS [6.164s]
[INFO] Apache CloudStack Plugin - Network Elastic Load Balancer  SUCCESS [4.389s]
[INFO] Apache CloudStack Plugin - Network Internal Load Balancer  SUCCESS [9.668s]
[INFO] Apache CloudStack Plugin - Network Juniper Contrail  SUCCESS [9.438s]
[INFO] Apache CloudStack Plugin - Palo Alto .............. SUCCESS [7.757s]
[INFO] Apache CloudStack Checkstyle Configuration ........ SUCCESS [0.242s]
[INFO] Apache CloudStack Plugin - Network Nicira NVP ..... SUCCESS [11.409s]
[INFO] Apache CloudStack Plugin - BigSwitch Virtual Network Segment  SUCCESS [7.442s]
[INFO] Apache CloudStack Plugin - Midokura Midonet ....... SUCCESS [7.214s]
[INFO] Apache Cloudstack Plugin - Stratosphere SSP ....... SUCCESS [6.962s]
[INFO] Apache CloudStack Plugin - Storage Allocator Random  SUCCESS [2.704s]
[INFO] Apache CloudStack Plugin - User Authenticator LDAP  SUCCESS [3.925s]
[INFO] Apache CloudStack Plugin - User Authenticator MD5 . SUCCESS [2.426s]
[INFO] Apache CloudStack Plugin - User Authenticator Plain Text  SUCCESS [3.416s]
[INFO] Apache CloudStack Plugin - User Authenticator SHA256 Salted  FAILURE [6.237s]
[INFO] Apache CloudStack Plugin - Dns Notifier Example ... SKIPPED
[INFO] Apache CloudStack Plugin - Storage Image S3 ....... SKIPPED
[INFO] Apache CloudStack Plugin - Storage Image Swift provider  SKIPPED
[INFO] Apache CloudStack Plugin - Storage Image default provider  SKIPPED
[INFO] Apache CloudStack Plugin - Storage Image sample provider  SKIPPED
[INFO] Apache CloudStack Plugin - Storage Volume SolidFire Provider  SKIPPED
[INFO] Apache CloudStack Plugin - Storage Volume default provider  SKIPPED
[INFO] Apache CloudStack Plugin - Storage Volume sample provider  SKIPPED
[INFO] Apache CloudStack Plugin - SNMP Alerts ............ SKIPPED
[INFO] Apache CloudStack Plugin - Syslog Alerts .......... SKIPPED
[INFO] Apache CloudStack Plugin - Network VXLAN .......... SKIPPED
[INFO] Apache CloudStack Framework - Spring Life Cycle ... SKIPPED
[INFO] cloud-framework-spring-module ..................... SKIPPED
[INFO] Apache CloudStack Test ............................ SKIPPED
[INFO] Apache CloudStack Client UI ....................... SKIPPED
[INFO] Apache CloudStack Console Proxy - RDP Client ...... SKIPPED
[INFO] Apache CloudStack Console Proxy ................... SKIPPED
[INFO] Apache CloudStack Console Proxy - Server .......... SKIPPED
[INFO] Apache CloudStack Framework - QuickCloud .......... SKIPPED
[INFO] ------------------------------------------------------------------------
[INFO] BUILD FAILURE
[INFO] ------------------------------------------------------------------------
[INFO] Total time: 6:11.764s
[INFO] Finished at: Tue Jan 21 22:56:58 EST 2014
[INFO] Final Memory: 55M/244M
[INFO] ------------------------------------------------------------------------
[ERROR] Failed to execute goal org.apache.maven.plugins:maven-surefire-plugin:2.12:test (default-test)
on project cloud-plugin-user-authenticator-sha256salted: There are test failures.
[ERROR] 
[ERROR] Please refer to <http://jenkins.buildacloud.org/job/cloudstack-4.3-maven-build/ws/plugins/user-authenticators/sha256salted/target/surefire-reports>
for the individual test results.
[ERROR] -> [Help 1]
[ERROR] 
[ERROR] To see the full stack trace of the errors, re-run Maven with the -e switch.
[ERROR] Re-run Maven using the -X switch to enable full debug logging.
[ERROR] 
[ERROR] For more information about the errors and possible solutions, please read the following
articles:
[ERROR] [Help 1] http://cwiki.apache.org/confluence/display/MAVEN/MojoFailureException
[ERROR] 
[ERROR] After correcting the problems, you can resume the build with the command
[ERROR]   mvn <goals> -rf :cloud-plugin-user-authenticator-sha256salted
Build step 'Invoke top-level Maven targets' marked build as failure

Mime
View raw message