cloudstack-dev mailing list archives

Site index · List index
Message view « Date » · « Thread »
Top « Date » · « Thread »
From jenk...@cloudstack.org
Subject Build failed in Jenkins: build-master #76
Date Fri, 17 Jan 2014 09:55:00 GMT
See <http://jenkins.buildacloud.org/job/build-master/76/changes>

Changes:

[Devdeep Singh] CLOUDSTACK-5692: obscure passwords when using cifs as storage

------------------------------------------
[...truncated 3710 lines...]
[INFO] 
[INFO] --- maven-compiler-plugin:2.5.1:testCompile (default-testCompile) @ cloud-plugin-storage-volume-solidfire
---
[INFO] Compiling 4 source files to <http://jenkins.buildacloud.org/job/build-master/ws/plugins/storage/volume/solidfire/target/test-classes>
[INFO] 
[INFO] --- maven-surefire-plugin:2.12:test (default-test) @ cloud-plugin-storage-volume-solidfire
---
[INFO] Tests are skipped.
[INFO]                                                                         
[INFO] ------------------------------------------------------------------------
[INFO] Building Apache CloudStack Plugin - Storage Volume default provider 4.4.0-SNAPSHOT
[INFO] ------------------------------------------------------------------------
[INFO] 
[INFO] --- maven-clean-plugin:2.5:clean (default-clean) @ cloud-plugin-storage-volume-default
---
[INFO] Deleting <http://jenkins.buildacloud.org/job/build-master/ws/plugins/storage/volume/default/target>
(includes = [**/*], excludes = [])
[INFO] Deleting <http://jenkins.buildacloud.org/job/build-master/ws/plugins/storage/volume/default>
(includes = [target, dist], excludes = [])
[INFO] 
[INFO] --- maven-checkstyle-plugin:2.11:check (cloudstack-checkstyle) @ cloud-plugin-storage-volume-default
---
[INFO] Starting audit...
Audit done.

[INFO] 
[INFO] --- maven-remote-resources-plugin:1.3:process (default) @ cloud-plugin-storage-volume-default
---
[INFO] 
[INFO] --- maven-resources-plugin:2.5:resources (default-resources) @ cloud-plugin-storage-volume-default
---
[debug] execute contextualize
[INFO] Using 'UTF-8' encoding to copy filtered resources.
[INFO] Copying 2 resources
[INFO] Copying 3 resources
[INFO] 
[INFO] --- maven-compiler-plugin:2.5.1:compile (default-compile) @ cloud-plugin-storage-volume-default
---
[INFO] Compiling 3 source files to <http://jenkins.buildacloud.org/job/build-master/ws/plugins/storage/volume/default/target/classes>
[INFO] 
[INFO] --- maven-resources-plugin:2.5:testResources (default-testResources) @ cloud-plugin-storage-volume-default
---
[debug] execute contextualize
[INFO] Using 'UTF-8' encoding to copy filtered resources.
[INFO] skip non existing resourceDirectory <http://jenkins.buildacloud.org/job/build-master/ws/plugins/storage/volume/default/test/resources>
[INFO] Copying 3 resources
[INFO] 
[INFO] --- maven-compiler-plugin:2.5.1:testCompile (default-testCompile) @ cloud-plugin-storage-volume-default
---
[INFO] No sources to compile
[INFO] 
[INFO] --- maven-surefire-plugin:2.12:test (default-test) @ cloud-plugin-storage-volume-default
---
[INFO] Tests are skipped.
[INFO]                                                                         
[INFO] ------------------------------------------------------------------------
[INFO] Building Apache CloudStack Plugin - Storage Volume sample provider 4.4.0-SNAPSHOT
[INFO] ------------------------------------------------------------------------
[INFO] 
[INFO] --- maven-clean-plugin:2.5:clean (default-clean) @ cloud-plugin-storage-volume-sample
---
[INFO] Deleting <http://jenkins.buildacloud.org/job/build-master/ws/plugins/storage/volume/sample/target>
(includes = [**/*], excludes = [])
[INFO] Deleting <http://jenkins.buildacloud.org/job/build-master/ws/plugins/storage/volume/sample>
(includes = [target, dist], excludes = [])
[INFO] 
[INFO] --- maven-checkstyle-plugin:2.11:check (cloudstack-checkstyle) @ cloud-plugin-storage-volume-sample
---
[INFO] Starting audit...
Audit done.

[INFO] 
[INFO] --- maven-remote-resources-plugin:1.3:process (default) @ cloud-plugin-storage-volume-sample
---
[INFO] 
[INFO] --- maven-resources-plugin:2.5:resources (default-resources) @ cloud-plugin-storage-volume-sample
---
[debug] execute contextualize
[INFO] Using 'UTF-8' encoding to copy filtered resources.
[INFO] skip non existing resourceDirectory <http://jenkins.buildacloud.org/job/build-master/ws/plugins/storage/volume/sample/resources>
[INFO] Copying 3 resources
[INFO] 
[INFO] --- maven-compiler-plugin:2.5.1:compile (default-compile) @ cloud-plugin-storage-volume-sample
---
[INFO] Compiling 3 source files to <http://jenkins.buildacloud.org/job/build-master/ws/plugins/storage/volume/sample/target/classes>
[INFO] 
[INFO] --- maven-resources-plugin:2.5:testResources (default-testResources) @ cloud-plugin-storage-volume-sample
---
[debug] execute contextualize
[INFO] Using 'UTF-8' encoding to copy filtered resources.
[INFO] skip non existing resourceDirectory <http://jenkins.buildacloud.org/job/build-master/ws/plugins/storage/volume/sample/test/resources>
[INFO] Copying 3 resources
[INFO] 
[INFO] --- maven-compiler-plugin:2.5.1:testCompile (default-testCompile) @ cloud-plugin-storage-volume-sample
---
[INFO] No sources to compile
[INFO] 
[INFO] --- maven-surefire-plugin:2.12:test (default-test) @ cloud-plugin-storage-volume-sample
---
[INFO] Tests are skipped.
[INFO]                                                                         
[INFO] ------------------------------------------------------------------------
[INFO] Building Apache CloudStack Plugin - SNMP Alerts 4.4.0-SNAPSHOT
[INFO] ------------------------------------------------------------------------
[INFO] 
[INFO] --- maven-clean-plugin:2.5:clean (default-clean) @ cloud-plugin-snmp-alerts ---
[INFO] Deleting <http://jenkins.buildacloud.org/job/build-master/ws/plugins/alert-handlers/snmp-alerts/target>
(includes = [**/*], excludes = [])
[INFO] Deleting <http://jenkins.buildacloud.org/job/build-master/ws/plugins/alert-handlers/snmp-alerts>
(includes = [target, dist], excludes = [])
[INFO] 
[INFO] --- maven-checkstyle-plugin:2.11:check (cloudstack-checkstyle) @ cloud-plugin-snmp-alerts
---
[INFO] Starting audit...
Audit done.

[INFO] 
[INFO] --- maven-remote-resources-plugin:1.3:process (default) @ cloud-plugin-snmp-alerts
---
[INFO] 
[INFO] --- maven-resources-plugin:2.5:resources (default-resources) @ cloud-plugin-snmp-alerts
---
[debug] execute contextualize
[INFO] Using 'UTF-8' encoding to copy filtered resources.
[INFO] skip non existing resourceDirectory <http://jenkins.buildacloud.org/job/build-master/ws/plugins/alert-handlers/snmp-alerts/resources>
[INFO] Copying 3 resources
[INFO] 
[INFO] --- maven-compiler-plugin:2.5.1:compile (default-compile) @ cloud-plugin-snmp-alerts
---
[INFO] Compiling 5 source files to <http://jenkins.buildacloud.org/job/build-master/ws/plugins/alert-handlers/snmp-alerts/target/classes>
[INFO] 
[INFO] --- maven-resources-plugin:2.5:testResources (default-testResources) @ cloud-plugin-snmp-alerts
---
[debug] execute contextualize
[INFO] Using 'UTF-8' encoding to copy filtered resources.
[INFO] skip non existing resourceDirectory <http://jenkins.buildacloud.org/job/build-master/ws/plugins/alert-handlers/snmp-alerts/test/resources>
[INFO] Copying 3 resources
[INFO] 
[INFO] --- maven-compiler-plugin:2.5.1:testCompile (default-testCompile) @ cloud-plugin-snmp-alerts
---
[INFO] Compiling 2 source files to <http://jenkins.buildacloud.org/job/build-master/ws/plugins/alert-handlers/snmp-alerts/target/test-classes>
[INFO] 
[INFO] --- maven-surefire-plugin:2.12:test (default-test) @ cloud-plugin-snmp-alerts ---
[INFO] Surefire report directory: <http://jenkins.buildacloud.org/job/build-master/ws/plugins/alert-handlers/snmp-alerts/target/surefire-reports>

-------------------------------------------------------
 T E S T S
-------------------------------------------------------
Running org.apache.cloudstack.alert.snmp.SnmpTrapAppenderTest
log4j:ERROR  Error in crearting snmp object, rpmbuilder: rpmbuilder
log4j:ERROR  size of ip addresses , communities, and ports list doesn't match, setting all
to null
log4j:ERROR  Invalid format for the IP Addresses or Ports parameter 
log4j:ERROR  Invalid format for the IP Addresses or Ports parameter 
log4j:ERROR  size of ip addresses , communities, and ports list doesn't match, setting all
to null
Tests run: 5, Failures: 1, Errors: 0, Skipped: 0, Time elapsed: 20.71 sec <<< FAILURE!
Running org.apache.cloudstack.alert.snmp.SnmpEnhancedPatternLayoutTest
Tests run: 4, Failures: 0, Errors: 0, Skipped: 0, Time elapsed: 0.068 sec

Results :

Failed tests:   appendTest(org.apache.cloudstack.alert.snmp.SnmpTrapAppenderTest):  error
snmpHelper list size not as expected  expected:<0> but was:<2>

Tests run: 9, Failures: 1, Errors: 0, Skipped: 0

[INFO] ------------------------------------------------------------------------
[INFO] Reactor Summary:
[INFO] 
[INFO] Apache CloudStack Developer Tools - Checkstyle Configuration  SUCCESS [1.618s]
[INFO] Apache CloudStack ................................. SUCCESS [0.922s]
[INFO] Apache CloudStack Maven Conventions Parent ........ SUCCESS [1.929s]
[INFO] Apache CloudStack Framework - Managed Context ..... SUCCESS [4.902s]
[INFO] Apache CloudStack Utils ........................... SUCCESS [15.112s]
[INFO] Apache CloudStack Framework ....................... SUCCESS [2.485s]
[INFO] Apache CloudStack Framework - Event Notification .. SUCCESS [9.189s]
[INFO] Apache CloudStack Framework - Configuration ....... SUCCESS [5.994s]
[INFO] Apache CloudStack API ............................. SUCCESS [21.057s]
[INFO] Apache CloudStack Framework - REST ................ SUCCESS [4.329s]
[INFO] Apache CloudStack Framework - IPC ................. SUCCESS [7.690s]
[INFO] Apache CloudStack Cloud Engine .................... SUCCESS [6.213s]
[INFO] Apache CloudStack Cloud Engine API ................ SUCCESS [5.946s]
[INFO] Apache CloudStack Framework - Security ............ SUCCESS [3.235s]
[INFO] Apache CloudStack Core ............................ SUCCESS [12.398s]
[INFO] Apache CloudStack Agents .......................... SUCCESS [7.019s]
[INFO] Apache CloudStack Framework - Clustering .......... SUCCESS [4.266s]
[INFO] Apache CloudStack Framework - Jobs ................ SUCCESS [4.420s]
[INFO] Apache CloudStack Cloud Engine Schema Component ... SUCCESS [13.730s]
[INFO] Apache CloudStack Framework - Event Notification .. SUCCESS [3.045s]
[INFO] Apache CloudStack Cloud Engine Internal Components API  SUCCESS [3.850s]
[INFO] Apache CloudStack Server .......................... SUCCESS [59.230s]
[INFO] Apache CloudStack Usage Server .................... SUCCESS [9.822s]
[INFO] Apache XenSource XAPI ............................. SUCCESS [7.280s]
[INFO] Apache CloudStack Cloud Engine Orchestration Component  SUCCESS [11.535s]
[INFO] Apache CloudStack Cloud Services .................. SUCCESS [2.818s]
[INFO] Apache CloudStack Secondary Storage Service ....... SUCCESS [6.768s]
[INFO] Apache CloudStack Engine Storage Component ........ SUCCESS [9.186s]
[INFO] Apache CloudStack Engine Storage Volume Component . SUCCESS [5.721s]
[INFO] Apache CloudStack Engine Storage Image Component .. SUCCESS [4.747s]
[INFO] Apache CloudStack Engine Storage Data Motion Component  SUCCESS [4.482s]
[INFO] Apache CloudStack Engine Storage Cache Component .. SUCCESS [3.471s]
[INFO] Apache CloudStack Engine Storage Snapshot Component  SUCCESS [10.062s]
[INFO] Apache CloudStack Cloud Engine API ................ SUCCESS [3.295s]
[INFO] Apache CloudStack Cloud Engine Service ............ SUCCESS [1.506s]
[INFO] Apache CloudStack Plugin POM ...................... SUCCESS [7.062s]
[INFO] Apache CloudStack Plugin - API Rate Limit ......... SUCCESS [9.121s]
[INFO] Apache CloudStack Plugin - API Discovery .......... SUCCESS [5.955s]
[INFO] Apache CloudStack Plugin - ACL Static Role Based .. SUCCESS [3.450s]
[INFO] Apache CloudStack Plugin - Host Anti-Affinity Processor  SUCCESS [3.363s]
[INFO] Apache CloudStack Plugin - Explicit Dedication Processor  SUCCESS [3.501s]
[INFO] Apache CloudStack Plugin - User Concentrated Pod Deployment Planner  SUCCESS [3.307s]
[INFO] Apache CloudStack Plugin - User Dispersing Deployment Planner  SUCCESS [3.400s]
[INFO] Apache CloudStack Plugin - Implicit Dedication Planner  SUCCESS [9.983s]
[INFO] Apache CloudStack Plugin - Skip Heurestics Planner  SUCCESS [3.367s]
[INFO] Apache CloudStack Plugin - Host Allocator Random .. SUCCESS [3.762s]
[INFO] Apache CloudStack Plugin - Dedicated Resources .... SUCCESS [9.533s]
[INFO] Apache CloudStack Plugin - Hypervisor OracleVM .... SUCCESS [5.067s]
[INFO] Apache CloudStack Plugin - Open vSwitch ........... SUCCESS [4.307s]
[INFO] Apache CloudStack Plugin - Hypervisor Xen ......... SUCCESS [13.165s]
[INFO] Apache CloudStack Plugin - Hypervisor KVM ......... SUCCESS [11.835s]
[INFO] Apache CloudStack Plugin - RabbitMQ Event Bus ..... SUCCESS [3.471s]
[INFO] Apache CloudStack Plugin - In Memory Event Bus .... SUCCESS [3.316s]
[INFO] Apache CloudStack Plugin - Hypervisor Baremetal ... SUCCESS [5.575s]
[INFO] Apache CloudStack Plugin - Hypervisor UCS ......... SUCCESS [4.020s]
[INFO] Apache CloudStack Plugin - Hypervisor Hyper-V ..... SUCCESS [8.234s]
[INFO] Apache CloudStack Plugin - Network Elastic Load Balancer  SUCCESS [4.329s]
[INFO] Apache CloudStack Plugin - Network Internal Load Balancer  SUCCESS [12.062s]
[INFO] Apache CloudStack Plugin - Network Juniper Contrail  SUCCESS [14.007s]
[INFO] Apache CloudStack Plugin - Palo Alto .............. SUCCESS [11.008s]
[INFO] Apache CloudStack Plugin - Network Nicira NVP ..... SUCCESS [11.417s]
[INFO] Apache CloudStack Plugin - BigSwitch Virtual Network Segment  SUCCESS [8.666s]
[INFO] Apache CloudStack Plugin - Midokura Midonet ....... SUCCESS [8.549s]
[INFO] Apache Cloudstack Plugin - Stratosphere SSP ....... SUCCESS [8.865s]
[INFO] Apache CloudStack Plugin - Network Opendaylight ... SUCCESS [7.521s]
[INFO] Apache CloudStack Plugin - Storage Allocator Random  SUCCESS [3.191s]
[INFO] Apache CloudStack Plugin - User Authenticator LDAP  SUCCESS [5.125s]
[INFO] Apache CloudStack Plugin - User Authenticator MD5 . SUCCESS [3.253s]
[INFO] Apache CloudStack Plugin - User Authenticator Plain Text  SUCCESS [4.025s]
[INFO] Apache CloudStack Plugin - User Authenticator SHA256 Salted  SUCCESS [16.805s]
[INFO] Apache CloudStack Plugin - Dns Notifier Example ... SUCCESS [3.473s]
[INFO] Apache CloudStack Plugin - Storage Image S3 ....... SUCCESS [3.829s]
[INFO] Apache CloudStack Plugin - Storage Image Swift provider  SUCCESS [3.418s]
[INFO] Apache CloudStack Plugin - Storage Image default provider  SUCCESS [3.152s]
[INFO] Apache CloudStack Plugin - Storage Image sample provider  SUCCESS [3.124s]
[INFO] Apache CloudStack Plugin - Storage Volume Nexenta Provider  SUCCESS [5.932s]
[INFO] Apache CloudStack Plugin - Storage Volume SolidFire Provider  SUCCESS [6.674s]
[INFO] Apache CloudStack Plugin - Storage Volume default provider  SUCCESS [3.752s]
[INFO] Apache CloudStack Plugin - Storage Volume sample provider  SUCCESS [2.906s]
[INFO] Apache CloudStack Plugin - SNMP Alerts ............ FAILURE [26.802s]
[INFO] Apache CloudStack Plugin - Syslog Alerts .......... SKIPPED
[INFO] Apache CloudStack Plugin - Network VXLAN .......... SKIPPED
[INFO] Apache CloudStack Framework - Spring Life Cycle ... SKIPPED
[INFO] cloud-framework-spring-module ..................... SKIPPED
[INFO] Apache CloudStack Test ............................ SKIPPED
[INFO] Apache CloudStack Console Proxy ................... SKIPPED
[INFO] Apache CloudStack Console Proxy - Server .......... SKIPPED
[INFO] Apache CloudStack System VM ....................... SKIPPED
[INFO] Apache CloudStack Client UI ....................... SKIPPED
[INFO] Apache CloudStack Console Proxy - RDP Client ...... SKIPPED
[INFO] Apache CloudStack Framework - QuickCloud .......... SKIPPED
[INFO] ------------------------------------------------------------------------
[INFO] BUILD FAILURE
[INFO] ------------------------------------------------------------------------
[INFO] Total time: 9:50.623s
[INFO] Finished at: Fri Jan 17 04:54:59 EST 2014
[INFO] Final Memory: 61M/277M
[INFO] ------------------------------------------------------------------------
[ERROR] Failed to execute goal org.apache.maven.plugins:maven-surefire-plugin:2.12:test (default-test)
on project cloud-plugin-snmp-alerts: There are test failures.
[ERROR] 
[ERROR] Please refer to <http://jenkins.buildacloud.org/job/build-master/ws/plugins/alert-handlers/snmp-alerts/target/surefire-reports>
for the individual test results.
[ERROR] -> [Help 1]
[ERROR] 
[ERROR] To see the full stack trace of the errors, re-run Maven with the -e switch.
[ERROR] Re-run Maven using the -X switch to enable full debug logging.
[ERROR] 
[ERROR] For more information about the errors and possible solutions, please read the following
articles:
[ERROR] [Help 1] http://cwiki.apache.org/confluence/display/MAVEN/MojoFailureException
[ERROR] 
[ERROR] After correcting the problems, you can resume the build with the command
[ERROR]   mvn <goals> -rf :cloud-plugin-snmp-alerts
Build step 'Invoke top-level Maven targets' marked build as failure

Mime
View raw message