cloudstack-dev mailing list archives

Site index · List index
Message view « Date » · « Thread »
Top « Date » · « Thread »
From jenk...@cloudstack.org
Subject Build failed in Jenkins: build-master #101
Date Wed, 22 Jan 2014 04:03:20 GMT
See <http://jenkins.buildacloud.org/job/build-master/101/changes>

Changes:

[anthony.xu] CLOUDSTACK-5923: CS doesn't do master switch for XS any more, CS will depend
on XS HA to do master switch, XS HA needs to be enabled.

[sheng.yang] CLOUDSTACK-5779: Update vmdata command in Vmware

[anthony.xu] fix build

------------------------------------------
[...truncated 3314 lines...]
[INFO] 
[INFO] --- maven-checkstyle-plugin:2.11:check (cloudstack-checkstyle) @ cloud-plugin-user-authenticator-md5
---
[INFO] Starting audit...
Audit done.

[INFO] 
[INFO] --- maven-remote-resources-plugin:1.3:process (default) @ cloud-plugin-user-authenticator-md5
---
[INFO] 
[INFO] --- maven-resources-plugin:2.5:resources (default-resources) @ cloud-plugin-user-authenticator-md5
---
[debug] execute contextualize
[INFO] Using 'UTF-8' encoding to copy filtered resources.
[INFO] Copying 2 resources
[INFO] Copying 3 resources
[INFO] 
[INFO] --- maven-compiler-plugin:2.5.1:compile (default-compile) @ cloud-plugin-user-authenticator-md5
---
[INFO] Compiling 1 source file to <http://jenkins.buildacloud.org/job/build-master/ws/plugins/user-authenticators/md5/target/classes>
[INFO] 
[INFO] --- maven-resources-plugin:2.5:testResources (default-testResources) @ cloud-plugin-user-authenticator-md5
---
[debug] execute contextualize
[INFO] Using 'UTF-8' encoding to copy filtered resources.
[INFO] skip non existing resourceDirectory <http://jenkins.buildacloud.org/job/build-master/ws/plugins/user-authenticators/md5/test/resources>
[INFO] Copying 3 resources
[INFO] 
[INFO] --- maven-compiler-plugin:2.5.1:testCompile (default-testCompile) @ cloud-plugin-user-authenticator-md5
---
[INFO] No sources to compile
[INFO] 
[INFO] --- maven-surefire-plugin:2.12:test (default-test) @ cloud-plugin-user-authenticator-md5
---
[INFO] Surefire report directory: <http://jenkins.buildacloud.org/job/build-master/ws/plugins/user-authenticators/md5/target/surefire-reports>

-------------------------------------------------------
 T E S T S
-------------------------------------------------------

Results :

Tests run: 0, Failures: 0, Errors: 0, Skipped: 0

[INFO]                                                                         
[INFO] ------------------------------------------------------------------------
[INFO] Building Apache CloudStack Plugin - User Authenticator Plain Text 4.4.0-SNAPSHOT
[INFO] ------------------------------------------------------------------------
[INFO] 
[INFO] --- maven-clean-plugin:2.5:clean (default-clean) @ cloud-plugin-user-authenticator-plaintext
---
[INFO] Deleting <http://jenkins.buildacloud.org/job/build-master/ws/plugins/user-authenticators/plain-text/target>
(includes = [**/*], excludes = [])
[INFO] Deleting <http://jenkins.buildacloud.org/job/build-master/ws/plugins/user-authenticators/plain-text>
(includes = [target, dist], excludes = [])
[INFO] 
[INFO] --- maven-checkstyle-plugin:2.11:check (cloudstack-checkstyle) @ cloud-plugin-user-authenticator-plaintext
---
[INFO] Starting audit...
Audit done.

[INFO] 
[INFO] --- maven-remote-resources-plugin:1.3:process (default) @ cloud-plugin-user-authenticator-plaintext
---
[INFO] 
[INFO] --- maven-resources-plugin:2.5:resources (default-resources) @ cloud-plugin-user-authenticator-plaintext
---
[debug] execute contextualize
[INFO] Using 'UTF-8' encoding to copy filtered resources.
[INFO] Copying 2 resources
[INFO] Copying 3 resources
[INFO] 
[INFO] --- maven-compiler-plugin:2.5.1:compile (default-compile) @ cloud-plugin-user-authenticator-plaintext
---
[INFO] Compiling 1 source file to <http://jenkins.buildacloud.org/job/build-master/ws/plugins/user-authenticators/plain-text/target/classes>
[INFO] 
[INFO] --- maven-resources-plugin:2.5:testResources (default-testResources) @ cloud-plugin-user-authenticator-plaintext
---
[debug] execute contextualize
[INFO] Using 'UTF-8' encoding to copy filtered resources.
[INFO] skip non existing resourceDirectory <http://jenkins.buildacloud.org/job/build-master/ws/plugins/user-authenticators/plain-text/test/resources>
[INFO] Copying 3 resources
[INFO] 
[INFO] --- maven-compiler-plugin:2.5.1:testCompile (default-testCompile) @ cloud-plugin-user-authenticator-plaintext
---
[INFO] No sources to compile
[INFO] 
[INFO] --- maven-surefire-plugin:2.12:test (default-test) @ cloud-plugin-user-authenticator-plaintext
---
[INFO] Surefire report directory: <http://jenkins.buildacloud.org/job/build-master/ws/plugins/user-authenticators/plain-text/target/surefire-reports>

-------------------------------------------------------
 T E S T S
-------------------------------------------------------

Results :

Tests run: 0, Failures: 0, Errors: 0, Skipped: 0

[INFO]                                                                         
[INFO] ------------------------------------------------------------------------
[INFO] Building Apache CloudStack Plugin - User Authenticator SHA256 Salted 4.4.0-SNAPSHOT
[INFO] ------------------------------------------------------------------------
[INFO] 
[INFO] --- maven-clean-plugin:2.5:clean (default-clean) @ cloud-plugin-user-authenticator-sha256salted
---
[INFO] Deleting <http://jenkins.buildacloud.org/job/build-master/ws/plugins/user-authenticators/sha256salted/target>
(includes = [**/*], excludes = [])
[INFO] Deleting <http://jenkins.buildacloud.org/job/build-master/ws/plugins/user-authenticators/sha256salted>
(includes = [target, dist], excludes = [])
[INFO] 
[INFO] --- maven-checkstyle-plugin:2.11:check (cloudstack-checkstyle) @ cloud-plugin-user-authenticator-sha256salted
---
[INFO] Starting audit...
Audit done.

[INFO] 
[INFO] --- maven-remote-resources-plugin:1.3:process (default) @ cloud-plugin-user-authenticator-sha256salted
---
[INFO] 
[INFO] --- maven-resources-plugin:2.5:resources (default-resources) @ cloud-plugin-user-authenticator-sha256salted
---
[debug] execute contextualize
[INFO] Using 'UTF-8' encoding to copy filtered resources.
[INFO] Copying 2 resources
[INFO] Copying 3 resources
[INFO] 
[INFO] --- maven-compiler-plugin:2.5.1:compile (default-compile) @ cloud-plugin-user-authenticator-sha256salted
---
[INFO] Compiling 1 source file to <http://jenkins.buildacloud.org/job/build-master/ws/plugins/user-authenticators/sha256salted/target/classes>
[INFO] 
[INFO] --- maven-resources-plugin:2.5:testResources (default-testResources) @ cloud-plugin-user-authenticator-sha256salted
---
[debug] execute contextualize
[INFO] Using 'UTF-8' encoding to copy filtered resources.
[INFO] skip non existing resourceDirectory <http://jenkins.buildacloud.org/job/build-master/ws/plugins/user-authenticators/sha256salted/test/resources>
[INFO] Copying 3 resources
[INFO] 
[INFO] --- maven-compiler-plugin:2.5.1:testCompile (default-testCompile) @ cloud-plugin-user-authenticator-sha256salted
---
[INFO] Compiling 1 source file to <http://jenkins.buildacloud.org/job/build-master/ws/plugins/user-authenticators/sha256salted/target/test-classes>
[INFO] 
[INFO] --- maven-surefire-plugin:2.12:test (default-test) @ cloud-plugin-user-authenticator-sha256salted
---
[INFO] Surefire report directory: <http://jenkins.buildacloud.org/job/build-master/ws/plugins/user-authenticators/sha256salted/target/surefire-reports>

-------------------------------------------------------
 T E S T S
-------------------------------------------------------
Running src.com.cloud.server.auth.test.AuthenticatorTest
log4j:WARN No appenders could be found for logger (com.cloud.server.auth.SHA256SaltedUserAuthenticator).
log4j:WARN Please initialize the log4j system properly.
log4j:WARN See http://logging.apache.org/log4j/1.2/faq.html#noconfig for more info.
Tests run: 2, Failures: 1, Errors: 0, Skipped: 0, Time elapsed: 1.053 sec <<< FAILURE!

Results :

Failed tests:   testAuthentication(src.com.cloud.server.auth.test.AuthenticatorTest): 32 byte
salt authenticated expected:<true> but was:<P[true:null]>

Tests run: 2, Failures: 1, Errors: 0, Skipped: 0

[INFO] ------------------------------------------------------------------------
[INFO] Reactor Summary:
[INFO] 
[INFO] Apache CloudStack Developer Tools - Checkstyle Configuration  SUCCESS [1.430s]
[INFO] Apache CloudStack ................................. SUCCESS [1.419s]
[INFO] Apache CloudStack Maven Conventions Parent ........ SUCCESS [2.799s]
[INFO] Apache CloudStack Framework - Managed Context ..... SUCCESS [6.693s]
[INFO] Apache CloudStack Utils ........................... SUCCESS [15.189s]
[INFO] Apache CloudStack Framework ....................... SUCCESS [1.951s]
[INFO] Apache CloudStack Framework - Event Notification .. SUCCESS [9.953s]
[INFO] Apache CloudStack Framework - Configuration ....... SUCCESS [5.786s]
[INFO] Apache CloudStack API ............................. SUCCESS [19.891s]
[INFO] Apache CloudStack Framework - REST ................ SUCCESS [4.292s]
[INFO] Apache CloudStack Framework - IPC ................. SUCCESS [7.726s]
[INFO] Apache CloudStack Cloud Engine .................... SUCCESS [5.003s]
[INFO] Apache CloudStack Cloud Engine API ................ SUCCESS [6.028s]
[INFO] Apache CloudStack Framework - Security ............ SUCCESS [3.330s]
[INFO] Apache CloudStack Core ............................ SUCCESS [11.361s]
[INFO] Apache CloudStack Agents .......................... SUCCESS [7.227s]
[INFO] Apache CloudStack Framework - Clustering .......... SUCCESS [4.685s]
[INFO] Apache CloudStack Framework - Jobs ................ SUCCESS [4.828s]
[INFO] Apache CloudStack Cloud Engine Schema Component ... SUCCESS [16.943s]
[INFO] Apache CloudStack Framework - Event Notification .. SUCCESS [2.477s]
[INFO] Apache CloudStack Cloud Engine Internal Components API  SUCCESS [3.968s]
[INFO] Apache CloudStack Server .......................... SUCCESS [58.922s]
[INFO] Apache CloudStack Usage Server .................... SUCCESS [9.881s]
[INFO] Apache XenSource XAPI ............................. SUCCESS [7.592s]
[INFO] Apache CloudStack Cloud Engine Orchestration Component  SUCCESS [13.140s]
[INFO] Apache CloudStack Cloud Services .................. SUCCESS [1.709s]
[INFO] Apache CloudStack Secondary Storage Service ....... SUCCESS [6.545s]
[INFO] Apache CloudStack Engine Storage Component ........ SUCCESS [8.669s]
[INFO] Apache CloudStack Engine Storage Volume Component . SUCCESS [5.764s]
[INFO] Apache CloudStack Engine Storage Image Component .. SUCCESS [4.865s]
[INFO] Apache CloudStack Engine Storage Data Motion Component  SUCCESS [3.579s]
[INFO] Apache CloudStack Engine Storage Cache Component .. SUCCESS [3.221s]
[INFO] Apache CloudStack Engine Storage Snapshot Component  SUCCESS [10.500s]
[INFO] Apache CloudStack Cloud Engine API ................ SUCCESS [2.654s]
[INFO] Apache CloudStack Cloud Engine Service ............ SUCCESS [1.370s]
[INFO] Apache CloudStack Plugin POM ...................... SUCCESS [3.677s]
[INFO] Apache CloudStack Plugin - API Rate Limit ......... SUCCESS [8.915s]
[INFO] Apache CloudStack Plugin - API Discovery .......... SUCCESS [6.308s]
[INFO] Apache CloudStack Plugin - ACL Static Role Based .. SUCCESS [2.874s]
[INFO] Apache CloudStack Plugin - Host Anti-Affinity Processor  SUCCESS [3.157s]
[INFO] Apache CloudStack Plugin - Explicit Dedication Processor  SUCCESS [3.195s]
[INFO] Apache CloudStack Plugin - User Concentrated Pod Deployment Planner  SUCCESS [3.223s]
[INFO] Apache CloudStack Plugin - User Dispersing Deployment Planner  SUCCESS [3.268s]
[INFO] Apache CloudStack Plugin - Implicit Dedication Planner  SUCCESS [10.322s]
[INFO] Apache CloudStack Plugin - Skip Heurestics Planner  SUCCESS [2.856s]
[INFO] Apache CloudStack Plugin - Host Allocator Random .. SUCCESS [2.958s]
[INFO] Apache CloudStack Plugin - Dedicated Resources .... SUCCESS [9.492s]
[INFO] Apache CloudStack Plugin - Hypervisor OracleVM .... SUCCESS [4.646s]
[INFO] Apache CloudStack Plugin - Open vSwitch ........... SUCCESS [4.168s]
[INFO] Apache CloudStack Plugin - Hypervisor Xen ......... SUCCESS [13.182s]
[INFO] Apache CloudStack Plugin - Hypervisor KVM ......... SUCCESS [11.916s]
[INFO] Apache CloudStack Plugin - RabbitMQ Event Bus ..... SUCCESS [3.167s]
[INFO] Apache CloudStack Plugin - In Memory Event Bus .... SUCCESS [2.870s]
[INFO] Apache CloudStack Plugin - Hypervisor Baremetal ... SUCCESS [5.649s]
[INFO] Apache CloudStack Plugin - Hypervisor UCS ......... SUCCESS [4.758s]
[INFO] Apache CloudStack Plugin - Hypervisor Hyper-V ..... SUCCESS [7.135s]
[INFO] Apache CloudStack Plugin - Network Elastic Load Balancer  SUCCESS [4.634s]
[INFO] Apache CloudStack Plugin - Network Internal Load Balancer  SUCCESS [12.641s]
[INFO] Apache CloudStack Plugin - Network Juniper Contrail  SUCCESS [14.652s]
[INFO] Apache CloudStack Plugin - Palo Alto .............. SUCCESS [9.663s]
[INFO] Apache CloudStack Plugin - Network Nicira NVP ..... SUCCESS [11.071s]
[INFO] Apache CloudStack Plugin - BigSwitch Virtual Network Segment  SUCCESS [7.673s]
[INFO] Apache CloudStack Plugin - Midokura Midonet ....... SUCCESS [7.733s]
[INFO] Apache Cloudstack Plugin - Stratosphere SSP ....... SUCCESS [8.076s]
[INFO] Apache CloudStack Plugin - Network Opendaylight ... SUCCESS [7.458s]
[INFO] Apache CloudStack Plugin - Storage Allocator Random  SUCCESS [3.759s]
[INFO] Apache CloudStack Plugin - User Authenticator LDAP  SUCCESS [4.514s]
[INFO] Apache CloudStack Plugin - User Authenticator MD5 . SUCCESS [2.902s]
[INFO] Apache CloudStack Plugin - User Authenticator Plain Text  SUCCESS [4.672s]
[INFO] Apache CloudStack Plugin - User Authenticator SHA256 Salted  FAILURE [7.108s]
[INFO] Apache CloudStack Plugin - Dns Notifier Example ... SKIPPED
[INFO] Apache CloudStack Plugin - Storage Image S3 ....... SKIPPED
[INFO] Apache CloudStack Plugin - Storage Image Swift provider  SKIPPED
[INFO] Apache CloudStack Plugin - Storage Image default provider  SKIPPED
[INFO] Apache CloudStack Plugin - Storage Image sample provider  SKIPPED
[INFO] Apache CloudStack Plugin - Storage Volume Nexenta Provider  SKIPPED
[INFO] Apache CloudStack Plugin - Storage Volume SolidFire Provider  SKIPPED
[INFO] Apache CloudStack Plugin - Storage Volume default provider  SKIPPED
[INFO] Apache CloudStack Plugin - Storage Volume sample provider  SKIPPED
[INFO] Apache CloudStack Plugin - SNMP Alerts ............ SKIPPED
[INFO] Apache CloudStack Plugin - Syslog Alerts .......... SKIPPED
[INFO] Apache CloudStack Plugin - Network VXLAN .......... SKIPPED
[INFO] Apache CloudStack Framework - Spring Life Cycle ... SKIPPED
[INFO] cloud-framework-spring-module ..................... SKIPPED
[INFO] Apache CloudStack Test ............................ SKIPPED
[INFO] Apache CloudStack Console Proxy ................... SKIPPED
[INFO] Apache CloudStack Console Proxy - Server .......... SKIPPED
[INFO] Apache CloudStack System VM ....................... SKIPPED
[INFO] Apache CloudStack Client UI ....................... SKIPPED
[INFO] Apache CloudStack Console Proxy - RDP Client ...... SKIPPED
[INFO] Apache CloudStack Framework - QuickCloud .......... SKIPPED
[INFO] ------------------------------------------------------------------------
[INFO] BUILD FAILURE
[INFO] ------------------------------------------------------------------------
[INFO] Total time: 8:29.861s
[INFO] Finished at: Wed Jan 22 05:03:16 CET 2014
[INFO] Final Memory: 62M/159M
[INFO] ------------------------------------------------------------------------
[ERROR] Failed to execute goal org.apache.maven.plugins:maven-surefire-plugin:2.12:test (default-test)
on project cloud-plugin-user-authenticator-sha256salted: There are test failures.
[ERROR] 
[ERROR] Please refer to <http://jenkins.buildacloud.org/job/build-master/ws/plugins/user-authenticators/sha256salted/target/surefire-reports>
for the individual test results.
[ERROR] -> [Help 1]
[ERROR] 
[ERROR] To see the full stack trace of the errors, re-run Maven with the -e switch.
[ERROR] Re-run Maven using the -X switch to enable full debug logging.
[ERROR] 
[ERROR] For more information about the errors and possible solutions, please read the following
articles:
[ERROR] [Help 1] http://cwiki.apache.org/confluence/display/MAVEN/MojoFailureException
[ERROR] 
[ERROR] After correcting the problems, you can resume the build with the command
[ERROR]   mvn <goals> -rf :cloud-plugin-user-authenticator-sha256salted
Build step 'Invoke top-level Maven targets' marked build as failure

Mime
View raw message