cloudstack-dev mailing list archives

Site index · List index
Message view « Date » · « Thread »
Top « Date » · « Thread »
From jenk...@cloudstack.org
Subject Build failed in Jenkins: build-master-noredist #2176
Date Tue, 28 Jan 2014 11:05:54 GMT
See <http://jenkins.buildacloud.org/job/build-master-noredist/2176/>

------------------------------------------
[...truncated 7927 lines...]
91 KB   
95 KB   
99 KB   
103 KB   
107 KB   
111 KB   
112 KB   
Jan 28, 2014 12:04:00 PM org.apache.maven.wagon.providers.http.httpclient.client.protocol.ResponseProcessCookies
processCookies
WARNING: Invalid cookie header: "Set-Cookie:  django_language=en-us; expires=time.struct_time(tm_year=2015,
tm_mon=1, tm_mday=28, tm_hour=6, tm_min=4, tm_sec=6, tm_wday=2, tm_yday=28, tm_isdst=0); Max-Age=31536000;
Path=/". Unable to parse expires attribute: time.struct_time(tm_year=2015, tm_mon=1, tm_mday=28,
tm_hour=6, tm_min=4, tm_sec=6, tm_wday=2, tm_yday=28, tm_isdst=0)
Jan 28, 2014 12:04:00 PM org.apache.maven.wagon.providers.http.httpclient.client.protocol.ResponseProcessCookies
processCookies
WARNING: Invalid cookie header: "Set-Cookie:  django_language=en-us; expires=time.struct_time(tm_year=2015,
tm_mon=1, tm_mday=28, tm_hour=6, tm_min=4, tm_sec=6, tm_wday=2, tm_yday=28, tm_isdst=0); Max-Age=31536000;
Path=/". Unable to parse expires attribute: time.struct_time(tm_year=2015, tm_mon=1, tm_mday=28,
tm_hour=6, tm_min=4, tm_sec=6, tm_wday=2, tm_yday=28, tm_isdst=0)
Jan 28, 2014 12:04:00 PM org.apache.maven.wagon.providers.http.httpclient.client.protocol.ResponseProcessCookies
processCookies
WARNING: Invalid cookie header: "Set-Cookie:  django_language=en-us; expires=time.struct_time(tm_year=2015,
tm_mon=1, tm_mday=28, tm_hour=6, tm_min=4, tm_sec=6, tm_wday=2, tm_yday=28, tm_isdst=0); Max-Age=31536000;
Path=/". Unable to parse expires attribute: time.struct_time(tm_year=2015, tm_mon=1, tm_mday=28,
tm_hour=6, tm_min=4, tm_sec=6, tm_wday=2, tm_yday=28, tm_isdst=0)
[WARNING] Checksum validation failed, expected <!DOCTYPE but is 97233c537f442e8847a66d8a2d49fa0ef2cfc60b
for http://shibboleth.internet2.edu/downloads/maven2/bouncycastle/bcprov-jdk14/140/bcprov-jdk14-140.jar
Jan 28, 2014 12:04:01 PM org.apache.maven.wagon.providers.http.httpclient.client.protocol.ResponseProcessCookies
processCookies
WARNING: Invalid cookie header: "Set-Cookie:  django_language=en; expires=time.struct_time(tm_year=2015,
tm_mon=1, tm_mday=28, tm_hour=6, tm_min=4, tm_sec=7, tm_wday=2, tm_yday=28, tm_isdst=0); Max-Age=31536000;
Path=/". Unable to parse expires attribute: time.struct_time(tm_year=2015, tm_mon=1, tm_mday=28,
tm_hour=6, tm_min=4, tm_sec=7, tm_wday=2, tm_yday=28, tm_isdst=0)
Jan 28, 2014 12:04:01 PM org.apache.maven.wagon.providers.http.httpclient.client.protocol.ResponseProcessCookies
processCookies
WARNING: Invalid cookie header: "Set-Cookie:  django_language=en-us; expires=time.struct_time(tm_year=2015,
tm_mon=1, tm_mday=28, tm_hour=6, tm_min=4, tm_sec=7, tm_wday=2, tm_yday=28, tm_isdst=0); Max-Age=31536000;
Path=/". Unable to parse expires attribute: time.struct_time(tm_year=2015, tm_mon=1, tm_mday=28,
tm_hour=6, tm_min=4, tm_sec=7, tm_wday=2, tm_yday=28, tm_isdst=0)
Jan 28, 2014 12:04:02 PM org.apache.maven.wagon.providers.http.httpclient.client.protocol.ResponseProcessCookies
processCookies
WARNING: Invalid cookie header: "Set-Cookie:  django_language=en-us; expires=time.struct_time(tm_year=2015,
tm_mon=1, tm_mday=28, tm_hour=6, tm_min=4, tm_sec=8, tm_wday=2, tm_yday=28, tm_isdst=0); Max-Age=31536000;
Path=/". Unable to parse expires attribute: time.struct_time(tm_year=2015, tm_mon=1, tm_mday=28,
tm_hour=6, tm_min=4, tm_sec=8, tm_wday=2, tm_yday=28, tm_isdst=0)
867 B    
5 KB    
9 KB   
13 KB   
14 KB   
17 KB   
21 KB   
25 KB   
29 KB   
33 KB   
37 KB   
41 KB   
42 KB   
46 KB   
50 KB   
54 KB   
58 KB   
62 KB   
66 KB   
70 KB   
74 KB   
78 KB   
82 KB   
86 KB   
90 KB   
94 KB   
98 KB   
102 KB   
106 KB   
110 KB   
112 KB   
Jan 28, 2014 12:04:03 PM org.apache.maven.wagon.providers.http.httpclient.client.protocol.ResponseProcessCookies
processCookies
WARNING: Invalid cookie header: "Set-Cookie:  django_language=en-us; expires=time.struct_time(tm_year=2015,
tm_mon=1, tm_mday=28, tm_hour=6, tm_min=4, tm_sec=9, tm_wday=2, tm_yday=28, tm_isdst=0); Max-Age=31536000;
Path=/". Unable to parse expires attribute: time.struct_time(tm_year=2015, tm_mon=1, tm_mday=28,
tm_hour=6, tm_min=4, tm_sec=9, tm_wday=2, tm_yday=28, tm_isdst=0)
Jan 28, 2014 12:04:03 PM org.apache.maven.wagon.providers.http.httpclient.client.protocol.ResponseProcessCookies
processCookies
WARNING: Invalid cookie header: "Set-Cookie:  django_language=en-us; expires=time.struct_time(tm_year=2015,
tm_mon=1, tm_mday=28, tm_hour=6, tm_min=4, tm_sec=9, tm_wday=2, tm_yday=28, tm_isdst=0); Max-Age=31536000;
Path=/". Unable to parse expires attribute: time.struct_time(tm_year=2015, tm_mon=1, tm_mday=28,
tm_hour=6, tm_min=4, tm_sec=9, tm_wday=2, tm_yday=28, tm_isdst=0)
Jan 28, 2014 12:04:03 PM org.apache.maven.wagon.providers.http.httpclient.client.protocol.ResponseProcessCookies
processCookies
WARNING: Invalid cookie header: "Set-Cookie:  django_language=en-us; expires=time.struct_time(tm_year=2015,
tm_mon=1, tm_mday=28, tm_hour=6, tm_min=4, tm_sec=9, tm_wday=2, tm_yday=28, tm_isdst=0); Max-Age=31536000;
Path=/". Unable to parse expires attribute: time.struct_time(tm_year=2015, tm_mon=1, tm_mday=28,
tm_hour=6, tm_min=4, tm_sec=9, tm_wday=2, tm_yday=28, tm_isdst=0)
[WARNING] Checksum validation failed, expected <!DOCTYPE but is 97233c537f442e8847a66d8a2d49fa0ef2cfc60b
for http://shibboleth.internet2.edu/downloads/maven2/bouncycastle/bcprov-jdk14/140/bcprov-jdk14-140.jar
         
Downloaded: http://shibboleth.internet2.edu/downloads/maven2/bouncycastle/bcprov-jdk14/140/bcprov-jdk14-140.jar
(112 KB at 17.7 KB/sec)
[INFO] 
[INFO] --- maven-clean-plugin:2.5:clean (default-clean) @ cloud-awsapi ---
[INFO] Deleting <http://jenkins.buildacloud.org/job/build-master-noredist/ws/awsapi/target>
(includes = [**/*], excludes = [])
[INFO] Deleting <http://jenkins.buildacloud.org/job/build-master-noredist/ws/awsapi>
(includes = [target, dist], excludes = [])
[INFO] 
[INFO] --- maven-remote-resources-plugin:1.3:process (default) @ cloud-awsapi ---
[WARNING] Invalid POM for org.apache.rampart:rampart-policy:jar:1.5.1, transitive dependencies
(if any) will not be available, enable debug logging for more details
[WARNING] Invalid POM for org.apache.rampart:rampart-trust:jar:1.5.1, transitive dependencies
(if any) will not be available, enable debug logging for more details
[WARNING] Invalid POM for org.apache.axis2:axis2-kernel:jar:1.5.4, transitive dependencies
(if any) will not be available, enable debug logging for more details
[WARNING] Invalid POM for org.apache.axis2:mex:jar:impl:1.5.4, transitive dependencies (if
any) will not be available, enable debug logging for more details
[WARNING] Invalid POM for org.apache.axis2:axis2-mtompolicy:jar:1.5.4, transitive dependencies
(if any) will not be available, enable debug logging for more details
[WARNING] Invalid POM for org.apache.axis2:addressing:mar:1.5.4, transitive dependencies (if
any) will not be available, enable debug logging for more details
[WARNING] Invalid POM for org.apache.ws.commons.axiom:axiom-dom:jar:1.2.10, transitive dependencies
(if any) will not be available, enable debug logging for more details
[WARNING] Invalid POM for org.apache.ws.security:wss4j:jar:1.5.10, transitive dependencies
(if any) will not be available, enable debug logging for more details
[WARNING] Invalid POM for org.apache.santuario:xmlsec:jar:1.4.2, transitive dependencies (if
any) will not be available, enable debug logging for more details
[WARNING] Invalid POM for org.opensaml:opensaml:jar:2.2.3, transitive dependencies (if any)
will not be available, enable debug logging for more details
[WARNING] Invalid POM for org.slf4j:slf4j-jdk14:jar:1.5.2, transitive dependencies (if any)
will not be available, enable debug logging for more details
[WARNING] Invalid POM for commons-lang:commons-lang:jar:2.3, transitive dependencies (if any)
will not be available, enable debug logging for more details
[WARNING] Invalid POM for org.apache.rampart:rampart-policy:jar:1.5.1, transitive dependencies
(if any) will not be available, enable debug logging for more details
[WARNING] Invalid POM for org.apache.rampart:rampart-trust:jar:1.5.1, transitive dependencies
(if any) will not be available, enable debug logging for more details
[WARNING] Invalid POM for org.apache.axis2:axis2-kernel:jar:1.5.4, transitive dependencies
(if any) will not be available, enable debug logging for more details
[WARNING] Invalid POM for org.apache.axis2:mex:jar:impl:1.5.4, transitive dependencies (if
any) will not be available, enable debug logging for more details
[WARNING] Invalid POM for org.apache.axis2:axis2-mtompolicy:jar:1.5.4, transitive dependencies
(if any) will not be available, enable debug logging for more details
[WARNING] Invalid POM for org.apache.axis2:addressing:mar:1.5.4, transitive dependencies (if
any) will not be available, enable debug logging for more details
[WARNING] Invalid POM for org.apache.ws.commons.axiom:axiom-dom:jar:1.2.10, transitive dependencies
(if any) will not be available, enable debug logging for more details
[WARNING] Invalid POM for org.apache.ws.security:wss4j:jar:1.5.10, transitive dependencies
(if any) will not be available, enable debug logging for more details
[WARNING] Invalid POM for org.apache.santuario:xmlsec:jar:1.4.2, transitive dependencies (if
any) will not be available, enable debug logging for more details
[WARNING] Invalid POM for org.opensaml:opensaml:jar:2.2.3, transitive dependencies (if any)
will not be available, enable debug logging for more details
[WARNING] Invalid POM for org.slf4j:slf4j-jdk14:jar:1.5.2, transitive dependencies (if any)
will not be available, enable debug logging for more details
[WARNING] Invalid POM for commons-lang:commons-lang:jar:2.3, transitive dependencies (if any)
will not be available, enable debug logging for more details
[WARNING] Invalid POM for bouncycastle:bcprov-jdk14:jar:140, transitive dependencies (if any)
will not be available, enable debug logging for more details
[WARNING] Invalid POM for org.apache.rampart:rampart-policy:jar:1.5.1, transitive dependencies
(if any) will not be available, enable debug logging for more details
[WARNING] Invalid POM for org.apache.rampart:rampart-trust:jar:1.5.1, transitive dependencies
(if any) will not be available, enable debug logging for more details
[WARNING] Invalid POM for org.apache.santuario:xmlsec:jar:1.4.2, transitive dependencies (if
any) will not be available, enable debug logging for more details
[WARNING] Invalid project model for artifact [addressing:org.apache.axis2:1.5.4]. It will
be ignored by the remote resources Mojo.
[WARNING] Invalid project model for artifact [bcprov-jdk14:bouncycastle:140]. It will be ignored
by the remote resources Mojo.
[WARNING] Invalid project model for artifact [commons-lang:commons-lang:2.3]. It will be ignored
by the remote resources Mojo.
[WARNING] Invalid project model for artifact [rampart-trust:org.apache.rampart:1.5.1]. It
will be ignored by the remote resources Mojo.
[WARNING] Invalid project model for artifact [rampart-policy:org.apache.rampart:1.5.1]. It
will be ignored by the remote resources Mojo.
[WARNING] Invalid project model for artifact [xmlsec:org.apache.santuario:1.4.2]. It will
be ignored by the remote resources Mojo.
[WARNING] Invalid project model for artifact [mex:org.apache.axis2:1.5.4]. It will be ignored
by the remote resources Mojo.
[WARNING] Invalid project model for artifact [axiom-dom:org.apache.ws.commons.axiom:1.2.10].
It will be ignored by the remote resources Mojo.
[WARNING] Invalid project model for artifact [axis2-mtompolicy:org.apache.axis2:1.5.4]. It
will be ignored by the remote resources Mojo.
[INFO] 
[INFO] --- maven-antrun-plugin:1.7:run (generate-resource) @ cloud-awsapi ---
[INFO] Executing tasks

main:
     [copy] Copying 3 files to <http://jenkins.buildacloud.org/job/build-master-noredist/ws/awsapi/target/generated-webapp/WEB-INF/classes>
[INFO] Executed tasks
[INFO] 
[INFO] --- maven-resources-plugin:2.5:resources (default-resources) @ cloud-awsapi ---
[debug] execute contextualize
[INFO] Using 'UTF-8' encoding to copy filtered resources.
[INFO] Copying 2 resources
[INFO] Copying 2 resources
[INFO] Copying 3 resources
[INFO] Copying 3 resources
[INFO] 
[INFO] --- maven-compiler-plugin:2.5.1:compile (default-compile) @ cloud-awsapi ---
[INFO] Compiling 1295 source files to <http://jenkins.buildacloud.org/job/build-master-noredist/ws/awsapi/target/classes>
[INFO] -------------------------------------------------------------
[ERROR] COMPILATION ERROR : 
[INFO] -------------------------------------------------------------
[ERROR] error: error reading /jenkins/.m2/repository/org/apache/axis2/mex/1.5.4/mex-1.5.4-impl.jar;
error in opening zip file
[ERROR] error: error reading /jenkins/.m2/repository/org/apache/axis2/axis2-mtompolicy/1.5.4/axis2-mtompolicy-1.5.4.jar;
error in opening zip file
[ERROR] error: error reading /jenkins/.m2/repository/org/apache/ws/commons/axiom/axiom-dom/1.2.10/axiom-dom-1.2.10.jar;
error in opening zip file
[ERROR] error: error reading /jenkins/.m2/repository/commons-lang/commons-lang/2.3/commons-lang-2.3.jar;
error in opening zip file
[INFO] 4 errors 
[INFO] -------------------------------------------------------------
[INFO] ------------------------------------------------------------------------
[INFO] Reactor Summary:
[INFO] 
[INFO] Apache CloudStack Developer Tools - Checkstyle Configuration  SUCCESS [2.267s]
[INFO] Apache CloudStack ................................. SUCCESS [3.273s]
[INFO] Apache CloudStack Maven Conventions Parent ........ SUCCESS [1.712s]
[INFO] Apache CloudStack Framework - Managed Context ..... SUCCESS [4.886s]
[INFO] Apache CloudStack Utils ........................... SUCCESS [17.970s]
[INFO] Apache CloudStack Framework ....................... SUCCESS [1.859s]
[INFO] Apache CloudStack Framework - Event Notification .. SUCCESS [10.894s]
[INFO] Apache CloudStack Framework - Configuration ....... SUCCESS [5.374s]
[INFO] Apache CloudStack API ............................. SUCCESS [22.334s]
[INFO] Apache CloudStack Framework - REST ................ SUCCESS [3.156s]
[INFO] Apache CloudStack Framework - IPC ................. SUCCESS [7.452s]
[INFO] Apache CloudStack Cloud Engine .................... SUCCESS [4.587s]
[INFO] Apache CloudStack Cloud Engine API ................ SUCCESS [5.958s]
[INFO] Apache CloudStack Framework - Security ............ SUCCESS [3.300s]
[INFO] Apache CloudStack Core ............................ SUCCESS [13.380s]
[INFO] Apache CloudStack Agents .......................... SUCCESS [9.051s]
[INFO] Apache CloudStack Framework - Clustering .......... SUCCESS [4.250s]
[INFO] Apache CloudStack Framework - Jobs ................ SUCCESS [5.437s]
[INFO] Apache CloudStack Cloud Engine Schema Component ... SUCCESS [17.036s]
[INFO] Apache CloudStack Framework - Event Notification .. SUCCESS [2.238s]
[INFO] Apache CloudStack Cloud Engine Internal Components API  SUCCESS [6.527s]
[INFO] Apache CloudStack Server .......................... SUCCESS [1:04.394s]
[INFO] Apache CloudStack Usage Server .................... SUCCESS [9.030s]
[INFO] Apache XenSource XAPI ............................. SUCCESS [9.623s]
[INFO] Apache CloudStack Cloud Engine Orchestration Component  SUCCESS [14.170s]
[INFO] Apache CloudStack Cloud Services .................. SUCCESS [1.572s]
[INFO] Apache CloudStack Secondary Storage Service ....... SUCCESS [8.608s]
[INFO] Apache CloudStack Engine Storage Component ........ SUCCESS [9.480s]
[INFO] Apache CloudStack Engine Storage Volume Component . SUCCESS [5.832s]
[INFO] Apache CloudStack Engine Storage Image Component .. SUCCESS [5.208s]
[INFO] Apache CloudStack Engine Storage Data Motion Component  SUCCESS [3.260s]
[INFO] Apache CloudStack Engine Storage Cache Component .. SUCCESS [3.137s]
[INFO] Apache CloudStack Engine Storage Snapshot Component  SUCCESS [9.637s]
[INFO] Apache CloudStack Cloud Engine API ................ SUCCESS [4.206s]
[INFO] Apache CloudStack Cloud Engine Service ............ SUCCESS [4.981s]
[INFO] Apache CloudStack Plugin POM ...................... SUCCESS [3.541s]
[INFO] Apache CloudStack Plugin - API Rate Limit ......... SUCCESS [8.044s]
[INFO] Apache CloudStack Plugin - API Discovery .......... SUCCESS [5.687s]
[INFO] Apache CloudStack Plugin - ACL Static Role Based .. SUCCESS [2.822s]
[INFO] Apache CloudStack Plugin - Host Anti-Affinity Processor  SUCCESS [2.873s]
[INFO] Apache CloudStack Plugin - Explicit Dedication Processor  SUCCESS [3.130s]
[INFO] Apache CloudStack Plugin - User Concentrated Pod Deployment Planner  SUCCESS [2.862s]
[INFO] Apache CloudStack Plugin - User Dispersing Deployment Planner  SUCCESS [3.347s]
[INFO] Apache CloudStack Plugin - Implicit Dedication Planner  SUCCESS [9.435s]
[INFO] Apache CloudStack Plugin - Skip Heurestics Planner  SUCCESS [2.853s]
[INFO] Apache CloudStack Plugin - Host Allocator Random .. SUCCESS [2.893s]
[INFO] Apache CloudStack Plugin - Dedicated Resources .... SUCCESS [8.972s]
[INFO] Apache CloudStack Plugin - Hypervisor OracleVM .... SUCCESS [4.544s]
[INFO] Apache CloudStack Plugin - Open vSwitch ........... SUCCESS [4.031s]
[INFO] Apache CloudStack Plugin - Hypervisor Xen ......... SUCCESS [14.307s]
[INFO] Apache CloudStack Plugin - Hypervisor KVM ......... SUCCESS [12.507s]
[INFO] Apache CloudStack Plugin - RabbitMQ Event Bus ..... SUCCESS [3.329s]
[INFO] Apache CloudStack Plugin - In Memory Event Bus .... SUCCESS [2.989s]
[INFO] Apache CloudStack Plugin - Hypervisor Baremetal ... SUCCESS [6.300s]
[INFO] Apache CloudStack Plugin - Hypervisor UCS ......... SUCCESS [3.564s]
[INFO] Apache CloudStack Plugin - Hypervisor Hyper-V ..... SUCCESS [8.282s]
[INFO] Apache CloudStack Plugin - Network Elastic Load Balancer  SUCCESS [4.081s]
[INFO] Apache CloudStack Plugin - Network Internal Load Balancer  SUCCESS [12.184s]
[INFO] Apache CloudStack Framework - Spring Life Cycle ... SUCCESS [2.761s]
[INFO] Apache CloudStack Plugin - Network Juniper Contrail  SUCCESS [13.853s]
[INFO] Apache CloudStack Plugin - Palo Alto .............. SUCCESS [9.101s]
[INFO] Apache CloudStack Plugin - Network Nicira NVP ..... SUCCESS [12.045s]
[INFO] Apache CloudStack Plugin - BigSwitch Virtual Network Segment  SUCCESS [7.369s]
[INFO] Apache CloudStack Plugin - Midokura Midonet ....... SUCCESS [7.559s]
[INFO] Apache CloudStack Plugin - Stratosphere SSP ....... SUCCESS [7.540s]
[INFO] Apache CloudStack Plugin - Network Opendaylight ... SUCCESS [7.836s]
[INFO] Apache CloudStack Plugin - Storage Allocator Random  SUCCESS [3.510s]
[INFO] Apache CloudStack Plugin - User Authenticator LDAP  SUCCESS [4.310s]
[INFO] Apache CloudStack Plugin - User Authenticator MD5 . SUCCESS [2.955s]
[INFO] Apache CloudStack Plugin - User Authenticator Plain Text  SUCCESS [3.030s]
[INFO] Apache CloudStack Plugin - User Authenticator SHA256 Salted  SUCCESS [5.504s]
[INFO] Apache CloudStack Plugin - Dns Notifier Example ... SUCCESS [2.612s]
[INFO] Apache CloudStack Plugin - Storage Image S3 ....... SUCCESS [3.295s]
[INFO] Apache CloudStack Plugin - Storage Image Swift provider  SUCCESS [2.833s]
[INFO] Apache CloudStack Plugin - Storage Image default provider  SUCCESS [2.554s]
[INFO] Apache CloudStack Plugin - Storage Image sample provider  SUCCESS [2.461s]
[INFO] Apache CloudStack Plugin - Storage Volume Nexenta Provider  SUCCESS [5.455s]
[INFO] Apache CloudStack Plugin - Storage Volume SolidFire Provider  SUCCESS [6.277s]
[INFO] Apache CloudStack Plugin - Storage Volume default provider  SUCCESS [2.809s]
[INFO] Apache CloudStack Plugin - Storage Volume sample provider  SUCCESS [2.605s]
[INFO] Apache CloudStack Plugin - SNMP Alerts ............ SUCCESS [5.505s]
[INFO] Apache CloudStack Plugin - Syslog Alerts .......... SUCCESS [4.803s]
[INFO] Apache CloudStack Plugin - Network VXLAN .......... SUCCESS [5.985s]
[INFO] Apache CloudStack Framework - Spring Module ....... SUCCESS [9.077s]
[INFO] Apache CloudStack Console Proxy - RDP Client ...... SUCCESS [9.739s]
[INFO] Apache CloudStack Console Proxy ................... SUCCESS [0.234s]
[INFO] Apache CloudStack Console Proxy - Server .......... SUCCESS [4.428s]
[INFO] Apache CloudStack System VM ....................... SUCCESS [8.481s]
[INFO] Apache CloudStack Client UI ....................... SUCCESS [11.836s]
[INFO] Apache CloudStack Framework - QuickCloud .......... SUCCESS [0.447s]
[INFO] Apache CloudStack AWS API Bridge .................. FAILURE [1:32.196s]
[INFO] ------------------------------------------------------------------------
[INFO] BUILD FAILURE
[INFO] ------------------------------------------------------------------------
[INFO] Total time: 11:53.719s
[INFO] Finished at: Tue Jan 28 12:04:11 CET 2014
[INFO] Final Memory: 88M/212M
[INFO] ------------------------------------------------------------------------
[ERROR] Failed to execute goal org.apache.maven.plugins:maven-compiler-plugin:2.5.1:compile
(default-compile) on project cloud-awsapi: Compilation failure: Compilation failure:
[ERROR] error: error reading /jenkins/.m2/repository/org/apache/axis2/mex/1.5.4/mex-1.5.4-impl.jar;
error in opening zip file
[ERROR] error: error reading /jenkins/.m2/repository/org/apache/axis2/axis2-mtompolicy/1.5.4/axis2-mtompolicy-1.5.4.jar;
error in opening zip file
[ERROR] error: error reading /jenkins/.m2/repository/org/apache/ws/commons/axiom/axiom-dom/1.2.10/axiom-dom-1.2.10.jar;
error in opening zip file
[ERROR] error: error reading /jenkins/.m2/repository/commons-lang/commons-lang/2.3/commons-lang-2.3.jar;
error in opening zip file
[ERROR] -> [Help 1]
[ERROR] 
[ERROR] To see the full stack trace of the errors, re-run Maven with the -e switch.
[ERROR] Re-run Maven using the -X switch to enable full debug logging.
[ERROR] 
[ERROR] For more information about the errors and possible solutions, please read the following
articles:
[ERROR] [Help 1] http://cwiki.apache.org/confluence/display/MAVEN/MojoFailureException
[ERROR] 
[ERROR] After correcting the problems, you can resume the build with the command
[ERROR]   mvn <goals> -rf :cloud-awsapi
Build step 'Invoke top-level Maven targets' marked build as failure
Archiving artifacts
Skipping Cobertura coverage report as build was not SUCCESS or better ...

Mime
View raw message